hive-issues mailing list archives

Site index · List index
Message view « Date » · « Thread »
Top « Date » · « Thread »
From "Hive QA (JIRA)" <j...@apache.org>
Subject [jira] [Commented] (HIVE-10330) Merge trunk to spark 4/14/2015 [Spark Branch]
Date Tue, 14 Apr 2015 20:24:59 GMT

    [ https://issues.apache.org/jira/browse/HIVE-10330?page=com.atlassian.jira.plugin.system.issuetabpanels:comment-tabpanel&focusedCommentId=14494796#comment-14494796
] 

Hive QA commented on HIVE-10330:
--------------------------------



{color:red}Overall{color}: -1 no tests executed

Here are the results of testing the latest attachment:
https://issues.apache.org/jira/secure/attachment/12725368/HIVE-10330-spark.patch

Test results: http://ec2-174-129-184-35.compute-1.amazonaws.com/jenkins/job/PreCommit-HIVE-SPARK-Build/828/testReport
Console output: http://ec2-174-129-184-35.compute-1.amazonaws.com/jenkins/job/PreCommit-HIVE-SPARK-Build/828/console
Test logs: http://ec2-50-18-27-0.us-west-1.compute.amazonaws.com/logs/PreCommit-HIVE-SPARK-Build-828/

Messages:
{noformat}
**** This message was trimmed, see log for full details ****
[INFO] Hive Accumulo Handler ............................. SKIPPED
[INFO] Hive JDBC ......................................... SKIPPED
[INFO] Hive Beeline ...................................... SKIPPED
[INFO] Hive CLI .......................................... SKIPPED
[INFO] Hive Contrib ...................................... SKIPPED
[INFO] Hive HBase Handler ................................ SKIPPED
[INFO] Hive HCatalog ..................................... SKIPPED
[INFO] Hive HCatalog Core ................................ SKIPPED
[INFO] Hive HCatalog Pig Adapter ......................... SKIPPED
[INFO] Hive HCatalog Server Extensions ................... SKIPPED
[INFO] Hive HCatalog Webhcat Java Client ................. SKIPPED
[INFO] Hive HCatalog Webhcat ............................. SKIPPED
[INFO] Hive HCatalog Streaming ........................... SKIPPED
[INFO] Hive HWI .......................................... SKIPPED
[INFO] Hive ODBC ......................................... SKIPPED
[INFO] Hive Shims Aggregator ............................. SKIPPED
[INFO] Hive TestUtils .................................... SKIPPED
[INFO] Hive Packaging .................................... SKIPPED
[INFO] ------------------------------------------------------------------------
[INFO] BUILD FAILURE
[INFO] ------------------------------------------------------------------------
[INFO] Total time: 29.797s
[INFO] Finished at: Tue Apr 14 16:32:06 EDT 2015
[INFO] Final Memory: 69M/729M
[INFO] ------------------------------------------------------------------------
[ERROR] Failed to execute goal org.apache.maven.plugins:maven-compiler-plugin:3.1:testCompile
(default-testCompile) on project hive-serde: Compilation failure: Compilation failure:
[ERROR] /data/hive-ptest/working/apache-svn-spark-source/serde/src/test/org/apache/hadoop/hive/serde2/binarysortable/TestBinarySortableSerDe.java:[35,73]
package org.apache.hadoop.hive.serde2.binarysortable.MyTestPrimitiveClass does not exist
[ERROR] /data/hive-ptest/working/apache-svn-spark-source/serde/src/test/org/apache/hadoop/hive/serde2/lazybinary/TestLazyBinarySerDe.java:[39,52]
cannot find symbol
[ERROR] symbol:   class MyTestPrimitiveClass
[ERROR] location: package org.apache.hadoop.hive.serde2.binarysortable
[ERROR] /data/hive-ptest/working/apache-svn-spark-source/serde/src/test/org/apache/hadoop/hive/serde2/lazybinary/TestLazyBinarySerDe.java:[41,73]
package org.apache.hadoop.hive.serde2.binarysortable.MyTestPrimitiveClass does not exist
[ERROR] /data/hive-ptest/working/apache-svn-spark-source/serde/src/test/org/apache/hadoop/hive/serde2/TestStatsSerde.java:[33,52]
cannot find symbol
[ERROR] symbol:   class MyTestPrimitiveClass
[ERROR] location: package org.apache.hadoop.hive.serde2.binarysortable
[ERROR] /data/hive-ptest/working/apache-svn-spark-source/serde/src/test/org/apache/hadoop/hive/serde2/TestStatsSerde.java:[35,73]
package org.apache.hadoop.hive.serde2.binarysortable.MyTestPrimitiveClass does not exist
[ERROR] /data/hive-ptest/working/apache-svn-spark-source/serde/src/test/org/apache/hadoop/hive/serde2/binarysortable/MyTestClass.java:[31,73]
package org.apache.hadoop.hive.serde2.binarysortable.MyTestPrimitiveClass does not exist
[ERROR] /data/hive-ptest/working/apache-svn-spark-source/serde/src/test/org/apache/hadoop/hive/serde2/binarysortable/MyTestClass.java:[61,37]
cannot find symbol
[ERROR] symbol:   class ExtraTypeInfo
[ERROR] location: class org.apache.hadoop.hive.serde2.binarysortable.MyTestClass
[ERROR] /data/hive-ptest/working/apache-svn-spark-source/serde/src/test/org/apache/hadoop/hive/serde2/lazybinary/MyTestClassSmaller.java:[31,52]
cannot find symbol
[ERROR] symbol:   class MyTestPrimitiveClass
[ERROR] location: package org.apache.hadoop.hive.serde2.binarysortable
[ERROR] /data/hive-ptest/working/apache-svn-spark-source/serde/src/test/org/apache/hadoop/hive/serde2/lazybinary/MyTestClassSmaller.java:[32,73]
package org.apache.hadoop.hive.serde2.binarysortable.MyTestPrimitiveClass does not exist
[ERROR] /data/hive-ptest/working/apache-svn-spark-source/serde/src/test/org/apache/hadoop/hive/serde2/lazybinary/MyTestClassSmaller.java:[57,37]
cannot find symbol
[ERROR] symbol:   class ExtraTypeInfo
[ERROR] location: class org.apache.hadoop.hive.serde2.lazybinary.MyTestClassSmaller
[ERROR] /data/hive-ptest/working/apache-svn-spark-source/serde/src/test/org/apache/hadoop/hive/serde2/lazybinary/MyTestClassBigger.java:[35,52]
cannot find symbol
[ERROR] symbol:   class MyTestPrimitiveClass
[ERROR] location: package org.apache.hadoop.hive.serde2.binarysortable
[ERROR] /data/hive-ptest/working/apache-svn-spark-source/serde/src/test/org/apache/hadoop/hive/serde2/lazybinary/MyTestClassBigger.java:[37,73]
package org.apache.hadoop.hive.serde2.binarysortable.MyTestPrimitiveClass does not exist
[ERROR] /data/hive-ptest/working/apache-svn-spark-source/serde/src/test/org/apache/hadoop/hive/serde2/lazybinary/MyTestClassBigger.java:[78,37]
cannot find symbol
[ERROR] symbol:   class ExtraTypeInfo
[ERROR] location: class org.apache.hadoop.hive.serde2.lazybinary.MyTestClassBigger
[ERROR] /data/hive-ptest/working/apache-svn-spark-source/serde/src/test/org/apache/hadoop/hive/serde2/binarysortable/TestBinarySortableSerDe.java:[152,9]
cannot find symbol
[ERROR] symbol:   class ExtraTypeInfo
[ERROR] location: class org.apache.hadoop.hive.serde2.binarysortable.TestBinarySortableSerDe
[ERROR] /data/hive-ptest/working/apache-svn-spark-source/serde/src/test/org/apache/hadoop/hive/serde2/binarysortable/TestBinarySortableSerDe.java:[152,43]
cannot find symbol
[ERROR] symbol:   class ExtraTypeInfo
[ERROR] location: class org.apache.hadoop.hive.serde2.binarysortable.TestBinarySortableSerDe
[ERROR] /data/hive-ptest/working/apache-svn-spark-source/serde/src/test/org/apache/hadoop/hive/serde2/lazybinary/TestLazyBinarySerDe.java:[200,7]
cannot find symbol
[ERROR] symbol:   class ExtraTypeInfo
[ERROR] location: class org.apache.hadoop.hive.serde2.lazybinary.TestLazyBinarySerDe
[ERROR] /data/hive-ptest/working/apache-svn-spark-source/serde/src/test/org/apache/hadoop/hive/serde2/lazybinary/TestLazyBinarySerDe.java:[200,41]
cannot find symbol
[ERROR] symbol:   class ExtraTypeInfo
[ERROR] location: class org.apache.hadoop.hive.serde2.lazybinary.TestLazyBinarySerDe
[ERROR] /data/hive-ptest/working/apache-svn-spark-source/serde/src/test/org/apache/hadoop/hive/serde2/lazybinary/TestLazyBinarySerDe.java:[243,7]
cannot find symbol
[ERROR] symbol:   class ExtraTypeInfo
[ERROR] location: class org.apache.hadoop.hive.serde2.lazybinary.TestLazyBinarySerDe
[ERROR] /data/hive-ptest/working/apache-svn-spark-source/serde/src/test/org/apache/hadoop/hive/serde2/lazybinary/TestLazyBinarySerDe.java:[243,41]
cannot find symbol
[ERROR] symbol:   class ExtraTypeInfo
[ERROR] location: class org.apache.hadoop.hive.serde2.lazybinary.TestLazyBinarySerDe
[ERROR] /data/hive-ptest/working/apache-svn-spark-source/serde/src/test/org/apache/hadoop/hive/serde2/lazybinary/TestLazyBinarySerDe.java:[286,7]
cannot find symbol
[ERROR] symbol:   class ExtraTypeInfo
[ERROR] location: class org.apache.hadoop.hive.serde2.lazybinary.TestLazyBinarySerDe
[ERROR] /data/hive-ptest/working/apache-svn-spark-source/serde/src/test/org/apache/hadoop/hive/serde2/lazybinary/TestLazyBinarySerDe.java:[286,41]
cannot find symbol
[ERROR] symbol:   class ExtraTypeInfo
[ERROR] location: class org.apache.hadoop.hive.serde2.lazybinary.TestLazyBinarySerDe
[ERROR] /data/hive-ptest/working/apache-svn-spark-source/serde/src/test/org/apache/hadoop/hive/serde2/lazybinary/TestLazyBinarySerDe.java:[330,7]
cannot find symbol
[ERROR] symbol:   class ExtraTypeInfo
[ERROR] location: class org.apache.hadoop.hive.serde2.lazybinary.TestLazyBinarySerDe
[ERROR] /data/hive-ptest/working/apache-svn-spark-source/serde/src/test/org/apache/hadoop/hive/serde2/lazybinary/TestLazyBinarySerDe.java:[330,41]
cannot find symbol
[ERROR] symbol:   class ExtraTypeInfo
[ERROR] location: class org.apache.hadoop.hive.serde2.lazybinary.TestLazyBinarySerDe
[ERROR] /data/hive-ptest/working/apache-svn-spark-source/serde/src/test/org/apache/hadoop/hive/serde2/lazybinary/TestLazyBinarySerDe.java:[378,22]
cannot find symbol
[ERROR] symbol:   variable MyTestPrimitiveClass
[ERROR] location: class org.apache.hadoop.hive.serde2.lazybinary.TestLazyBinarySerDe
[ERROR] /data/hive-ptest/working/apache-svn-spark-source/serde/src/test/org/apache/hadoop/hive/serde2/lazybinary/TestLazyBinarySerDe.java:[438,9]
cannot find symbol
[ERROR] symbol:   class ExtraTypeInfo
[ERROR] location: class org.apache.hadoop.hive.serde2.lazybinary.TestLazyBinarySerDe
[ERROR] /data/hive-ptest/working/apache-svn-spark-source/serde/src/test/org/apache/hadoop/hive/serde2/lazybinary/TestLazyBinarySerDe.java:[438,43]
cannot find symbol
[ERROR] symbol:   class ExtraTypeInfo
[ERROR] location: class org.apache.hadoop.hive.serde2.lazybinary.TestLazyBinarySerDe
[ERROR] /data/hive-ptest/working/apache-svn-spark-source/serde/src/test/org/apache/hadoop/hive/serde2/TestStatsSerde.java:[112,9]
cannot find symbol
[ERROR] symbol:   class ExtraTypeInfo
[ERROR] location: class org.apache.hadoop.hive.serde2.TestStatsSerde
[ERROR] /data/hive-ptest/working/apache-svn-spark-source/serde/src/test/org/apache/hadoop/hive/serde2/TestStatsSerde.java:[112,43]
cannot find symbol
[ERROR] symbol:   class ExtraTypeInfo
[ERROR] location: class org.apache.hadoop.hive.serde2.TestStatsSerde
[ERROR] /data/hive-ptest/working/apache-svn-spark-source/serde/src/test/org/apache/hadoop/hive/serde2/binarysortable/MyTestClass.java:[74,50]
cannot find symbol
[ERROR] symbol:   variable MyTestPrimitiveClass
[ERROR] location: class org.apache.hadoop.hive.serde2.binarysortable.MyTestClass
[ERROR] /data/hive-ptest/working/apache-svn-spark-source/serde/src/test/org/apache/hadoop/hive/serde2/binarysortable/MyTestClass.java:[75,52]
cannot find symbol
[ERROR] symbol:   variable MyTestPrimitiveClass
[ERROR] location: class org.apache.hadoop.hive.serde2.binarysortable.MyTestClass
[ERROR] /data/hive-ptest/working/apache-svn-spark-source/serde/src/test/org/apache/hadoop/hive/serde2/binarysortable/MyTestClass.java:[76,55]
cannot find symbol
[ERROR] symbol:   variable MyTestPrimitiveClass
[ERROR] location: class org.apache.hadoop.hive.serde2.binarysortable.MyTestClass
[ERROR] /data/hive-ptest/working/apache-svn-spark-source/serde/src/test/org/apache/hadoop/hive/serde2/binarysortable/MyTestClass.java:[77,18]
cannot find symbol
[ERROR] symbol:   variable MyTestPrimitiveClass
[ERROR] location: class org.apache.hadoop.hive.serde2.binarysortable.MyTestClass
[ERROR] /data/hive-ptest/working/apache-svn-spark-source/serde/src/test/org/apache/hadoop/hive/serde2/binarysortable/MyTestClass.java:[78,51]
cannot find symbol
[ERROR] symbol:   variable MyTestPrimitiveClass
[ERROR] location: class org.apache.hadoop.hive.serde2.binarysortable.MyTestClass
[ERROR] /data/hive-ptest/working/apache-svn-spark-source/serde/src/test/org/apache/hadoop/hive/serde2/binarysortable/MyTestClass.java:[79,48]
cannot find symbol
[ERROR] symbol:   variable MyTestPrimitiveClass
[ERROR] location: class org.apache.hadoop.hive.serde2.binarysortable.MyTestClass
[ERROR] /data/hive-ptest/working/apache-svn-spark-source/serde/src/test/org/apache/hadoop/hive/serde2/binarysortable/MyTestClass.java:[80,53]
cannot find symbol
[ERROR] symbol:   variable MyTestPrimitiveClass
[ERROR] location: class org.apache.hadoop.hive.serde2.binarysortable.MyTestClass
[ERROR] /data/hive-ptest/working/apache-svn-spark-source/serde/src/test/org/apache/hadoop/hive/serde2/binarysortable/MyTestClass.java:[81,61]
cannot find symbol
[ERROR] symbol:   variable MyTestPrimitiveClass
[ERROR] location: class org.apache.hadoop.hive.serde2.binarysortable.MyTestClass
[ERROR] /data/hive-ptest/working/apache-svn-spark-source/serde/src/test/org/apache/hadoop/hive/serde2/binarysortable/MyTestClass.java:[82,59]
cannot find symbol
[ERROR] symbol:   variable MyTestPrimitiveClass
[ERROR] location: class org.apache.hadoop.hive.serde2.binarysortable.MyTestClass
[ERROR] /data/hive-ptest/working/apache-svn-spark-source/serde/src/test/org/apache/hadoop/hive/serde2/lazybinary/MyTestClassSmaller.java:[70,50]
cannot find symbol
[ERROR] symbol:   variable MyTestPrimitiveClass
[ERROR] location: class org.apache.hadoop.hive.serde2.lazybinary.MyTestClassSmaller
[ERROR] /data/hive-ptest/working/apache-svn-spark-source/serde/src/test/org/apache/hadoop/hive/serde2/lazybinary/MyTestClassSmaller.java:[71,52]
cannot find symbol
[ERROR] symbol:   variable MyTestPrimitiveClass
[ERROR] location: class org.apache.hadoop.hive.serde2.lazybinary.MyTestClassSmaller
[ERROR] /data/hive-ptest/working/apache-svn-spark-source/serde/src/test/org/apache/hadoop/hive/serde2/lazybinary/MyTestClassSmaller.java:[72,55]
cannot find symbol
[ERROR] symbol:   variable MyTestPrimitiveClass
[ERROR] location: class org.apache.hadoop.hive.serde2.lazybinary.MyTestClassSmaller
[ERROR] /data/hive-ptest/working/apache-svn-spark-source/serde/src/test/org/apache/hadoop/hive/serde2/lazybinary/MyTestClassSmaller.java:[73,18]
cannot find symbol
[ERROR] symbol:   variable MyTestPrimitiveClass
[ERROR] location: class org.apache.hadoop.hive.serde2.lazybinary.MyTestClassSmaller
[ERROR] /data/hive-ptest/working/apache-svn-spark-source/serde/src/test/org/apache/hadoop/hive/serde2/lazybinary/MyTestClassSmaller.java:[74,51]
cannot find symbol
[ERROR] symbol:   variable MyTestPrimitiveClass
[ERROR] location: class org.apache.hadoop.hive.serde2.lazybinary.MyTestClassSmaller
[ERROR] /data/hive-ptest/working/apache-svn-spark-source/serde/src/test/org/apache/hadoop/hive/serde2/lazybinary/MyTestClassSmaller.java:[75,48]
cannot find symbol
[ERROR] symbol:   variable MyTestPrimitiveClass
[ERROR] location: class org.apache.hadoop.hive.serde2.lazybinary.MyTestClassSmaller
[ERROR] /data/hive-ptest/working/apache-svn-spark-source/serde/src/test/org/apache/hadoop/hive/serde2/lazybinary/MyTestClassSmaller.java:[76,53]
cannot find symbol
[ERROR] symbol:   variable MyTestPrimitiveClass
[ERROR] location: class org.apache.hadoop.hive.serde2.lazybinary.MyTestClassSmaller
[ERROR] /data/hive-ptest/working/apache-svn-spark-source/serde/src/test/org/apache/hadoop/hive/serde2/lazybinary/MyTestClassSmaller.java:[77,61]
cannot find symbol
[ERROR] symbol:   variable MyTestPrimitiveClass
[ERROR] location: class org.apache.hadoop.hive.serde2.lazybinary.MyTestClassSmaller
[ERROR] /data/hive-ptest/working/apache-svn-spark-source/serde/src/test/org/apache/hadoop/hive/serde2/lazybinary/MyTestClassSmaller.java:[78,59]
cannot find symbol
[ERROR] symbol:   variable MyTestPrimitiveClass
[ERROR] location: class org.apache.hadoop.hive.serde2.lazybinary.MyTestClassSmaller
[ERROR] /data/hive-ptest/working/apache-svn-spark-source/serde/src/test/org/apache/hadoop/hive/serde2/lazybinary/MyTestClassBigger.java:[90,50]
cannot find symbol
[ERROR] symbol:   variable MyTestPrimitiveClass
[ERROR] location: class org.apache.hadoop.hive.serde2.lazybinary.MyTestClassBigger
[ERROR] /data/hive-ptest/working/apache-svn-spark-source/serde/src/test/org/apache/hadoop/hive/serde2/lazybinary/MyTestClassBigger.java:[91,52]
cannot find symbol
[ERROR] symbol:   variable MyTestPrimitiveClass
[ERROR] location: class org.apache.hadoop.hive.serde2.lazybinary.MyTestClassBigger
[ERROR] /data/hive-ptest/working/apache-svn-spark-source/serde/src/test/org/apache/hadoop/hive/serde2/lazybinary/MyTestClassBigger.java:[92,55]
cannot find symbol
[ERROR] symbol:   variable MyTestPrimitiveClass
[ERROR] location: class org.apache.hadoop.hive.serde2.lazybinary.MyTestClassBigger
[ERROR] /data/hive-ptest/working/apache-svn-spark-source/serde/src/test/org/apache/hadoop/hive/serde2/lazybinary/MyTestClassBigger.java:[93,18]
cannot find symbol
[ERROR] symbol:   variable MyTestPrimitiveClass
[ERROR] location: class org.apache.hadoop.hive.serde2.lazybinary.MyTestClassBigger
[ERROR] /data/hive-ptest/working/apache-svn-spark-source/serde/src/test/org/apache/hadoop/hive/serde2/lazybinary/MyTestClassBigger.java:[94,51]
cannot find symbol
[ERROR] symbol:   variable MyTestPrimitiveClass
[ERROR] location: class org.apache.hadoop.hive.serde2.lazybinary.MyTestClassBigger
[ERROR] /data/hive-ptest/working/apache-svn-spark-source/serde/src/test/org/apache/hadoop/hive/serde2/lazybinary/MyTestClassBigger.java:[95,48]
cannot find symbol
[ERROR] symbol:   variable MyTestPrimitiveClass
[ERROR] location: class org.apache.hadoop.hive.serde2.lazybinary.MyTestClassBigger
[ERROR] /data/hive-ptest/working/apache-svn-spark-source/serde/src/test/org/apache/hadoop/hive/serde2/lazybinary/MyTestClassBigger.java:[96,53]
cannot find symbol
[ERROR] symbol:   variable MyTestPrimitiveClass
[ERROR] location: class org.apache.hadoop.hive.serde2.lazybinary.MyTestClassBigger
[ERROR] /data/hive-ptest/working/apache-svn-spark-source/serde/src/test/org/apache/hadoop/hive/serde2/lazybinary/MyTestClassBigger.java:[97,61]
cannot find symbol
[ERROR] symbol:   variable MyTestPrimitiveClass
[ERROR] location: class org.apache.hadoop.hive.serde2.lazybinary.MyTestClassBigger
[ERROR] /data/hive-ptest/working/apache-svn-spark-source/serde/src/test/org/apache/hadoop/hive/serde2/lazybinary/MyTestClassBigger.java:[98,59]
cannot find symbol
[ERROR] symbol:   variable MyTestPrimitiveClass
[ERROR] location: class org.apache.hadoop.hive.serde2.lazybinary.MyTestClassBigger
[ERROR] /data/hive-ptest/working/apache-svn-spark-source/serde/src/test/org/apache/hadoop/hive/serde2/lazybinary/MyTestClassBigger.java:[105,20]
cannot find symbol
[ERROR] symbol:   variable MyTestPrimitiveClass
[ERROR] location: class org.apache.hadoop.hive.serde2.lazybinary.MyTestClassBigger
[ERROR] /data/hive-ptest/working/apache-svn-spark-source/serde/src/test/org/apache/hadoop/hive/serde2/lazybinary/MyTestClassBigger.java:[109,21]
cannot find symbol
[ERROR] symbol:   variable MyTestPrimitiveClass
[ERROR] location: class org.apache.hadoop.hive.serde2.lazybinary.MyTestClassBigger
[ERROR] /data/hive-ptest/working/apache-svn-spark-source/serde/src/test/org/apache/hadoop/hive/serde2/lazybinary/MyTestClassBigger.java:[111,21]
cannot find symbol
[ERROR] symbol:   variable MyTestPrimitiveClass
[ERROR] location: class org.apache.hadoop.hive.serde2.lazybinary.MyTestClassBigger
[ERROR] -> [Help 1]
[ERROR] 
[ERROR] To see the full stack trace of the errors, re-run Maven with the -e switch.
[ERROR] Re-run Maven using the -X switch to enable full debug logging.
[ERROR] 
[ERROR] For more information about the errors and possible solutions, please read the following
articles:
[ERROR] [Help 1] http://cwiki.apache.org/confluence/display/MAVEN/MojoFailureException
[ERROR] 
[ERROR] After correcting the problems, you can resume the build with the command
[ERROR]   mvn <goals> -rf :hive-serde
+ exit 1
'
{noformat}

This message is automatically generated.

ATTACHMENT ID: 12725368 - PreCommit-HIVE-SPARK-Build

> Merge trunk to spark 4/14/2015 [Spark Branch]
> ---------------------------------------------
>
>                 Key: HIVE-10330
>                 URL: https://issues.apache.org/jira/browse/HIVE-10330
>             Project: Hive
>          Issue Type: Sub-task
>          Components: Spark
>    Affects Versions: spark-branch
>            Reporter: Szehon Ho
>            Assignee: Szehon Ho
>         Attachments: HIVE-10330-spark.patch
>
>




--
This message was sent by Atlassian JIRA
(v6.3.4#6332)

Mime
View raw message