hive-issues mailing list archives

Site index · List index
Message view « Date » · « Thread »
Top « Date » · « Thread »
From "Hive QA (JIRA)" <j...@apache.org>
Subject [jira] [Commented] (HIVE-10308) Vectorization execution throws java.lang.IllegalArgumentException: Unsupported complex type: MAP
Date Sun, 12 Apr 2015 14:37:12 GMT

    [ https://issues.apache.org/jira/browse/HIVE-10308?page=com.atlassian.jira.plugin.system.issuetabpanels:comment-tabpanel&focusedCommentId=14491492#comment-14491492
] 

Hive QA commented on HIVE-10308:
--------------------------------



{color:red}Overall{color}: -1 at least one tests failed

Here are the results of testing the latest attachment:
https://issues.apache.org/jira/secure/attachment/12724726/HIVE-10308.1.patch

{color:red}ERROR:{color} -1 due to 14 failed/errored test(s), 8672 tests executed
*Failed tests:*
{noformat}
TestMinimrCliDriver-bucketmapjoin6.q-constprog_partitioner.q-infer_bucket_sort_dyn_part.q-and-1-more
- did not produce a TEST-*.xml file
TestMinimrCliDriver-external_table_with_space_in_location_path.q-infer_bucket_sort_merge.q-auto_sortmerge_join_16.q-and-1-more
- did not produce a TEST-*.xml file
TestMinimrCliDriver-groupby2.q-import_exported_table.q-bucketizedhiveinputformat.q-and-1-more
- did not produce a TEST-*.xml file
TestMinimrCliDriver-index_bitmap3.q-stats_counter_partitioned.q-temp_table_external.q-and-1-more
- did not produce a TEST-*.xml file
TestMinimrCliDriver-infer_bucket_sort_map_operators.q-join1.q-bucketmapjoin7.q-and-1-more
- did not produce a TEST-*.xml file
TestMinimrCliDriver-infer_bucket_sort_num_buckets.q-disable_merge_for_bucketing.q-uber_reduce.q-and-1-more
- did not produce a TEST-*.xml file
TestMinimrCliDriver-infer_bucket_sort_reducers_power_two.q-scriptfile1.q-scriptfile1_win.q-and-1-more
- did not produce a TEST-*.xml file
TestMinimrCliDriver-leftsemijoin_mr.q-load_hdfs_file_with_space_in_the_name.q-root_dir_external_table.q-and-1-more
- did not produce a TEST-*.xml file
TestMinimrCliDriver-list_bucket_dml_10.q-bucket_num_reducers.q-bucket6.q-and-1-more - did
not produce a TEST-*.xml file
TestMinimrCliDriver-load_fs2.q-file_with_header_footer.q-ql_rewrite_gbtoidx_cbo_1.q-and-1-more
- did not produce a TEST-*.xml file
TestMinimrCliDriver-parallel_orderby.q-reduce_deduplicate.q-ql_rewrite_gbtoidx_cbo_2.q-and-1-more
- did not produce a TEST-*.xml file
TestMinimrCliDriver-ql_rewrite_gbtoidx.q-smb_mapjoin_8.q - did not produce a TEST-*.xml file
TestMinimrCliDriver-schemeAuthority2.q-bucket4.q-input16_cc.q-and-1-more - did not produce
a TEST-*.xml file
org.apache.hive.jdbc.TestJdbcWithMiniHS2.testNewConnectionConfiguration
{noformat}

Test results: http://ec2-174-129-184-35.compute-1.amazonaws.com/jenkins/job/PreCommit-HIVE-TRUNK-Build/3395/testReport
Console output: http://ec2-174-129-184-35.compute-1.amazonaws.com/jenkins/job/PreCommit-HIVE-TRUNK-Build/3395/console
Test logs: http://ec2-174-129-184-35.compute-1.amazonaws.com/logs/PreCommit-HIVE-TRUNK-Build-3395/

Messages:
{noformat}
Executing org.apache.hive.ptest.execution.PrepPhase
Executing org.apache.hive.ptest.execution.ExecutionPhase
Executing org.apache.hive.ptest.execution.ReportingPhase
Tests exited with: TestsFailedException: 14 tests failed
{noformat}

This message is automatically generated.

ATTACHMENT ID: 12724726 - PreCommit-HIVE-TRUNK-Build

> Vectorization execution throws java.lang.IllegalArgumentException: Unsupported complex
type: MAP
> ------------------------------------------------------------------------------------------------
>
>                 Key: HIVE-10308
>                 URL: https://issues.apache.org/jira/browse/HIVE-10308
>             Project: Hive
>          Issue Type: Bug
>          Components: Vectorization
>    Affects Versions: 0.14.0, 0.13.1, 1.2.0, 1.1.0
>            Reporter: Selina Zhang
>            Assignee: Selina Zhang
>         Attachments: HIVE-10308.1.patch
>
>
> Steps to reproduce:
> --------------------
> CREATE TABLE test_orc (a INT, b MAP<INT, STRING>) STORED AS ORC;
> INSERT OVERWRITE TABLE test_orc SELECT 1, MAP(1, "one", 2, "two") FROM src LIMIT 1;
> CREATE TABLE test(key INT) ;
> INSERT OVERWRITE TABLE test SELECT 1 FROM src LIMIT 1;
> set hive.vectorized.execution.enabled=true;
> set hive.auto.convert.join=false;
> select l.key from test l left outer join test_orc r on (l.key= r.a) where r.a is not
null;
> Stack trace:
> --------------------
> Caused by: java.lang.IllegalArgumentException: Unsupported complex type: MAP
> 	at org.apache.hadoop.hive.ql.exec.vector.expressions.VectorExpressionWriterFactory.genVectorExpressionWritable(VectorExpressionWriterFactory.java:456)
> 	at org.apache.hadoop.hive.ql.exec.vector.expressions.VectorExpressionWriterFactory.processVectorInspector(VectorExpressionWriterFactory.java:1191)
> 	at org.apache.hadoop.hive.ql.exec.vector.VectorReduceSinkOperator.initializeOp(VectorReduceSinkOperator.java:58)
> 	at org.apache.hadoop.hive.ql.exec.Operator.initialize(Operator.java:362)
> 	at org.apache.hadoop.hive.ql.exec.Operator.initialize(Operator.java:481)
> 	at org.apache.hadoop.hive.ql.exec.Operator.initializeChildren(Operator.java:438)
> 	at org.apache.hadoop.hive.ql.exec.Operator.initialize(Operator.java:375)
> 	at org.apache.hadoop.hive.ql.exec.MapOperator.initializeMapOperator(MapOperator.java:442)
> 	at org.apache.hadoop.hive.ql.exec.tez.MapRecordProcessor.init(MapRecordProcessor.java:198)



--
This message was sent by Atlassian JIRA
(v6.3.4#6332)

Mime
View raw message