hive-issues mailing list archives

Site index · List index
Message view « Date » · « Thread »
Top « Date » · « Thread »
From "Hive QA (JIRA)" <j...@apache.org>
Subject [jira] [Commented] (HIVE-10269) HiveMetaStore.java:[6089,29] cannot find symbol class JvmPauseMonitor
Date Fri, 10 Apr 2015 15:59:12 GMT

    [ https://issues.apache.org/jira/browse/HIVE-10269?page=com.atlassian.jira.plugin.system.issuetabpanels:comment-tabpanel&focusedCommentId=14489845#comment-14489845
] 

Hive QA commented on HIVE-10269:
--------------------------------



{color:red}Overall{color}: -1 at least one tests failed

Here are the results of testing the latest attachment:
https://issues.apache.org/jira/secure/attachment/12724118/HIVE-10269.patch

{color:red}ERROR:{color} -1 due to 13 failed/errored test(s), 8666 tests executed
*Failed tests:*
{noformat}
TestMinimrCliDriver-bucketmapjoin6.q-constprog_partitioner.q-infer_bucket_sort_dyn_part.q-and-1-more
- did not produce a TEST-*.xml file
TestMinimrCliDriver-external_table_with_space_in_location_path.q-infer_bucket_sort_merge.q-auto_sortmerge_join_16.q-and-1-more
- did not produce a TEST-*.xml file
TestMinimrCliDriver-groupby2.q-import_exported_table.q-bucketizedhiveinputformat.q-and-1-more
- did not produce a TEST-*.xml file
TestMinimrCliDriver-index_bitmap3.q-stats_counter_partitioned.q-temp_table_external.q-and-1-more
- did not produce a TEST-*.xml file
TestMinimrCliDriver-infer_bucket_sort_map_operators.q-join1.q-bucketmapjoin7.q-and-1-more
- did not produce a TEST-*.xml file
TestMinimrCliDriver-infer_bucket_sort_num_buckets.q-disable_merge_for_bucketing.q-uber_reduce.q-and-1-more
- did not produce a TEST-*.xml file
TestMinimrCliDriver-infer_bucket_sort_reducers_power_two.q-scriptfile1.q-scriptfile1_win.q-and-1-more
- did not produce a TEST-*.xml file
TestMinimrCliDriver-leftsemijoin_mr.q-load_hdfs_file_with_space_in_the_name.q-root_dir_external_table.q-and-1-more
- did not produce a TEST-*.xml file
TestMinimrCliDriver-list_bucket_dml_10.q-bucket_num_reducers.q-bucket6.q-and-1-more - did
not produce a TEST-*.xml file
TestMinimrCliDriver-load_fs2.q-file_with_header_footer.q-ql_rewrite_gbtoidx_cbo_1.q-and-1-more
- did not produce a TEST-*.xml file
TestMinimrCliDriver-parallel_orderby.q-reduce_deduplicate.q-ql_rewrite_gbtoidx_cbo_2.q-and-1-more
- did not produce a TEST-*.xml file
TestMinimrCliDriver-ql_rewrite_gbtoidx.q-smb_mapjoin_8.q - did not produce a TEST-*.xml file
TestMinimrCliDriver-schemeAuthority2.q-bucket4.q-input16_cc.q-and-1-more - did not produce
a TEST-*.xml file
{noformat}

Test results: http://ec2-174-129-184-35.compute-1.amazonaws.com/jenkins/job/PreCommit-HIVE-TRUNK-Build/3360/testReport
Console output: http://ec2-174-129-184-35.compute-1.amazonaws.com/jenkins/job/PreCommit-HIVE-TRUNK-Build/3360/console
Test logs: http://ec2-174-129-184-35.compute-1.amazonaws.com/logs/PreCommit-HIVE-TRUNK-Build-3360/

Messages:
{noformat}
Executing org.apache.hive.ptest.execution.PrepPhase
Executing org.apache.hive.ptest.execution.ExecutionPhase
Executing org.apache.hive.ptest.execution.ReportingPhase
Tests exited with: TestsFailedException: 13 tests failed
{noformat}

This message is automatically generated.

ATTACHMENT ID: 12724118 - PreCommit-HIVE-TRUNK-Build

> HiveMetaStore.java:[6089,29] cannot find symbol class JvmPauseMonitor
> ---------------------------------------------------------------------
>
>                 Key: HIVE-10269
>                 URL: https://issues.apache.org/jira/browse/HIVE-10269
>             Project: Hive
>          Issue Type: Bug
>          Components: Metastore
>            Reporter: Gabor Liptak
>            Assignee: Ferdinand Xu
>         Attachments: HIVE-10269.patch
>
>
> Compiling trunk fails when building based on instructions in
> https://cwiki.apache.org/confluence/display/Hive/HowToContribute
> $ git status
> On branch trunk
> Your branch is up-to-date with 'origin/trunk'.
> nothing to commit, working directory clean
> $ mvn clean install -DskipTests -Phadoop-1
> ...[ERROR] Failed to execute goal org.apache.maven.plugins:maven-compiler-plugin:3.1:compile
(default-compile) on project hive-metastore: Compilation failure: Compilation failure:
> [ERROR] /tmp/hive/metastore/src/java/org/apache/hadoop/hive/metastore/HiveMetaStore.java:[6089,29]
cannot find symbol
> [ERROR] symbol:   class JvmPauseMonitor
> [ERROR] location: package org.apache.hadoop.util
> [ERROR] /tmp/hive/metastore/src/java/org/apache/hadoop/hive/metastore/HiveMetaStore.java:[6090,35]
cannot find symbol
> [ERROR] symbol:   class JvmPauseMonitor
> [ERROR] location: package org.apache.hadoop.util
> [ERROR] -> [Help 1]
> [ERROR] 
> [ERROR] To see the full stack trace of the errors, re-run Maven with the -e switch.
> [ERROR] Re-run Maven using the -X switch to enable full debug logging.
> [ERROR] 
> [ERROR] For more information about the errors and possible solutions, please read the
following articles:
> [ERROR] [Help 1] http://cwiki.apache.org/confluence/display/MAVEN/MojoFailureException
> [ERROR] 
> [ERROR] After correcting the problems, you can resume the build with the command
> [ERROR]   mvn <goals> -rf :hive-metastore



--
This message was sent by Atlassian JIRA
(v6.3.4#6332)

Mime
View raw message