hive-issues mailing list archives

Site index · List index
Message view « Date » · « Thread »
Top « Date » · « Thread »
From "Hive QA (JIRA)" <j...@apache.org>
Subject [jira] [Commented] (HIVE-9870) Add JvmPauseMonitor threads to HMS and HS2 daemons
Date Thu, 05 Mar 2015 19:40:39 GMT

    [ https://issues.apache.org/jira/browse/HIVE-9870?page=com.atlassian.jira.plugin.system.issuetabpanels:comment-tabpanel&focusedCommentId=14349353#comment-14349353
] 

Hive QA commented on HIVE-9870:
-------------------------------



{color:red}Overall{color}: -1 no tests executed

Here are the results of testing the latest attachment:
https://issues.apache.org/jira/secure/attachment/12702863/HIVE-9870.patch

Test results: http://ec2-174-129-184-35.compute-1.amazonaws.com/jenkins/job/PreCommit-HIVE-TRUNK-Build/2959/testReport
Console output: http://ec2-174-129-184-35.compute-1.amazonaws.com/jenkins/job/PreCommit-HIVE-TRUNK-Build/2959/console
Test logs: http://ec2-174-129-184-35.compute-1.amazonaws.com/logs/PreCommit-HIVE-TRUNK-Build-2959/

Messages:
{noformat}
**** This message was trimmed, see log for full details ****
[INFO] Copying 4 resources
[INFO] Copying 3 resources
[INFO] 
[INFO] --- maven-antrun-plugin:1.7:run (setup-test-dirs) @ hive-common ---
[INFO] Executing tasks

main:
    [mkdir] Created dir: /data/hive-ptest/working/apache-svn-trunk-source/common/target/tmp
    [mkdir] Created dir: /data/hive-ptest/working/apache-svn-trunk-source/common/target/warehouse
    [mkdir] Created dir: /data/hive-ptest/working/apache-svn-trunk-source/common/target/tmp/conf
     [copy] Copying 11 files to /data/hive-ptest/working/apache-svn-trunk-source/common/target/tmp/conf
[INFO] Executed tasks
[INFO] 
[INFO] --- maven-compiler-plugin:3.1:testCompile (default-testCompile) @ hive-common ---
[INFO] Compiling 16 source files to /data/hive-ptest/working/apache-svn-trunk-source/common/target/test-classes
[WARNING] /data/hive-ptest/working/apache-svn-trunk-source/common/src/test/org/apache/hadoop/hive/common/TestValidReadTxnList.java:
/data/hive-ptest/working/apache-svn-trunk-source/common/src/test/org/apache/hadoop/hive/common/TestValidReadTxnList.java
uses or overrides a deprecated API.
[WARNING] /data/hive-ptest/working/apache-svn-trunk-source/common/src/test/org/apache/hadoop/hive/common/TestValidReadTxnList.java:
Recompile with -Xlint:deprecation for details.
[INFO] 
[INFO] --- maven-surefire-plugin:2.16:test (default-test) @ hive-common ---
[INFO] Tests are skipped.
[INFO] 
[INFO] --- maven-jar-plugin:2.2:jar (default-jar) @ hive-common ---
[INFO] Building jar: /data/hive-ptest/working/apache-svn-trunk-source/common/target/hive-common-1.2.0-SNAPSHOT.jar
[INFO] 
[INFO] --- maven-site-plugin:3.3:attach-descriptor (attach-descriptor) @ hive-common ---
[INFO] 
[INFO] --- maven-install-plugin:2.4:install (default-install) @ hive-common ---
[INFO] Installing /data/hive-ptest/working/apache-svn-trunk-source/common/target/hive-common-1.2.0-SNAPSHOT.jar
to /data/hive-ptest/working/maven/org/apache/hive/hive-common/1.2.0-SNAPSHOT/hive-common-1.2.0-SNAPSHOT.jar
[INFO] Installing /data/hive-ptest/working/apache-svn-trunk-source/common/pom.xml to /data/hive-ptest/working/maven/org/apache/hive/hive-common/1.2.0-SNAPSHOT/hive-common-1.2.0-SNAPSHOT.pom
[INFO]                                                                         
[INFO] ------------------------------------------------------------------------
[INFO] Building Hive Serde 1.2.0-SNAPSHOT
[INFO] ------------------------------------------------------------------------
[INFO] 
[INFO] --- maven-clean-plugin:2.5:clean (default-clean) @ hive-serde ---
[INFO] Deleting /data/hive-ptest/working/apache-svn-trunk-source/serde (includes = [datanucleus.log,
derby.log], excludes = [])
[INFO] 
[INFO] --- maven-enforcer-plugin:1.3.1:enforce (enforce-no-snapshots) @ hive-serde ---
[INFO] 
[INFO] --- build-helper-maven-plugin:1.8:add-source (add-source) @ hive-serde ---
[INFO] Source directory: /data/hive-ptest/working/apache-svn-trunk-source/serde/src/gen/protobuf/gen-java
added.
[INFO] Source directory: /data/hive-ptest/working/apache-svn-trunk-source/serde/src/gen/thrift/gen-javabean
added.
[INFO] 
[INFO] --- maven-remote-resources-plugin:1.5:process (default) @ hive-serde ---
[INFO] 
[INFO] --- maven-resources-plugin:2.6:resources (default-resources) @ hive-serde ---
[INFO] Using 'UTF-8' encoding to copy filtered resources.
[INFO] skip non existing resourceDirectory /data/hive-ptest/working/apache-svn-trunk-source/serde/src/main/resources
[INFO] Copying 3 resources
[INFO] 
[INFO] --- maven-antrun-plugin:1.7:run (define-classpath) @ hive-serde ---
[INFO] Executing tasks

main:
[INFO] Executed tasks
[INFO] 
[INFO] --- maven-compiler-plugin:3.1:compile (default-compile) @ hive-serde ---
[INFO] Compiling 367 source files to /data/hive-ptest/working/apache-svn-trunk-source/serde/target/classes
[WARNING] /data/hive-ptest/working/apache-svn-trunk-source/serde/src/java/org/apache/hadoop/hive/serde2/SerDe.java:
Some input files use or override a deprecated API.
[WARNING] /data/hive-ptest/working/apache-svn-trunk-source/serde/src/java/org/apache/hadoop/hive/serde2/SerDe.java:
Recompile with -Xlint:deprecation for details.
[WARNING] /data/hive-ptest/working/apache-svn-trunk-source/serde/src/gen/thrift/gen-javabean/org/apache/hadoop/hive/serde2/thrift/test/Complex.java:
Some input files use unchecked or unsafe operations.
[WARNING] /data/hive-ptest/working/apache-svn-trunk-source/serde/src/gen/thrift/gen-javabean/org/apache/hadoop/hive/serde2/thrift/test/Complex.java:
Recompile with -Xlint:unchecked for details.
[INFO] 
[INFO] --- maven-resources-plugin:2.6:testResources (default-testResources) @ hive-serde ---
[INFO] Using 'UTF-8' encoding to copy filtered resources.
[INFO] Copying 2 resources
[INFO] Copying 3 resources
[INFO] 
[INFO] --- maven-antrun-plugin:1.7:run (setup-test-dirs) @ hive-serde ---
[INFO] Executing tasks

main:
    [mkdir] Created dir: /data/hive-ptest/working/apache-svn-trunk-source/serde/target/tmp
    [mkdir] Created dir: /data/hive-ptest/working/apache-svn-trunk-source/serde/target/warehouse
    [mkdir] Created dir: /data/hive-ptest/working/apache-svn-trunk-source/serde/target/tmp/conf
     [copy] Copying 11 files to /data/hive-ptest/working/apache-svn-trunk-source/serde/target/tmp/conf
[INFO] Executed tasks
[INFO] 
[INFO] --- maven-compiler-plugin:3.1:testCompile (default-testCompile) @ hive-serde ---
[INFO] Compiling 46 source files to /data/hive-ptest/working/apache-svn-trunk-source/serde/target/test-classes
[WARNING] /data/hive-ptest/working/apache-svn-trunk-source/serde/src/test/org/apache/hadoop/hive/serde2/columnar/TestLazyBinaryColumnarSerDe.java:
Some input files use or override a deprecated API.
[WARNING] /data/hive-ptest/working/apache-svn-trunk-source/serde/src/test/org/apache/hadoop/hive/serde2/columnar/TestLazyBinaryColumnarSerDe.java:
Recompile with -Xlint:deprecation for details.
[WARNING] /data/hive-ptest/working/apache-svn-trunk-source/serde/src/test/org/apache/hadoop/hive/serde2/objectinspector/TestStandardObjectInspectors.java:
Some input files use unchecked or unsafe operations.
[WARNING] /data/hive-ptest/working/apache-svn-trunk-source/serde/src/test/org/apache/hadoop/hive/serde2/objectinspector/TestStandardObjectInspectors.java:
Recompile with -Xlint:unchecked for details.
[INFO] 
[INFO] --- maven-surefire-plugin:2.16:test (default-test) @ hive-serde ---
[INFO] Tests are skipped.
[INFO] 
[INFO] --- maven-jar-plugin:2.2:jar (default-jar) @ hive-serde ---
[INFO] Building jar: /data/hive-ptest/working/apache-svn-trunk-source/serde/target/hive-serde-1.2.0-SNAPSHOT.jar
[INFO] 
[INFO] --- maven-site-plugin:3.3:attach-descriptor (attach-descriptor) @ hive-serde ---
[INFO] 
[INFO] --- maven-install-plugin:2.4:install (default-install) @ hive-serde ---
[INFO] Installing /data/hive-ptest/working/apache-svn-trunk-source/serde/target/hive-serde-1.2.0-SNAPSHOT.jar
to /data/hive-ptest/working/maven/org/apache/hive/hive-serde/1.2.0-SNAPSHOT/hive-serde-1.2.0-SNAPSHOT.jar
[INFO] Installing /data/hive-ptest/working/apache-svn-trunk-source/serde/pom.xml to /data/hive-ptest/working/maven/org/apache/hive/hive-serde/1.2.0-SNAPSHOT/hive-serde-1.2.0-SNAPSHOT.pom
[INFO]                                                                         
[INFO] ------------------------------------------------------------------------
[INFO] Building Hive Metastore 1.2.0-SNAPSHOT
[INFO] ------------------------------------------------------------------------
[INFO] 
[INFO] --- maven-clean-plugin:2.5:clean (default-clean) @ hive-metastore ---
[INFO] Deleting /data/hive-ptest/working/apache-svn-trunk-source/metastore (includes = [datanucleus.log,
derby.log], excludes = [])
[INFO] 
[INFO] --- maven-enforcer-plugin:1.3.1:enforce (enforce-no-snapshots) @ hive-metastore ---
[INFO] 
[INFO] --- build-helper-maven-plugin:1.8:add-source (add-source) @ hive-metastore ---
[INFO] Source directory: /data/hive-ptest/working/apache-svn-trunk-source/metastore/src/model
added.
[INFO] Source directory: /data/hive-ptest/working/apache-svn-trunk-source/metastore/src/gen/thrift/gen-javabean
added.
[INFO] 
[INFO] --- antlr3-maven-plugin:3.4:antlr (default) @ hive-metastore ---
[INFO] ANTLR: Processing source directory /data/hive-ptest/working/apache-svn-trunk-source/metastore/src/java
ANTLR Parser Generator  Version 3.4
org/apache/hadoop/hive/metastore/parser/Filter.g
[INFO] 
[INFO] --- maven-remote-resources-plugin:1.5:process (default) @ hive-metastore ---
[INFO] 
[INFO] --- maven-resources-plugin:2.6:resources (default-resources) @ hive-metastore ---
[INFO] Using 'UTF-8' encoding to copy filtered resources.
[INFO] Copying 1 resource
[INFO] Copying 3 resources
[INFO] 
[INFO] --- maven-antrun-plugin:1.7:run (define-classpath) @ hive-metastore ---
[INFO] Executing tasks

main:
[INFO] Executed tasks
[INFO] 
[INFO] --- maven-compiler-plugin:3.1:compile (default-compile) @ hive-metastore ---
[INFO] Compiling 241 source files to /data/hive-ptest/working/apache-svn-trunk-source/metastore/target/classes
[INFO] -------------------------------------------------------------
[WARNING] COMPILATION WARNING : 
[INFO] -------------------------------------------------------------
[WARNING] /data/hive-ptest/working/apache-svn-trunk-source/metastore/src/java/org/apache/hadoop/hive/metastore/MetaStoreUtils.java:
Some input files use or override a deprecated API.
[WARNING] /data/hive-ptest/working/apache-svn-trunk-source/metastore/src/java/org/apache/hadoop/hive/metastore/MetaStoreUtils.java:
Recompile with -Xlint:deprecation for details.
[WARNING] /data/hive-ptest/working/apache-svn-trunk-source/metastore/src/gen/thrift/gen-javabean/org/apache/hadoop/hive/metastore/api/MetaException.java:
Some input files use unchecked or unsafe operations.
[WARNING] /data/hive-ptest/working/apache-svn-trunk-source/metastore/src/gen/thrift/gen-javabean/org/apache/hadoop/hive/metastore/api/MetaException.java:
Recompile with -Xlint:unchecked for details.
[INFO] 4 warnings 
[INFO] -------------------------------------------------------------
[INFO] -------------------------------------------------------------
[ERROR] COMPILATION ERROR : 
[INFO] -------------------------------------------------------------
[ERROR] /data/hive-ptest/working/apache-svn-trunk-source/metastore/src/java/org/apache/hadoop/hive/metastore/HiveMetaStore.java:[5984,26]
unreported exception java.lang.Exception; must be caught or declared to be thrown
[INFO] 1 error
[INFO] -------------------------------------------------------------
[INFO] ------------------------------------------------------------------------
[INFO] Reactor Summary:
[INFO] 
[INFO] Hive .............................................. SUCCESS [11.533s]
[INFO] Hive Shims Common ................................. SUCCESS [11.382s]
[INFO] Hive Shims 0.20S .................................. SUCCESS [3.519s]
[INFO] Hive Shims 0.23 ................................... SUCCESS [10.794s]
[INFO] Hive Shims Scheduler .............................. SUCCESS [2.014s]
[INFO] Hive Shims ........................................ SUCCESS [2.589s]
[INFO] Hive Common ....................................... SUCCESS [43.464s]
[INFO] Hive Serde ........................................ SUCCESS [25.129s]
[INFO] Hive Metastore .................................... FAILURE [22.410s]
[INFO] Hive Ant Utilities ................................ SKIPPED
[INFO] Spark Remote Client ............................... SKIPPED
[INFO] Hive Query Language ............................... SKIPPED
[INFO] Hive Service ...................................... SKIPPED
[INFO] Hive Accumulo Handler ............................. SKIPPED
[INFO] Hive JDBC ......................................... SKIPPED
[INFO] Hive Beeline ...................................... SKIPPED
[INFO] Hive CLI .......................................... SKIPPED
[INFO] Hive Contrib ...................................... SKIPPED
[INFO] Hive HBase Handler ................................ SKIPPED
[INFO] Hive HCatalog ..................................... SKIPPED
[INFO] Hive HCatalog Core ................................ SKIPPED
[INFO] Hive HCatalog Pig Adapter ......................... SKIPPED
[INFO] Hive HCatalog Server Extensions ................... SKIPPED
[INFO] Hive HCatalog Webhcat Java Client ................. SKIPPED
[INFO] Hive HCatalog Webhcat ............................. SKIPPED
[INFO] Hive HCatalog Streaming ........................... SKIPPED
[INFO] Hive HWI .......................................... SKIPPED
[INFO] Hive ODBC ......................................... SKIPPED
[INFO] Hive Shims Aggregator ............................. SKIPPED
[INFO] Hive TestUtils .................................... SKIPPED
[INFO] Hive Packaging .................................... SKIPPED
[INFO] ------------------------------------------------------------------------
[INFO] BUILD FAILURE
[INFO] ------------------------------------------------------------------------
[INFO] Total time: 2:16.157s
[INFO] Finished at: Thu Mar 05 14:40:22 EST 2015
[INFO] Final Memory: 68M/376M
[INFO] ------------------------------------------------------------------------
[ERROR] Failed to execute goal org.apache.maven.plugins:maven-compiler-plugin:3.1:compile
(default-compile) on project hive-metastore: Compilation failure
[ERROR] /data/hive-ptest/working/apache-svn-trunk-source/metastore/src/java/org/apache/hadoop/hive/metastore/HiveMetaStore.java:[5984,26]
unreported exception java.lang.Exception; must be caught or declared to be thrown
[ERROR] -> [Help 1]
[ERROR] 
[ERROR] To see the full stack trace of the errors, re-run Maven with the -e switch.
[ERROR] Re-run Maven using the -X switch to enable full debug logging.
[ERROR] 
[ERROR] For more information about the errors and possible solutions, please read the following
articles:
[ERROR] [Help 1] http://cwiki.apache.org/confluence/display/MAVEN/MojoFailureException
[ERROR] 
[ERROR] After correcting the problems, you can resume the build with the command
[ERROR]   mvn <goals> -rf :hive-metastore
+ exit 1
'
{noformat}

This message is automatically generated.

ATTACHMENT ID: 12702863 - PreCommit-HIVE-TRUNK-Build

> Add JvmPauseMonitor threads to HMS and HS2 daemons
> --------------------------------------------------
>
>                 Key: HIVE-9870
>                 URL: https://issues.apache.org/jira/browse/HIVE-9870
>             Project: Hive
>          Issue Type: Improvement
>          Components: HiveServer2, Metastore
>    Affects Versions: 1.1
>            Reporter: Harsh J
>            Assignee: Harsh J
>            Priority: Minor
>         Attachments: HIVE-9870.patch, HIVE-9870.patch
>
>
> The hadoop-common carries in it a nifty thread that prints GC or non-GC pauses within
the JVM if it exceeds a specific threshold.
> This has been immeasurably useful in supporting several clusters, in identifying GC or
other form of process pauses to be the root cause of some event being investigated.
> The HMS and HS2 daemons are good targets for running similar threads within it. It can
be loaded in an if-available style.



--
This message was sent by Atlassian JIRA
(v6.3.4#6332)

Mime
View raw message