hive-issues mailing list archives

Site index · List index
Message view « Date » · « Thread »
Top « Date » · « Thread »
From "Hive QA (JIRA)" <j...@apache.org>
Subject [jira] [Commented] (HIVE-9803) SparkClientImpl should not attempt impersonation in CLI mode [Spark Branch]
Date Fri, 27 Feb 2015 19:45:05 GMT

    [ https://issues.apache.org/jira/browse/HIVE-9803?page=com.atlassian.jira.plugin.system.issuetabpanels:comment-tabpanel&focusedCommentId=14340698#comment-14340698
] 

Hive QA commented on HIVE-9803:
-------------------------------



{color:red}Overall{color}: -1 no tests executed

Here are the results of testing the latest attachment:
https://issues.apache.org/jira/secure/attachment/12701408/HIVE-9803-spark.patch

Test results: http://ec2-174-129-184-35.compute-1.amazonaws.com/jenkins/job/PreCommit-HIVE-SPARK-Build/748/testReport
Console output: http://ec2-174-129-184-35.compute-1.amazonaws.com/jenkins/job/PreCommit-HIVE-SPARK-Build/748/console
Test logs: http://ec2-50-18-27-0.us-west-1.compute.amazonaws.com/logs/PreCommit-HIVE-SPARK-Build-748/

Messages:
{noformat}
**** This message was trimmed, see log for full details ****
ENHANCED (PersistenceCapable) : org.apache.hadoop.hive.metastore.model.MRole
ENHANCED (PersistenceCapable) : org.apache.hadoop.hive.metastore.model.MRoleMap
ENHANCED (PersistenceCapable) : org.apache.hadoop.hive.metastore.model.MGlobalPrivilege
ENHANCED (PersistenceCapable) : org.apache.hadoop.hive.metastore.model.MDBPrivilege
ENHANCED (PersistenceCapable) : org.apache.hadoop.hive.metastore.model.MTablePrivilege
ENHANCED (PersistenceCapable) : org.apache.hadoop.hive.metastore.model.MPartitionPrivilege
ENHANCED (PersistenceCapable) : org.apache.hadoop.hive.metastore.model.MTableColumnPrivilege
ENHANCED (PersistenceCapable) : org.apache.hadoop.hive.metastore.model.MPartitionColumnPrivilege
ENHANCED (PersistenceCapable) : org.apache.hadoop.hive.metastore.model.MPartitionEvent
ENHANCED (PersistenceCapable) : org.apache.hadoop.hive.metastore.model.MMasterKey
ENHANCED (PersistenceCapable) : org.apache.hadoop.hive.metastore.model.MDelegationToken
ENHANCED (PersistenceCapable) : org.apache.hadoop.hive.metastore.model.MTableColumnStatistics
ENHANCED (PersistenceCapable) : org.apache.hadoop.hive.metastore.model.MPartitionColumnStatistics
ENHANCED (PersistenceCapable) : org.apache.hadoop.hive.metastore.model.MVersionTable
ENHANCED (PersistenceCapable) : org.apache.hadoop.hive.metastore.model.MResourceUri
ENHANCED (PersistenceCapable) : org.apache.hadoop.hive.metastore.model.MFunction
ENHANCED (PersistenceCapable) : org.apache.hadoop.hive.metastore.model.MNotificationLog
ENHANCED (PersistenceCapable) : org.apache.hadoop.hive.metastore.model.MNotificationNextId
DataNucleus Enhancer completed with success for 29 classes. Timings : input=199 ms, enhance=253
ms, total=452 ms. Consult the log for full details
[INFO] 
[INFO] --- maven-resources-plugin:2.6:testResources (default-testResources) @ hive-metastore
---
[INFO] Using 'UTF-8' encoding to copy filtered resources.
[INFO] skip non existing resourceDirectory /data/hive-ptest/working/apache-svn-spark-source/metastore/src/test/resources
[INFO] Copying 3 resources
[INFO] 
[INFO] --- maven-antrun-plugin:1.7:run (setup-test-dirs) @ hive-metastore ---
[INFO] Executing tasks

main:
    [mkdir] Created dir: /data/hive-ptest/working/apache-svn-spark-source/metastore/target/tmp
    [mkdir] Created dir: /data/hive-ptest/working/apache-svn-spark-source/metastore/target/warehouse
    [mkdir] Created dir: /data/hive-ptest/working/apache-svn-spark-source/metastore/target/tmp/conf
     [copy] Copying 11 files to /data/hive-ptest/working/apache-svn-spark-source/metastore/target/tmp/conf
[INFO] Executed tasks
[INFO] 
[INFO] --- maven-compiler-plugin:3.1:testCompile (default-testCompile) @ hive-metastore ---
[INFO] Compiling 17 source files to /data/hive-ptest/working/apache-svn-spark-source/metastore/target/test-classes
[WARNING] /data/hive-ptest/working/apache-svn-spark-source/metastore/src/test/org/apache/hadoop/hive/metastore/txn/TestTxnHandler.java:
Some input files use or override a deprecated API.
[WARNING] /data/hive-ptest/working/apache-svn-spark-source/metastore/src/test/org/apache/hadoop/hive/metastore/txn/TestTxnHandler.java:
Recompile with -Xlint:deprecation for details.
[INFO] 
[INFO] --- maven-surefire-plugin:2.16:test (default-test) @ hive-metastore ---
[INFO] Tests are skipped.
[INFO] 
[INFO] --- maven-jar-plugin:2.2:jar (default-jar) @ hive-metastore ---
[INFO] Building jar: /data/hive-ptest/working/apache-svn-spark-source/metastore/target/hive-metastore-1.2.0-SNAPSHOT.jar
[INFO] 
[INFO] --- maven-site-plugin:3.3:attach-descriptor (attach-descriptor) @ hive-metastore ---
[INFO] 
[INFO] --- maven-jar-plugin:2.2:test-jar (default) @ hive-metastore ---
[INFO] Building jar: /data/hive-ptest/working/apache-svn-spark-source/metastore/target/hive-metastore-1.2.0-SNAPSHOT-tests.jar
[INFO] 
[INFO] --- maven-install-plugin:2.4:install (default-install) @ hive-metastore ---
[INFO] Installing /data/hive-ptest/working/apache-svn-spark-source/metastore/target/hive-metastore-1.2.0-SNAPSHOT.jar
to /data/hive-ptest/working/maven/org/apache/hive/hive-metastore/1.2.0-SNAPSHOT/hive-metastore-1.2.0-SNAPSHOT.jar
[INFO] Installing /data/hive-ptest/working/apache-svn-spark-source/metastore/pom.xml to /data/hive-ptest/working/maven/org/apache/hive/hive-metastore/1.2.0-SNAPSHOT/hive-metastore-1.2.0-SNAPSHOT.pom
[INFO] Installing /data/hive-ptest/working/apache-svn-spark-source/metastore/target/hive-metastore-1.2.0-SNAPSHOT-tests.jar
to /data/hive-ptest/working/maven/org/apache/hive/hive-metastore/1.2.0-SNAPSHOT/hive-metastore-1.2.0-SNAPSHOT-tests.jar
[INFO]                                                                         
[INFO] ------------------------------------------------------------------------
[INFO] Building Hive Ant Utilities 1.2.0-SNAPSHOT
[INFO] ------------------------------------------------------------------------
[INFO] 
[INFO] --- maven-clean-plugin:2.5:clean (default-clean) @ hive-ant ---
[INFO] Deleting /data/hive-ptest/working/apache-svn-spark-source/ant (includes = [datanucleus.log,
derby.log], excludes = [])
[INFO] 
[INFO] --- maven-enforcer-plugin:1.3.1:enforce (enforce-no-snapshots) @ hive-ant ---
[INFO] 
[INFO] --- maven-remote-resources-plugin:1.5:process (default) @ hive-ant ---
[INFO] 
[INFO] --- maven-resources-plugin:2.6:resources (default-resources) @ hive-ant ---
[INFO] Using 'UTF-8' encoding to copy filtered resources.
[INFO] skip non existing resourceDirectory /data/hive-ptest/working/apache-svn-spark-source/ant/src/main/resources
[INFO] Copying 3 resources
[INFO] 
[INFO] --- maven-antrun-plugin:1.7:run (define-classpath) @ hive-ant ---
[INFO] Executing tasks

main:
[INFO] Executed tasks
[INFO] 
[INFO] --- maven-compiler-plugin:3.1:compile (default-compile) @ hive-ant ---
[INFO] Compiling 5 source files to /data/hive-ptest/working/apache-svn-spark-source/ant/target/classes
[WARNING] /data/hive-ptest/working/apache-svn-spark-source/ant/src/org/apache/hadoop/hive/ant/QTestGenTask.java:
/data/hive-ptest/working/apache-svn-spark-source/ant/src/org/apache/hadoop/hive/ant/QTestGenTask.java
uses or overrides a deprecated API.
[WARNING] /data/hive-ptest/working/apache-svn-spark-source/ant/src/org/apache/hadoop/hive/ant/QTestGenTask.java:
Recompile with -Xlint:deprecation for details.
[WARNING] /data/hive-ptest/working/apache-svn-spark-source/ant/src/org/apache/hadoop/hive/ant/DistinctElementsClassPath.java:
/data/hive-ptest/working/apache-svn-spark-source/ant/src/org/apache/hadoop/hive/ant/DistinctElementsClassPath.java
uses unchecked or unsafe operations.
[WARNING] /data/hive-ptest/working/apache-svn-spark-source/ant/src/org/apache/hadoop/hive/ant/DistinctElementsClassPath.java:
Recompile with -Xlint:unchecked for details.
[INFO] 
[INFO] --- maven-resources-plugin:2.6:testResources (default-testResources) @ hive-ant ---
[INFO] Using 'UTF-8' encoding to copy filtered resources.
[INFO] skip non existing resourceDirectory /data/hive-ptest/working/apache-svn-spark-source/ant/src/test/resources
[INFO] Copying 3 resources
[INFO] 
[INFO] --- maven-antrun-plugin:1.7:run (setup-test-dirs) @ hive-ant ---
[INFO] Executing tasks

main:
    [mkdir] Created dir: /data/hive-ptest/working/apache-svn-spark-source/ant/target/tmp
    [mkdir] Created dir: /data/hive-ptest/working/apache-svn-spark-source/ant/target/warehouse
    [mkdir] Created dir: /data/hive-ptest/working/apache-svn-spark-source/ant/target/tmp/conf
     [copy] Copying 11 files to /data/hive-ptest/working/apache-svn-spark-source/ant/target/tmp/conf
[INFO] Executed tasks
[INFO] 
[INFO] --- maven-compiler-plugin:3.1:testCompile (default-testCompile) @ hive-ant ---
[INFO] No sources to compile
[INFO] 
[INFO] --- maven-surefire-plugin:2.16:test (default-test) @ hive-ant ---
[INFO] Tests are skipped.
[INFO] 
[INFO] --- maven-jar-plugin:2.2:jar (default-jar) @ hive-ant ---
[INFO] Building jar: /data/hive-ptest/working/apache-svn-spark-source/ant/target/hive-ant-1.2.0-SNAPSHOT.jar
[INFO] 
[INFO] --- maven-site-plugin:3.3:attach-descriptor (attach-descriptor) @ hive-ant ---
[INFO] 
[INFO] --- maven-install-plugin:2.4:install (default-install) @ hive-ant ---
[INFO] Installing /data/hive-ptest/working/apache-svn-spark-source/ant/target/hive-ant-1.2.0-SNAPSHOT.jar
to /data/hive-ptest/working/maven/org/apache/hive/hive-ant/1.2.0-SNAPSHOT/hive-ant-1.2.0-SNAPSHOT.jar
[INFO] Installing /data/hive-ptest/working/apache-svn-spark-source/ant/pom.xml to /data/hive-ptest/working/maven/org/apache/hive/hive-ant/1.2.0-SNAPSHOT/hive-ant-1.2.0-SNAPSHOT.pom
[INFO]                                                                         
[INFO] ------------------------------------------------------------------------
[INFO] Building Spark Remote Client 1.2.0-SNAPSHOT
[INFO] ------------------------------------------------------------------------
[INFO] 
[INFO] --- maven-clean-plugin:2.5:clean (default-clean) @ spark-client ---
[INFO] Deleting /data/hive-ptest/working/apache-svn-spark-source/spark-client (includes =
[datanucleus.log, derby.log], excludes = [])
[INFO] 
[INFO] --- maven-enforcer-plugin:1.3.1:enforce (enforce-no-snapshots) @ spark-client ---
[INFO] 
[INFO] --- maven-remote-resources-plugin:1.5:process (default) @ spark-client ---
[INFO] 
[INFO] --- maven-resources-plugin:2.6:resources (default-resources) @ spark-client ---
[INFO] Using 'UTF-8' encoding to copy filtered resources.
[INFO] skip non existing resourceDirectory /data/hive-ptest/working/apache-svn-spark-source/spark-client/src/main/resources
[INFO] Copying 3 resources
[INFO] 
[INFO] --- maven-antrun-plugin:1.7:run (define-classpath) @ spark-client ---
[INFO] Executing tasks

main:
[INFO] Executed tasks
[INFO] 
[INFO] --- maven-compiler-plugin:3.1:compile (default-compile) @ spark-client ---
[INFO] Compiling 28 source files to /data/hive-ptest/working/apache-svn-spark-source/spark-client/target/classes
[INFO] -------------------------------------------------------------
[ERROR] COMPILATION ERROR : 
[INFO] -------------------------------------------------------------
[ERROR] /data/hive-ptest/working/apache-svn-spark-source/spark-client/src/main/java/org/apache/hive/spark/client/SparkClientImpl.java:[358,67]
')' expected
[INFO] 1 error
[INFO] -------------------------------------------------------------
[INFO] ------------------------------------------------------------------------
[INFO] Reactor Summary:
[INFO] 
[INFO] Hive .............................................. SUCCESS [3.458s]
[INFO] Hive Shims Common ................................. SUCCESS [3.570s]
[INFO] Hive Shims 0.20S .................................. SUCCESS [1.139s]
[INFO] Hive Shims 0.23 ................................... SUCCESS [2.836s]
[INFO] Hive Shims Scheduler .............................. SUCCESS [0.914s]
[INFO] Hive Shims ........................................ SUCCESS [0.750s]
[INFO] Hive Common ....................................... SUCCESS [5.257s]
[INFO] Hive Serde ........................................ SUCCESS [4.867s]
[INFO] Hive Metastore .................................... SUCCESS [12.133s]
[INFO] Hive Ant Utilities ................................ SUCCESS [0.592s]
[INFO] Spark Remote Client ............................... FAILURE [5.157s]
[INFO] Hive Query Language ............................... SKIPPED
[INFO] Hive Service ...................................... SKIPPED
[INFO] Hive Accumulo Handler ............................. SKIPPED
[INFO] Hive JDBC ......................................... SKIPPED
[INFO] Hive Beeline ...................................... SKIPPED
[INFO] Hive CLI .......................................... SKIPPED
[INFO] Hive Contrib ...................................... SKIPPED
[INFO] Hive HBase Handler ................................ SKIPPED
[INFO] Hive HCatalog ..................................... SKIPPED
[INFO] Hive HCatalog Core ................................ SKIPPED
[INFO] Hive HCatalog Pig Adapter ......................... SKIPPED
[INFO] Hive HCatalog Server Extensions ................... SKIPPED
[INFO] Hive HCatalog Webhcat Java Client ................. SKIPPED
[INFO] Hive HCatalog Webhcat ............................. SKIPPED
[INFO] Hive HCatalog Streaming ........................... SKIPPED
[INFO] Hive HWI .......................................... SKIPPED
[INFO] Hive ODBC ......................................... SKIPPED
[INFO] Hive Shims Aggregator ............................. SKIPPED
[INFO] Hive TestUtils .................................... SKIPPED
[INFO] Hive Packaging .................................... SKIPPED
[INFO] ------------------------------------------------------------------------
[INFO] BUILD FAILURE
[INFO] ------------------------------------------------------------------------
[INFO] Total time: 41.846s
[INFO] Finished at: Fri Feb 27 14:50:03 EST 2015
[INFO] Final Memory: 79M/915M
[INFO] ------------------------------------------------------------------------
[ERROR] Failed to execute goal org.apache.maven.plugins:maven-compiler-plugin:3.1:compile
(default-compile) on project spark-client: Compilation failure
[ERROR] /data/hive-ptest/working/apache-svn-spark-source/spark-client/src/main/java/org/apache/hive/spark/client/SparkClientImpl.java:[358,67]
')' expected
[ERROR] -> [Help 1]
[ERROR] 
[ERROR] To see the full stack trace of the errors, re-run Maven with the -e switch.
[ERROR] Re-run Maven using the -X switch to enable full debug logging.
[ERROR] 
[ERROR] For more information about the errors and possible solutions, please read the following
articles:
[ERROR] [Help 1] http://cwiki.apache.org/confluence/display/MAVEN/MojoFailureException
[ERROR] 
[ERROR] After correcting the problems, you can resume the build with the command
[ERROR]   mvn <goals> -rf :spark-client
+ exit 1
'
{noformat}

This message is automatically generated.

ATTACHMENT ID: 12701408 - PreCommit-HIVE-SPARK-Build

> SparkClientImpl should not attempt impersonation in CLI mode [Spark Branch]
> ---------------------------------------------------------------------------
>
>                 Key: HIVE-9803
>                 URL: https://issues.apache.org/jira/browse/HIVE-9803
>             Project: Hive
>          Issue Type: Bug
>          Components: Hive
>    Affects Versions: spark-branch
>            Reporter: Brock Noland
>            Assignee: Brock Noland
>         Attachments: HIVE-9803-spark.patch, HIVE-9803.patch
>
>
> My bad. In CLI mode we attempt to impersonate oursevles.



--
This message was sent by Atlassian JIRA
(v6.3.4#6332)

Mime
View raw message