hive-dev mailing list archives

Site index · List index
Message view « Date » · « Thread »
Top « Date » · « Thread »
From "Jagruti Varia (JIRA)" <j...@apache.org>
Subject [jira] [Created] (HIVE-14244) bucketmap right outer join query throws ArrayIndexOutOfBoundsException
Date Thu, 14 Jul 2016 23:55:20 GMT
Jagruti Varia created HIVE-14244:
------------------------------------

             Summary: bucketmap right outer join query throws ArrayIndexOutOfBoundsException
                 Key: HIVE-14244
                 URL: https://issues.apache.org/jira/browse/HIVE-14244
             Project: Hive
          Issue Type: Bug
    Affects Versions: 2.1.0, 1.3.0
            Reporter: Jagruti Varia
            Assignee: Zhiyuan Yang


bucketmap right outer join on partitioned bucketed table throws this error:
{noformat}
Vertex failed, vertexName=Map 1, vertexId=vertex_1466710232033_0539_6_00, diagnostics=[Task
failed, taskId=task_1466710232033_0539_6_00_000000, diagnostics=[TaskAttempt 0 failed, info=[Error:
Error while running task ( failure ) : attempt_1466710232033_0539_6_00_000000_0:java.lang.RuntimeException:
java.lang.RuntimeException: org.apache.hadoop.hive.ql.metadata.HiveException: Hive Runtime
Error while processing row 
	at org.apache.hadoop.hive.ql.exec.tez.TezProcessor.initializeAndRunProcessor(TezProcessor.java:211)
	at org.apache.hadoop.hive.ql.exec.tez.TezProcessor.run(TezProcessor.java:168)
	at org.apache.tez.runtime.LogicalIOProcessorRuntimeTask.run(LogicalIOProcessorRuntimeTask.java:370)
	at org.apache.tez.runtime.task.TaskRunner2Callable$1.run(TaskRunner2Callable.java:73)
	at org.apache.tez.runtime.task.TaskRunner2Callable$1.run(TaskRunner2Callable.java:61)
	at java.security.AccessController.doPrivileged(Native Method)
	at javax.security.auth.Subject.doAs(Subject.java:422)
	at org.apache.hadoop.security.UserGroupInformation.doAs(UserGroupInformation.java:1724)
	at org.apache.tez.runtime.task.TaskRunner2Callable.callInternal(TaskRunner2Callable.java:61)
	at org.apache.tez.runtime.task.TaskRunner2Callable.callInternal(TaskRunner2Callable.java:37)
	at org.apache.tez.common.CallableWithNdc.call(CallableWithNdc.java:36)
	at java.util.concurrent.FutureTask.run(FutureTask.java:266)
	at java.util.concurrent.ThreadPoolExecutor.runWorker(ThreadPoolExecutor.java:1142)
	at java.util.concurrent.ThreadPoolExecutor$Worker.run(ThreadPoolExecutor.java:617)
	at java.lang.Thread.run(Thread.java:745)
Caused by: java.lang.RuntimeException: org.apache.hadoop.hive.ql.metadata.HiveException: Hive
Runtime Error while processing row 
	at org.apache.hadoop.hive.ql.exec.tez.MapRecordSource.processRow(MapRecordSource.java:95)
	at org.apache.hadoop.hive.ql.exec.tez.MapRecordSource.pushRecord(MapRecordSource.java:70)
	at org.apache.hadoop.hive.ql.exec.tez.MapRecordProcessor.run(MapRecordProcessor.java:393)
	at org.apache.hadoop.hive.ql.exec.tez.TezProcessor.initializeAndRunProcessor(TezProcessor.java:185)
	... 14 more
Caused by: org.apache.hadoop.hive.ql.metadata.HiveException: Hive Runtime Error while processing
row 
	at org.apache.hadoop.hive.ql.exec.vector.VectorMapOperator.process(VectorMapOperator.java:850)
	at org.apache.hadoop.hive.ql.exec.tez.MapRecordSource.processRow(MapRecordSource.java:86)
	... 17 more
Caused by: org.apache.hadoop.hive.ql.metadata.HiveException: java.lang.ArrayIndexOutOfBoundsException:
-1
	at org.apache.hadoop.hive.ql.exec.ReduceSinkOperator.process(ReduceSinkOperator.java:416)
	at org.apache.hadoop.hive.ql.exec.vector.VectorReduceSinkOperator.process(VectorReduceSinkOperator.java:104)
	at org.apache.hadoop.hive.ql.exec.Operator.forward(Operator.java:879)
	at org.apache.hadoop.hive.ql.exec.TableScanOperator.process(TableScanOperator.java:130)
	at org.apache.hadoop.hive.ql.exec.vector.VectorMapOperator.process(VectorMapOperator.java:762)
	... 18 more
Caused by: java.lang.ArrayIndexOutOfBoundsException: -1
	at org.apache.tez.runtime.library.common.writers.UnorderedPartitionedKVWriter.write(UnorderedPartitionedKVWriter.java:314)
	at org.apache.tez.runtime.library.common.writers.UnorderedPartitionedKVWriter.write(UnorderedPartitionedKVWriter.java:257)
	at org.apache.hadoop.hive.ql.exec.tez.TezProcessor$TezKVOutputCollector.collect(TezProcessor.java:253)
	at org.apache.hadoop.hive.ql.exec.ReduceSinkOperator.collect(ReduceSinkOperator.java:552)
	at org.apache.hadoop.hive.ql.exec.ReduceSinkOperator.process(ReduceSinkOperator.java:398)
	... 22 more
], TaskAttempt 1 failed, info=[Error: Error while running task ( failure ) : attempt_1466710232033_0539_6_00_000000_1:java.lang.RuntimeException:
java.lang.RuntimeException: org.apache.hadoop.hive.ql.metadata.HiveException: Hive Runtime
Error while processing row 
	at org.apache.hadoop.hive.ql.exec.tez.TezProcessor.initializeAndRunProcessor(TezProcessor.java:211)
	at org.apache.hadoop.hive.ql.exec.tez.TezProcessor.run(TezProcessor.java:168)
	at org.apache.tez.runtime.LogicalIOProcessorRuntimeTask.run(LogicalIOProcessorRuntimeTask.java:370)
	at org.apache.tez.runtime.task.TaskRunner2Callable$1.run(TaskRunner2Callable.java:73)
	at org.apache.tez.runtime.task.TaskRunner2Callable$1.run(TaskRunner2Callable.java:61)
	at java.security.AccessController.doPrivileged(Native Method)
	at javax.security.auth.Subject.doAs(Subject.java:422)
	at org.apache.hadoop.security.UserGroupInformation.doAs(UserGroupInformation.java:1724)
	at org.apache.tez.runtime.task.TaskRunner2Callable.callInternal(TaskRunner2Callable.java:61)
	at org.apache.tez.runtime.task.TaskRunner2Callable.callInternal(TaskRunner2Callable.java:37)
	at org.apache.tez.common.CallableWithNdc.call(CallableWithNdc.java:36)
	at java.util.concurrent.FutureTask.run(FutureTask.java:266)
	at java.util.concurrent.ThreadPoolExecutor.runWorker(ThreadPoolExecutor.java:1142)
	at java.util.concurrent.ThreadPoolExecutor$Worker.run(ThreadPoolExecutor.java:617)
	at java.lang.Thread.run(Thread.java:745)
Caused by: java.lang.RuntimeException: org.apache.hadoop.hive.ql.metadata.HiveException: Hive
Runtime Error while processing row 
	at org.apache.hadoop.hive.ql.exec.tez.MapRecordSource.processRow(MapRecordSource.java:95)
	at org.apache.hadoop.hive.ql.exec.tez.MapRecordSource.pushRecord(MapRecordSource.java:70)
	at org.apache.hadoop.hive.ql.exec.tez.MapRecordProcessor.run(MapRecordProcessor.java:393)
	at org.apache.hadoop.hive.ql.exec.tez.TezProcessor.initializeAndRunProcessor(TezProcessor.java:185)
	... 14 more
Caused by: org.apache.hadoop.hive.ql.metadata.HiveException: Hive Runtime Error while processing
row 
	at org.apache.hadoop.hive.ql.exec.vector.VectorMapOperator.process(VectorMapOperator.java:850)
	at org.apache.hadoop.hive.ql.exec.tez.MapRecordSource.processRow(MapRecordSource.java:86)
	... 17 more
Caused by: org.apache.hadoop.hive.ql.metadata.HiveException: java.lang.ArrayIndexOutOfBoundsException:
-1
	at org.apache.hadoop.hive.ql.exec.ReduceSinkOperator.process(ReduceSinkOperator.java:416)
	at org.apache.hadoop.hive.ql.exec.vector.VectorReduceSinkOperator.process(VectorReduceSinkOperator.java:104)
	at org.apache.hadoop.hive.ql.exec.Operator.forward(Operator.java:879)
	at org.apache.hadoop.hive.ql.exec.TableScanOperator.process(TableScanOperator.java:130)
	at org.apache.hadoop.hive.ql.exec.vector.VectorMapOperator.process(VectorMapOperator.java:762)
	... 18 more
Caused by: java.lang.ArrayIndexOutOfBoundsException: -1
	at org.apache.tez.runtime.library.common.writers.UnorderedPartitionedKVWriter.write(UnorderedPartitionedKVWriter.java:314)
	at org.apache.tez.runtime.library.common.writers.UnorderedPartitionedKVWriter.write(UnorderedPartitionedKVWriter.java:257)
	at org.apache.hadoop.hive.ql.exec.tez.TezProcessor$TezKVOutputCollector.collect(TezProcessor.java:253)
	at org.apache.hadoop.hive.ql.exec.ReduceSinkOperator.collect(ReduceSinkOperator.java:552)
	at org.apache.hadoop.hive.ql.exec.ReduceSinkOperator.process(ReduceSinkOperator.java:398)
	... 22 more
], TaskAttempt 2 failed, info=[Error: Error while running task ( failure ) : attempt_1466710232033_0539_6_00_000000_2:java.lang.RuntimeException:
java.lang.RuntimeException: org.apache.hadoop.hive.ql.metadata.HiveException: Hive Runtime
Error while processing row 
	at org.apache.hadoop.hive.ql.exec.tez.TezProcessor.initializeAndRunProcessor(TezProcessor.java:211)
	at org.apache.hadoop.hive.ql.exec.tez.TezProcessor.run(TezProcessor.java:168)
	at org.apache.tez.runtime.LogicalIOProcessorRuntimeTask.run(LogicalIOProcessorRuntimeTask.java:370)
	at org.apache.tez.runtime.task.TaskRunner2Callable$1.run(TaskRunner2Callable.java:73)
	at org.apache.tez.runtime.task.TaskRunner2Callable$1.run(TaskRunner2Callable.java:61)
	at java.security.AccessController.doPrivileged(Native Method)
	at javax.security.auth.Subject.doAs(Subject.java:422)
	at org.apache.hadoop.security.UserGroupInformation.doAs(UserGroupInformation.java:1724)
	at org.apache.tez.runtime.task.TaskRunner2Callable.callInternal(TaskRunner2Callable.java:61)
	at org.apache.tez.runtime.task.TaskRunner2Callable.callInternal(TaskRunner2Callable.java:37)
	at org.apache.tez.common.CallableWithNdc.call(CallableWithNdc.java:36)
	at java.util.concurrent.FutureTask.run(FutureTask.java:266)
	at java.util.concurrent.ThreadPoolExecutor.runWorker(ThreadPoolExecutor.java:1142)
	at java.util.concurrent.ThreadPoolExecutor$Worker.run(ThreadPoolExecutor.java:617)
	at java.lang.Thread.run(Thread.java:745)
Caused by: java.lang.RuntimeException: org.apache.hadoop.hive.ql.metadata.HiveException: Hive
Runtime Error while processing row 
	at org.apache.hadoop.hive.ql.exec.tez.MapRecordSource.processRow(MapRecordSource.java:95)
	at org.apache.hadoop.hive.ql.exec.tez.MapRecordSource.pushRecord(MapRecordSource.java:70)
	at org.apache.hadoop.hive.ql.exec.tez.MapRecordProcessor.run(MapRecordProcessor.java:393)
	at org.apache.hadoop.hive.ql.exec.tez.TezProcessor.initializeAndRunProcessor(TezProcessor.java:185)
	... 14 more
Caused by: org.apache.hadoop.hive.ql.metadata.HiveException: Hive Runtime Error while processing
row 
	at org.apache.hadoop.hive.ql.exec.vector.VectorMapOperator.process(VectorMapOperator.java:850)
	at org.apache.hadoop.hive.ql.exec.tez.MapRecordSource.processRow(MapRecordSource.java:86)
	... 17 more
Caused by: org.apache.hadoop.hive.ql.metadata.HiveException: java.lang.ArrayIndexOutOfBoundsException:
-1
	at org.apache.hadoop.hive.ql.exec.ReduceSinkOperator.process(ReduceSinkOperator.java:416)
	at org.apache.hadoop.hive.ql.exec.vector.VectorReduceSinkOperator.process(VectorReduceSinkOperator.java:104)
	at org.apache.hadoop.hive.ql.exec.Operator.forward(Operator.java:879)
	at org.apache.hadoop.hive.ql.exec.TableScanOperator.process(TableScanOperator.java:130)
	at org.apache.hadoop.hive.ql.exec.vector.VectorMapOperator.process(VectorMapOperator.java:762)
	... 18 more
Caused by: java.lang.ArrayIndexOutOfBoundsException: -1
	at org.apache.tez.runtime.library.common.writers.UnorderedPartitionedKVWriter.write(UnorderedPartitionedKVWriter.java:314)
	at org.apache.tez.runtime.library.common.writers.UnorderedPartitionedKVWriter.write(UnorderedPartitionedKVWriter.java:257)
	at org.apache.hadoop.hive.ql.exec.tez.TezProcessor$TezKVOutputCollector.collect(TezProcessor.java:253)
	at org.apache.hadoop.hive.ql.exec.ReduceSinkOperator.collect(ReduceSinkOperator.java:552)
	at org.apache.hadoop.hive.ql.exec.ReduceSinkOperator.process(ReduceSinkOperator.java:398)
	... 22 more
], TaskAttempt 3 failed, info=[Error: Error while running task ( failure ) : attempt_1466710232033_0539_6_00_000000_3:java.lang.RuntimeException:
java.lang.RuntimeException: org.apache.hadoop.hive.ql.metadata.HiveException: Hive Runtime
Error while processing row 
	at org.apache.hadoop.hive.ql.exec.tez.TezProcessor.initializeAndRunProcessor(TezProcessor.java:211)
	at org.apache.hadoop.hive.ql.exec.tez.TezProcessor.run(TezProcessor.java:168)
	at org.apache.tez.runtime.LogicalIOProcessorRuntimeTask.run(LogicalIOProcessorRuntimeTask.java:370)
	at org.apache.tez.runtime.task.TaskRunner2Callable$1.run(TaskRunner2Callable.java:73)
	at org.apache.tez.runtime.task.TaskRunner2Callable$1.run(TaskRunner2Callable.java:61)
	at java.security.AccessController.doPrivileged(Native Method)
	at javax.security.auth.Subject.doAs(Subject.java:422)
	at org.apache.hadoop.security.UserGroupInformation.doAs(UserGroupInformation.java:1724)
	at org.apache.tez.runtime.task.TaskRunner2Callable.callInternal(TaskRunner2Callable.java:61)
	at org.apache.tez.runtime.task.TaskRunner2Callable.callInternal(TaskRunner2Callable.java:37)
	at org.apache.tez.common.CallableWithNdc.call(CallableWithNdc.java:36)
	at java.util.concurrent.FutureTask.run(FutureTask.java:266)
	at java.util.concurrent.ThreadPoolExecutor.runWorker(ThreadPoolExecutor.java:1142)
	at java.util.concurrent.ThreadPoolExecutor$Worker.run(ThreadPoolExecutor.java:617)
	at java.lang.Thread.run(Thread.java:745)
Caused by: java.lang.RuntimeException: org.apache.hadoop.hive.ql.metadata.HiveException: Hive
Runtime Error while processing row 
	at org.apache.hadoop.hive.ql.exec.tez.MapRecordSource.processRow(MapRecordSource.java:95)
	at org.apache.hadoop.hive.ql.exec.tez.MapRecordSource.pushRecord(MapRecordSource.java:70)
	at org.apache.hadoop.hive.ql.exec.tez.MapRecordProcessor.run(MapRecordProcessor.java:393)
	at org.apache.hadoop.hive.ql.exec.tez.TezProcessor.initializeAndRunProcessor(TezProcessor.java:185)
	... 14 more
Caused by: org.apache.hadoop.hive.ql.metadata.HiveException: Hive Runtime Error while processing
row 
	at org.apache.hadoop.hive.ql.exec.vector.VectorMapOperator.process(VectorMapOperator.java:850)
	at org.apache.hadoop.hive.ql.exec.tez.MapRecordSource.processRow(MapRecordSource.java:86)
	... 17 more
Caused by: org.apache.hadoop.hive.ql.metadata.HiveException: java.lang.ArrayIndexOutOfBoundsException:
-1
	at org.apache.hadoop.hive.ql.exec.ReduceSinkOperator.process(ReduceSinkOperator.java:416)
	at org.apache.hadoop.hive.ql.exec.vector.VectorReduceSinkOperator.process(VectorReduceSinkOperator.java:104)
	at org.apache.hadoop.hive.ql.exec.Operator.forward(Operator.java:879)
	at org.apache.hadoop.hive.ql.exec.TableScanOperator.process(TableScanOperator.java:130)
	at org.apache.hadoop.hive.ql.exec.vector.VectorMapOperator.process(VectorMapOperator.java:762)
	... 18 more
Caused by: java.lang.ArrayIndexOutOfBoundsException: -1
	at org.apache.tez.runtime.library.common.writers.UnorderedPartitionedKVWriter.write(UnorderedPartitionedKVWriter.java:314)
	at org.apache.tez.runtime.library.common.writers.UnorderedPartitionedKVWriter.write(UnorderedPartitionedKVWriter.java:257)
	at org.apache.hadoop.hive.ql.exec.tez.TezProcessor$TezKVOutputCollector.collect(TezProcessor.java:253)
	at org.apache.hadoop.hive.ql.exec.ReduceSinkOperator.collect(ReduceSinkOperator.java:552)
	at org.apache.hadoop.hive.ql.exec.ReduceSinkOperator.process(ReduceSinkOperator.java:398)
	... 22 more
]], Vertex did not succeed due to OWN_TASK_FAILURE, failedTasks:1 killedTasks:1, Vertex vertex_1466710232033_0539_6_00
[Map 1] killed/failed due to:OWN_TASK_FAILURE]
DAG did not succeed due to VERTEX_FAILURE. failedVertices:1 killedVertices:0
FAILED: Execution Error, return code 2 from org.apache.hadoop.hive.ql.exec.tez.TezTask. Vertex
failed, vertexName=Map 1, vertexId=vertex_1466710232033_0539_6_00, diagnostics=[Task failed,
taskId=task_1466710232033_0539_6_00_000000, diagnostics=[TaskAttempt 0 failed, info=[Error:
Error while running task ( failure ) : attempt_1466710232033_0539_6_00_000000_0:java.lang.RuntimeException:
java.lang.RuntimeException: org.apache.hadoop.hive.ql.metadata.HiveException: Hive Runtime
Error while processing row 
	at org.apache.hadoop.hive.ql.exec.tez.TezProcessor.initializeAndRunProcessor(TezProcessor.java:211)
	at org.apache.hadoop.hive.ql.exec.tez.TezProcessor.run(TezProcessor.java:168)
	at org.apache.tez.runtime.LogicalIOProcessorRuntimeTask.run(LogicalIOProcessorRuntimeTask.java:370)
	at org.apache.tez.runtime.task.TaskRunner2Callable$1.run(TaskRunner2Callable.java:73)
	at org.apache.tez.runtime.task.TaskRunner2Callable$1.run(TaskRunner2Callable.java:61)
	at java.security.AccessController.doPrivileged(Native Method)
	at javax.security.auth.Subject.doAs(Subject.java:422)
	at org.apache.hadoop.security.UserGroupInformation.doAs(UserGroupInformation.java:1724)
	at org.apache.tez.runtime.task.TaskRunner2Callable.callInternal(TaskRunner2Callable.java:61)
	at org.apache.tez.runtime.task.TaskRunner2Callable.callInternal(TaskRunner2Callable.java:37)
	at org.apache.tez.common.CallableWithNdc.call(CallableWithNdc.java:36)
	at java.util.concurrent.FutureTask.run(FutureTask.java:266)
	at java.util.concurrent.ThreadPoolExecutor.runWorker(ThreadPoolExecutor.java:1142)
	at java.util.concurrent.ThreadPoolExecutor$Worker.run(ThreadPoolExecutor.java:617)
	at java.lang.Thread.run(Thread.java:745)
Caused by: java.lang.RuntimeException: org.apache.hadoop.hive.ql.metadata.HiveException: Hive
Runtime Error while processing row 
	at org.apache.hadoop.hive.ql.exec.tez.MapRecordSource.processRow(MapRecordSource.java:95)
	at org.apache.hadoop.hive.ql.exec.tez.MapRecordSource.pushRecord(MapRecordSource.java:70)
	at org.apache.hadoop.hive.ql.exec.tez.MapRecordProcessor.run(MapRecordProcessor.java:393)
	at org.apache.hadoop.hive.ql.exec.tez.TezProcessor.initializeAndRunProcessor(TezProcessor.java:185)
	... 14 more
Caused by: org.apache.hadoop.hive.ql.metadata.HiveException: Hive Runtime Error while processing
row 
	at org.apache.hadoop.hive.ql.exec.vector.VectorMapOperator.process(VectorMapOperator.java:850)
	at org.apache.hadoop.hive.ql.exec.tez.MapRecordSource.processRow(MapRecordSource.java:86)
	... 17 more
Caused by: org.apache.hadoop.hive.ql.metadata.HiveException: java.lang.ArrayIndexOutOfBoundsException:
-1
	at org.apache.hadoop.hive.ql.exec.ReduceSinkOperator.process(ReduceSinkOperator.java:416)
	at org.apache.hadoop.hive.ql.exec.vector.VectorReduceSinkOperator.process(VectorReduceSinkOperator.java:104)
	at org.apache.hadoop.hive.ql.exec.Operator.forward(Operator.java:879)
	at org.apache.hadoop.hive.ql.exec.TableScanOperator.process(TableScanOperator.java:130)
	at org.apache.hadoop.hive.ql.exec.vector.VectorMapOperator.process(VectorMapOperator.java:762)
	... 18 more
Caused by: java.lang.ArrayIndexOutOfBoundsException: -1
	at org.apache.tez.runtime.library.common.writers.UnorderedPartitionedKVWriter.write(UnorderedPartitionedKVWriter.java:314)
	at org.apache.tez.runtime.library.common.writers.UnorderedPartitionedKVWriter.write(UnorderedPartitionedKVWriter.java:257)
	at org.apache.hadoop.hive.ql.exec.tez.TezProcessor$TezKVOutputCollector.collect(TezProcessor.java:253)
	at org.apache.hadoop.hive.ql.exec.ReduceSinkOperator.collect(ReduceSinkOperator.java:552)
	at org.apache.hadoop.hive.ql.exec.ReduceSinkOperator.process(ReduceSinkOperator.java:398)
	... 22 more
], TaskAttempt 1 failed, info=[Error: Error while running task ( failure ) : attempt_1466710232033_0539_6_00_000000_1:java.lang.RuntimeException:
java.lang.RuntimeException: org.apache.hadoop.hive.ql.metadata.HiveException: Hive Runtime
Error while processing row 
	at org.apache.hadoop.hive.ql.exec.tez.TezProcessor.initializeAndRunProcessor(TezProcessor.java:211)
	at org.apache.hadoop.hive.ql.exec.tez.TezProcessor.run(TezProcessor.java:168)
	at org.apache.tez.runtime.LogicalIOProcessorRuntimeTask.run(LogicalIOProcessorRuntimeTask.java:370)
	at org.apache.tez.runtime.task.TaskRunner2Callable$1.run(TaskRunner2Callable.java:73)
	at org.apache.tez.runtime.task.TaskRunner2Callable$1.run(TaskRunner2Callable.java:61)
	at java.security.AccessController.doPrivileged(Native Method)
	at javax.security.auth.Subject.doAs(Subject.java:422)
	at org.apache.hadoop.security.UserGroupInformation.doAs(UserGroupInformation.java:1724)
	at org.apache.tez.runtime.task.TaskRunner2Callable.callInternal(TaskRunner2Callable.java:61)
	at org.apache.tez.runtime.task.TaskRunner2Callable.callInternal(TaskRunner2Callable.java:37)
	at org.apache.tez.common.CallableWithNdc.call(CallableWithNdc.java:36)
	at java.util.concurrent.FutureTask.run(FutureTask.java:266)
	at java.util.concurrent.ThreadPoolExecutor.runWorker(ThreadPoolExecutor.java:1142)
	at java.util.concurrent.ThreadPoolExecutor$Worker.run(ThreadPoolExecutor.java:617)
	at java.lang.Thread.run(Thread.java:745)
Caused by: java.lang.RuntimeException: org.apache.hadoop.hive.ql.metadata.HiveException: Hive
Runtime Error while processing row 
	at org.apache.hadoop.hive.ql.exec.tez.MapRecordSource.processRow(MapRecordSource.java:95)
	at org.apache.hadoop.hive.ql.exec.tez.MapRecordSource.pushRecord(MapRecordSource.java:70)
	at org.apache.hadoop.hive.ql.exec.tez.MapRecordProcessor.run(MapRecordProcessor.java:393)
	at org.apache.hadoop.hive.ql.exec.tez.TezProcessor.initializeAndRunProcessor(TezProcessor.java:185)
	... 14 more
Caused by: org.apache.hadoop.hive.ql.metadata.HiveException: Hive Runtime Error while processing
row 
	at org.apache.hadoop.hive.ql.exec.vector.VectorMapOperator.process(VectorMapOperator.java:850)
	at org.apache.hadoop.hive.ql.exec.tez.MapRecordSource.processRow(MapRecordSource.java:86)
	... 17 more
Caused by: org.apache.hadoop.hive.ql.metadata.HiveException: java.lang.ArrayIndexOutOfBoundsException:
-1
	at org.apache.hadoop.hive.ql.exec.ReduceSinkOperator.process(ReduceSinkOperator.java:416)
	at org.apache.hadoop.hive.ql.exec.vector.VectorReduceSinkOperator.process(VectorReduceSinkOperator.java:104)
	at org.apache.hadoop.hive.ql.exec.Operator.forward(Operator.java:879)
	at org.apache.hadoop.hive.ql.exec.TableScanOperator.process(TableScanOperator.java:130)
	at org.apache.hadoop.hive.ql.exec.vector.VectorMapOperator.process(VectorMapOperator.java:762)
	... 18 more
Caused by: java.lang.ArrayIndexOutOfBoundsException: -1
	at org.apache.tez.runtime.library.common.writers.UnorderedPartitionedKVWriter.write(UnorderedPartitionedKVWriter.java:314)
	at org.apache.tez.runtime.library.common.writers.UnorderedPartitionedKVWriter.write(UnorderedPartitionedKVWriter.java:257)
	at org.apache.hadoop.hive.ql.exec.tez.TezProcessor$TezKVOutputCollector.collect(TezProcessor.java:253)
	at org.apache.hadoop.hive.ql.exec.ReduceSinkOperator.collect(ReduceSinkOperator.java:552)
	at org.apache.hadoop.hive.ql.exec.ReduceSinkOperator.process(ReduceSinkOperator.java:398)
	... 22 more
], TaskAttempt 2 failed, info=[Error: Error while running task ( failure ) : attempt_1466710232033_0539_6_00_000000_2:java.lang.RuntimeException:
java.lang.RuntimeException: org.apache.hadoop.hive.ql.metadata.HiveException: Hive Runtime
Error while processing row 
	at org.apache.hadoop.hive.ql.exec.tez.TezProcessor.initializeAndRunProcessor(TezProcessor.java:211)
	at org.apache.hadoop.hive.ql.exec.tez.TezProcessor.run(TezProcessor.java:168)
	at org.apache.tez.runtime.LogicalIOProcessorRuntimeTask.run(LogicalIOProcessorRuntimeTask.java:370)
	at org.apache.tez.runtime.task.TaskRunner2Callable$1.run(TaskRunner2Callable.java:73)
	at org.apache.tez.runtime.task.TaskRunner2Callable$1.run(TaskRunner2Callable.java:61)
	at java.security.AccessController.doPrivileged(Native Method)
	at javax.security.auth.Subject.doAs(Subject.java:422)
	at org.apache.hadoop.security.UserGroupInformation.doAs(UserGroupInformation.java:1724)
	at org.apache.tez.runtime.task.TaskRunner2Callable.callInternal(TaskRunner2Callable.java:61)
	at org.apache.tez.runtime.task.TaskRunner2Callable.callInternal(TaskRunner2Callable.java:37)
	at org.apache.tez.common.CallableWithNdc.call(CallableWithNdc.java:36)
	at java.util.concurrent.FutureTask.run(FutureTask.java:266)
	at java.util.concurrent.ThreadPoolExecutor.runWorker(ThreadPoolExecutor.java:1142)
	at java.util.concurrent.ThreadPoolExecutor$Worker.run(ThreadPoolExecutor.java:617)
	at java.lang.Thread.run(Thread.java:745)
Caused by: java.lang.RuntimeException: org.apache.hadoop.hive.ql.metadata.HiveException: Hive
Runtime Error while processing row 
	at org.apache.hadoop.hive.ql.exec.tez.MapRecordSource.processRow(MapRecordSource.java:95)
	at org.apache.hadoop.hive.ql.exec.tez.MapRecordSource.pushRecord(MapRecordSource.java:70)
	at org.apache.hadoop.hive.ql.exec.tez.MapRecordProcessor.run(MapRecordProcessor.java:393)
	at org.apache.hadoop.hive.ql.exec.tez.TezProcessor.initializeAndRunProcessor(TezProcessor.java:185)
	... 14 more
Caused by: org.apache.hadoop.hive.ql.metadata.HiveException: Hive Runtime Error while processing
row 
	at org.apache.hadoop.hive.ql.exec.vector.VectorMapOperator.process(VectorMapOperator.java:850)
	at org.apache.hadoop.hive.ql.exec.tez.MapRecordSource.processRow(MapRecordSource.java:86)
	... 17 more
Caused by: org.apache.hadoop.hive.ql.metadata.HiveException: java.lang.ArrayIndexOutOfBoundsException:
-1
	at org.apache.hadoop.hive.ql.exec.ReduceSinkOperator.process(ReduceSinkOperator.java:416)
	at org.apache.hadoop.hive.ql.exec.vector.VectorReduceSinkOperator.process(VectorReduceSinkOperator.java:104)
	at org.apache.hadoop.hive.ql.exec.Operator.forward(Operator.java:879)
	at org.apache.hadoop.hive.ql.exec.TableScanOperator.process(TableScanOperator.java:130)
	at org.apache.hadoop.hive.ql.exec.vector.VectorMapOperator.process(VectorMapOperator.java:762)
	... 18 more
Caused by: java.lang.ArrayIndexOutOfBoundsException: -1
	at org.apache.tez.runtime.library.common.writers.UnorderedPartitionedKVWriter.write(UnorderedPartitionedKVWriter.java:314)
	at org.apache.tez.runtime.library.common.writers.UnorderedPartitionedKVWriter.write(UnorderedPartitionedKVWriter.java:257)
	at org.apache.hadoop.hive.ql.exec.tez.TezProcessor$TezKVOutputCollector.collect(TezProcessor.java:253)
	at org.apache.hadoop.hive.ql.exec.ReduceSinkOperator.collect(ReduceSinkOperator.java:552)
	at org.apache.hadoop.hive.ql.exec.ReduceSinkOperator.process(ReduceSinkOperator.java:398)
	... 22 more
], TaskAttempt 3 failed, info=[Error: Error while running task ( failure ) : attempt_1466710232033_0539_6_00_000000_3:java.lang.RuntimeException:
java.lang.RuntimeException: org.apache.hadoop.hive.ql.metadata.HiveException: Hive Runtime
Error while processing row 
	at org.apache.hadoop.hive.ql.exec.tez.TezProcessor.initializeAndRunProcessor(TezProcessor.java:211)
	at org.apache.hadoop.hive.ql.exec.tez.TezProcessor.run(TezProcessor.java:168)
	at org.apache.tez.runtime.LogicalIOProcessorRuntimeTask.run(LogicalIOProcessorRuntimeTask.java:370)
	at org.apache.tez.runtime.task.TaskRunner2Callable$1.run(TaskRunner2Callable.java:73)
	at org.apache.tez.runtime.task.TaskRunner2Callable$1.run(TaskRunner2Callable.java:61)
	at java.security.AccessController.doPrivileged(Native Method)
	at javax.security.auth.Subject.doAs(Subject.java:422)
	at org.apache.hadoop.security.UserGroupInformation.doAs(UserGroupInformation.java:1724)
	at org.apache.tez.runtime.task.TaskRunner2Callable.callInternal(TaskRunner2Callable.java:61)
	at org.apache.tez.runtime.task.TaskRunner2Callable.callInternal(TaskRunner2Callable.java:37)
	at org.apache.tez.common.CallableWithNdc.call(CallableWithNdc.java:36)
	at java.util.concurrent.FutureTask.run(FutureTask.java:266)
	at java.util.concurrent.ThreadPoolExecutor.runWorker(ThreadPoolExecutor.java:1142)
	at java.util.concurrent.ThreadPoolExecutor$Worker.run(ThreadPoolExecutor.java:617)
	at java.lang.Thread.run(Thread.java:745)
Caused by: java.lang.RuntimeException: org.apache.hadoop.hive.ql.metadata.HiveException: Hive
Runtime Error while processing row 
	at org.apache.hadoop.hive.ql.exec.tez.MapRecordSource.processRow(MapRecordSource.java:95)
	at org.apache.hadoop.hive.ql.exec.tez.MapRecordSource.pushRecord(MapRecordSource.java:70)
	at org.apache.hadoop.hive.ql.exec.tez.MapRecordProcessor.run(MapRecordProcessor.java:393)
	at org.apache.hadoop.hive.ql.exec.tez.TezProcessor.initializeAndRunProcessor(TezProcessor.java:185)
	... 14 more
Caused by: org.apache.hadoop.hive.ql.metadata.HiveException: Hive Runtime Error while processing
row 
	at org.apache.hadoop.hive.ql.exec.vector.VectorMapOperator.process(VectorMapOperator.java:850)
	at org.apache.hadoop.hive.ql.exec.tez.MapRecordSource.processRow(MapRecordSource.java:86)
	... 17 more
Caused by: org.apache.hadoop.hive.ql.metadata.HiveException: java.lang.ArrayIndexOutOfBoundsException:
-1
	at org.apache.hadoop.hive.ql.exec.ReduceSinkOperator.process(ReduceSinkOperator.java:416)
	at org.apache.hadoop.hive.ql.exec.vector.VectorReduceSinkOperator.process(VectorReduceSinkOperator.java:104)
	at org.apache.hadoop.hive.ql.exec.Operator.forward(Operator.java:879)
	at org.apache.hadoop.hive.ql.exec.TableScanOperator.process(TableScanOperator.java:130)
	at org.apache.hadoop.hive.ql.exec.vector.VectorMapOperator.process(VectorMapOperator.java:762)
	... 18 more
Caused by: java.lang.ArrayIndexOutOfBoundsException: -1
	at org.apache.tez.runtime.library.common.writers.UnorderedPartitionedKVWriter.write(UnorderedPartitionedKVWriter.java:314)
	at org.apache.tez.runtime.library.common.writers.UnorderedPartitionedKVWriter.write(UnorderedPartitionedKVWriter.java:257)
	at org.apache.hadoop.hive.ql.exec.tez.TezProcessor$TezKVOutputCollector.collect(TezProcessor.java:253)
	at org.apache.hadoop.hive.ql.exec.ReduceSinkOperator.collect(ReduceSinkOperator.java:552)
	at org.apache.hadoop.hive.ql.exec.ReduceSinkOperator.process(ReduceSinkOperator.java:398)
	... 22 more
]], Vertex did not succeed due to OWN_TASK_FAILURE, failedTasks:1 killedTasks:1, Vertex vertex_1466710232033_0539_6_00
[Map 1] killed/failed due to:OWN_TASK_FAILURE]DAG did not succeed due to VERTEX_FAILURE. failedVertices:1
killedVertices:0
{noformat}

Steps to reproduce the issue:
{noformat}
set hive.execution.engine=tez;
drop table if exists src_nonemptybucket_partitioned_1; 
create table src_nonemptybucket_partitioned_1 (name string, age int, gpa double) partitioned
by (year int) clustered by (age) into 120 buckets stored as orc;
insert into table src_nonemptybucket_partitioned_1 partition(year=2015) select * from studenttab10k;
drop table if exists src_nonemptybucket_partitioned_2; 
create table src_nonemptybucket_partitioned_2 (name varchar(50), age bigint, gpa decimal(38,18))
partitioned by (year int) clustered by (age) into 240 buckets stored as orc;
insert into table src_nonemptybucket_partitioned_2 partition(year=2015) select * from studenttab10k
;

set hive.optimize.bucketmapjoin=true;
set hive.convert.join.bucket.mapjoin.tez=true;

select /*+ MAPJOIN(e2) */ e1.name as e1_name, e1.age as e1_age, e1.gpa as e1_gpa, e2.name
as e2_name, e2.age as e2_age, e2.gpa as e2_gpa from src_nonemptybucket_partitioned_1 e1 right
outer join src_nonemptybucket_partitioned_2 e2 on e1.age = e2.age where e1.year = 2015 and
e2.year = 2016;
{noformat}



--
This message was sent by Atlassian JIRA
(v6.3.4#6332)

Mime
View raw message