hive-dev mailing list archives

Site index · List index
Message view « Date » · « Thread »
Top « Date » · « Thread »
From Heng Chen <heng.chen.1...@gmail.com>
Subject Build failed on Trunk?
Date Tue, 29 Dec 2015 02:21:37 GMT
Run "mvn clean install -DskipTests"

I see error messages below:

[ERROR] Failed to execute goal
org.apache.maven.plugins:maven-compiler-plugin:3.1:compile
(default-compile) on project hive-common: Compilation failure: Compilation
failure:
[ERROR]
/Users/chenheng/apache/hive/common/src/java/org/apache/hadoop/hive/common/jsonexplain/tez/Stage.java:[30,28]
找不到符号
[ERROR] 符号:   类 Path
[ERROR] 位置: 程序包 org.apache.hadoop.fs
[ERROR]
/Users/chenheng/apache/hive/common/src/java/org/apache/hadoop/hive/common/jsonexplain/tez/Stage.java:[31,28]
程序包org.codehaus.jackson不存在
[ERROR]
/Users/chenheng/apache/hive/common/src/java/org/apache/hadoop/hive/common/jsonexplain/tez/Stage.java:[32,32]
程序包org.codehaus.jackson.map不存在
[ERROR]
/Users/chenheng/apache/hive/common/src/java/org/apache/hadoop/hive/common/jsonexplain/tez/Vertex.java:[26,28]
程序包org.codehaus.jackson不存在
[ERROR]
/Users/chenheng/apache/hive/common/src/java/org/apache/hadoop/hive/common/jsonexplain/tez/Vertex.java:[27,32]
程序包org.codehaus.jackson.map不存在
[ERROR]
/Users/chenheng/apache/hive/common/src/java/org/apache/hadoop/hive/common/jsonexplain/tez/Stage.java:[172,71]
找不到符号
[ERROR] 符号:   类 JsonParseException
[ERROR] 位置: 类 org.apache.hadoop.hive.common.jsonexplain.tez.Stage
[ERROR]
/Users/chenheng/apache/hive/common/src/java/org/apache/hadoop/hive/common/jsonexplain/tez/Stage.java:[173,7]
找不到符号
[ERROR] 符号:   类 JsonMappingException
[ERROR] 位置: 类 org.apache.hadoop.hive.common.jsonexplain.tez.Stage
[ERROR]
/Users/chenheng/apache/hive/common/src/java/org/apache/hadoop/hive/common/jsonexplain/tez/Vertex.java:[83,53]
找不到符号
[ERROR] 符号:   类 JsonParseException
[ERROR] 位置: 类 org.apache.hadoop.hive.common.jsonexplain.tez.Vertex
[ERROR]
/Users/chenheng/apache/hive/common/src/java/org/apache/hadoop/hive/common/jsonexplain/tez/Vertex.java:[83,73]
找不到符号
[ERROR] 符号:   类 JsonMappingException
[ERROR] 位置: 类 org.apache.hadoop.hive.common.jsonexplain.tez.Vertex
[ERROR]
/Users/chenheng/apache/hive/common/src/java/org/apache/hadoop/hive/common/jsonexplain/tez/Vertex.java:[122,59]
找不到符号
[ERROR] 符号:   类 JsonParseException
[ERROR] 位置: 类 org.apache.hadoop.hive.common.jsonexplain.tez.Vertex
[ERROR]
/Users/chenheng/apache/hive/common/src/java/org/apache/hadoop/hive/common/jsonexplain/tez/Vertex.java:[122,79]
找不到符号
[ERROR] 符号:   类 JsonMappingException
[ERROR] 位置: 类 org.apache.hadoop.hive.common.jsonexplain.tez.Vertex
[ERROR]
/Users/chenheng/apache/hive/common/src/java/org/apache/hadoop/hive/common/jsonexplain/tez/TezJsonParser.java:[34,28]
程序包org.codehaus.jackson不存在
[ERROR]
/Users/chenheng/apache/hive/common/src/java/org/apache/hadoop/hive/common/jsonexplain/tez/TezJsonParser.java:[35,32]
程序包org.codehaus.jackson.map不存在
[ERROR]
/Users/chenheng/apache/hive/common/src/java/org/apache/hadoop/hive/common/jsonexplain/tez/TezJsonParser.java:[52,61]
找不到符号
[ERROR] 符号:   类 JsonParseException
[ERROR] 位置: 类 org.apache.hadoop.hive.common.jsonexplain.tez.TezJsonParser
[ERROR]
/Users/chenheng/apache/hive/common/src/java/org/apache/hadoop/hive/common/jsonexplain/tez/TezJsonParser.java:[53,7]
找不到符号
[ERROR] 符号:   类 JsonMappingException
[ERROR] 位置: 类 org.apache.hadoop.hive.common.jsonexplain.tez.TezJsonParser
[ERROR]
/Users/chenheng/apache/hive/common/src/java/org/apache/hive/common/util/StreamPrinter.java:[27,28]
程序包org.apache.hadoop.io不存在

Mime
  • Unnamed multipart/alternative (inline, None, 0 bytes)
View raw message