hive-dev mailing list archives

Site index · List index
Message view « Date » · « Thread »
Top « Date » · « Thread »
From "dqpylf (JIRA)" <j...@apache.org>
Subject [jira] [Created] (HIVE-9922) Compile hive failed
Date Wed, 11 Mar 2015 06:55:38 GMT
dqpylf created HIVE-9922:
----------------------------

             Summary: Compile hive failed
                 Key: HIVE-9922
                 URL: https://issues.apache.org/jira/browse/HIVE-9922
             Project: Hive
          Issue Type: Bug
          Components: Hive
    Affects Versions: 1.0.0
         Environment: red hat linux6.3
            Reporter: dqpylf


Hi,
    I compile hive failed,please refer to following information:
[INFO] ------------------------------------------------------------------------
[INFO] Reactor Summary:
[INFO] 
[INFO] Hive ............................................... SUCCESS [ 31.673 s]
[INFO] Hive Shims Common .................................. SUCCESS [ 20.184 s]
[INFO] Hive Shims 0.20 .................................... SUCCESS [ 10.680 s]
[INFO] Hive Shims Secure Common ........................... SUCCESS [ 14.380 s]
[INFO] Hive Shims 0.20S ................................... SUCCESS [  5.792 s]
[INFO] Hive Shims 0.23 .................................... SUCCESS [ 25.961 s]
[INFO] Hive Shims ......................................... SUCCESS [  1.550 s]
[INFO] Hive Common ........................................ SUCCESS [ 30.775 s]
[INFO] Hive Serde ......................................... SUCCESS [01:21 min]
[INFO] Hive Metastore ..................................... SUCCESS [02:39 min]
[INFO] Hive Ant Utilities ................................. SUCCESS [  4.433 s]
[INFO] Hive Query Language ................................ FAILURE [04:51 min]
[INFO] Hive Service ....................................... SKIPPED
[INFO] Hive Accumulo Handler .............................. SKIPPED
[INFO] Hive JDBC .......................................... SKIPPED
[INFO] Hive Beeline ....................................... SKIPPED
[INFO] Hive CLI ........................................... SKIPPED
[INFO] Hive Contrib ....................................... SKIPPED
[INFO] Hive HBase Handler ................................. SKIPPED
[INFO] Hive HCatalog ...................................... SKIPPED
[INFO] Hive HCatalog Core ................................. SKIPPED
[INFO] Hive HCatalog Pig Adapter .......................... SKIPPED
[INFO] Hive HCatalog Server Extensions .................... SKIPPED
[INFO] Hive HCatalog Webhcat Java Client .................. SKIPPED
[INFO] Hive HCatalog Webhcat .............................. SKIPPED
[INFO] Hive HCatalog Streaming ............................ SKIPPED
[INFO] Hive HWI ........................................... SKIPPED
[INFO] Hive ODBC .......................................... SKIPPED
[INFO] Hive Shims Aggregator .............................. SKIPPED
[INFO] Hive TestUtils ..................................... SKIPPED
[INFO] Hive Packaging ..................................... SKIPPED
[INFO] ------------------------------------------------------------------------
[INFO] BUILD FAILURE
[INFO] ------------------------------------------------------------------------
[INFO] Total time: 11:26 min
[INFO] Finished at: 2015-03-10T22:51:30-07:00
[INFO] Final Memory: 72M/451M
[INFO] ------------------------------------------------------------------------
[WARNING] The requested profile "disist" could not be activated because it does not exist.
[ERROR] Failed to execute goal on project hive-exec: Could not resolve dependencies for project
org.apache.hive:hive-exec:jar:1.0.0: The following artifacts could not be resolved: org.pentaho:pentaho-aggdesigner-algorithm:jar:5.1.3-jhyde,
eigenbase:eigenbase-properties:jar:1.1.4, net.hydromatic:linq4j:jar:0.4, net.hydromatic:quidem:jar:0.1.1:
Could not find artifact org.pentaho:pentaho-aggdesigner-algorithm:jar:5.1.3-jhyde in nexus-osc
(http://maven.oschina.net/content/groups/public/) -> [Help 1]




--
This message was sent by Atlassian JIRA
(v6.3.4#6332)

Mime
View raw message