hive-dev mailing list archives

Site index · List index
Message view « Date » · « Thread »
Top « Date » · « Thread »
From Brock Noland <br...@cloudera.com>
Subject Re: [VOTE] Apache Hive 1.1.0 Release Candidate 0
Date Mon, 16 Feb 2015 20:48:48 GMT
Thanks guys, I will fix those issues. The code issue in
https://issues.apache.org/jira/browse/HIVE-9701 has a patch up.

On Sun, Feb 15, 2015 at 3:51 PM, Xuefu Zhang <xzhang@cloudera.com> wrote:

> Downloaded the source and build fails for test with -Phadoop-1
>
> [INFO] Reactor Summary:
> [INFO]
> [INFO] Hive Integration - Parent ......................... SUCCESS [  2.613
> s]
> [INFO] Hive Integration - Custom Serde ................... SUCCESS [  2.708
> s]
> [INFO] Hive Integration - HCatalog Unit Tests ............ SUCCESS [  1.878
> s]
> [INFO] Hive Integration - Testing Utilities .............. SUCCESS [  2.521
> s]
> [INFO] Hive Integration - Unit Tests ..................... SUCCESS [  4.175
> s]
> [INFO] Hive Integration - Test Serde ..................... SUCCESS [  0.473
> s]
> [INFO] Hive Integration - QFile Tests .................... SUCCESS [  5.026
> s]
> [INFO] JMH benchmark: Hive ............................... FAILURE [  1.575
> s]
> [INFO] Hive Integration - QFile Spark Tests .............. SKIPPED
> [INFO]
> ------------------------------------------------------------------------
> [INFO] BUILD FAILURE
> [INFO]
> ------------------------------------------------------------------------
> [INFO] Total time: 21.820 s
> [INFO] Finished at: 2015-02-15T15:49:48-08:00
> [INFO] Final Memory: 69M/768M
> [INFO]
> ------------------------------------------------------------------------
> [ERROR] Failed to execute goal
> org.apache.maven.plugins:maven-compiler-plugin:3.1:compile
> (default-compile) on project hive-jmh: Compilation failure: Compilation
> failure:
> [ERROR]
>
> /home/xzhang/tmp/hive1.1.0/apache-hive-1.1.0-src/itests/hive-jmh/src/main/java/org/apache/hive/benchmark/storage/ColumnarStorageBench.java:[17,30]
> package org.apache.hadoop.conf does not exist
> [ERROR]
>
> /home/xzhang/tmp/hive1.1.0/apache-hive-1.1.0-src/itests/hive-jmh/src/main/java/org/apache/hive/benchmark/storage/ColumnarStorageBench.java:[18,28]
> cannot find symbol
> [ERROR] symbol:   class FileSystem
> [ERROR] location: package org.apache.hadoop.fs
> [ERROR]
>
> /home/xzhang/tmp/hive1.1.0/apache-hive-1.1.0-src/itests/hive-jmh/src/main/java/org/apache/hive/benchmark/storage/ColumnarStorageBench.java:[19,28]
> cannot find symbol
> [ERROR] symbol:   class Path
> [ERROR] location: package org.apache.hadoop.fs
> [ERROR]
>
> /home/xzhang/tmp/hive1.1.0/apache-hive-1.1.0-src/itests/hive-jmh/src/main/java/org/apache/hive/benchmark/storage/ColumnarStorageBench.java:[41,28]
> package org.apache.hadoop.io does not exist
> [ERROR]
>
> /home/xzhang/tmp/hive1.1.0/apache-hive-1.1.0-src/itests/hive-jmh/src/main/java/org/apache/hive/benchmark/storage/ColumnarStorageBench.java:[42,28]
> package org.apache.hadoop.io does not exist
> [ERROR]
>
> /home/xzhang/tmp/hive1.1.0/apache-hive-1.1.0-src/itests/hive-jmh/src/main/java/org/apache/hive/benchmark/storage/ColumnarStorageBench.java:[43,28]
> package org.apache.hadoop.io does not exist
> [ERROR]
>
> /home/xzhang/tmp/hive1.1.0/apache-hive-1.1.0-src/itests/hive-jmh/src/main/java/org/apache/hive/benchmark/storage/ColumnarStorageBench.java:[44,28]
> package org.apache.hadoop.io does not exist
> [ERROR]
>
> /home/xzhang/tmp/hive1.1.0/apache-hive-1.1.0-src/itests/hive-jmh/src/main/java/org/apache/hive/benchmark/storage/ColumnarStorageBench.java:[45,28]
> package org.apache.hadoop.io does not exist
> [ERROR]
>
> /home/xzhang/tmp/hive1.1.0/apache-hive-1.1.0-src/itests/hive-jmh/src/main/java/org/apache/hive/benchmark/storage/ColumnarStorageBench.java:[47,32]
> cannot find symbol
> [ERROR] symbol:   class FileSplit
> [ERROR] location: package org.apache.hadoop.mapred
> [ERROR]
>
> /home/xzhang/tmp/hive1.1.0/apache-hive-1.1.0-src/itests/hive-jmh/src/main/java/org/apache/hive/benchmark/storage/ColumnarStorageBench.java:[48,32]
> cannot find symbol
> [ERROR] symbol:   class InputFormat
> [ERROR] location: package org.apache.hadoop.mapred
> [ERROR]
>
> /home/xzhang/tmp/hive1.1.0/apache-hive-1.1.0-src/itests/hive-jmh/src/main/java/org/apache/hive/benchmark/storage/ColumnarStorageBench.java:[49,32]
> cannot find symbol
> [ERROR] symbol:   class JobConf
> [ERROR] location: package org.apache.hadoop.mapred
> [ERROR]
>
> /home/xzhang/tmp/hive1.1.0/apache-hive-1.1.0-src/itests/hive-jmh/src/main/java/org/apache/hive/benchmark/storage/ColumnarStorageBench.java:[50,32]
> cannot find symbol
> [ERROR] symbol:   class RecordReader
> [ERROR] location: package org.apache.hadoop.mapred
> [ERROR]
>
> /home/xzhang/tmp/hive1.1.0/apache-hive-1.1.0-src/itests/hive-jmh/src/main/java/org/apache/hive/benchmark/storage/ColumnarStorageBench.java:[100,11]
> cannot find symbol
> [ERROR] symbol:   class Path
> [ERROR] location: class
> org.apache.hive.benchmark.storage.ColumnarStorageBench
> [ERROR]
>
> /home/xzhang/tmp/hive1.1.0/apache-hive-1.1.0-src/itests/hive-jmh/src/main/java/org/apache/hive/benchmark/storage/ColumnarStorageBench.java:[101,11]
> cannot find symbol
> [ERROR] symbol:   class FileSystem
> [ERROR] location: class
> org.apache.hive.benchmark.storage.ColumnarStorageBench
> [ERROR]
>
> /home/xzhang/tmp/hive1.1.0/apache-hive-1.1.0-src/itests/hive-jmh/src/main/java/org/apache/hive/benchmark/storage/ColumnarStorageBench.java:[109,11]
> cannot find symbol
> [ERROR] symbol:   class RecordReader
> [ERROR] location: class
> org.apache.hive.benchmark.storage.ColumnarStorageBench
> [ERROR]
>
> /home/xzhang/tmp/hive1.1.0/apache-hive-1.1.0-src/itests/hive-jmh/src/main/java/org/apache/hive/benchmark/storage/ColumnarStorageBench.java:[114,11]
> cannot find symbol
> [ERROR] symbol:   class Writable
> [ERROR] location: class
> org.apache.hive.benchmark.storage.ColumnarStorageBench
> [ERROR]
>
> /home/xzhang/tmp/hive1.1.0/apache-hive-1.1.0-src/itests/hive-jmh/src/main/java/org/apache/hive/benchmark/storage/ColumnarStorageBench.java:[155,27]
> cannot find symbol
> [ERROR] symbol:   class Path
> [ERROR] location: class
> org.apache.hive.benchmark.storage.ColumnarStorageBench
> [ERROR]
>
> /home/xzhang/tmp/hive1.1.0/apache-hive-1.1.0-src/itests/hive-jmh/src/main/java/org/apache/hive/benchmark/storage/ColumnarStorageBench.java:[159,32]
> cannot find symbol
> [ERROR] symbol:   class Writable
> [ERROR] location: class
> org.apache.hive.benchmark.storage.ColumnarStorageBench
> [ERROR]
>
> /home/xzhang/tmp/hive1.1.0/apache-hive-1.1.0-src/itests/hive-jmh/src/main/java/org/apache/hive/benchmark/storage/ColumnarStorageBench.java:[159,11]
> cannot find symbol
> [ERROR] symbol:   class ArrayWritable
> [ERROR] location: class
> org.apache.hive.benchmark.storage.ColumnarStorageBench
> [ERROR]
>
> /home/xzhang/tmp/hive1.1.0/apache-hive-1.1.0-src/itests/hive-jmh/src/main/java/org/apache/hive/benchmark/storage/ColumnarStorageBench.java:[163,11]
> cannot find symbol
> [ERROR] symbol:   class Writable
> [ERROR] location: class
> org.apache.hive.benchmark.storage.ColumnarStorageBench
> [ERROR]
>
> /home/xzhang/tmp/hive1.1.0/apache-hive-1.1.0-src/itests/hive-jmh/src/main/java/org/apache/hive/benchmark/storage/ColumnarStorageBench.java:[184,11]
> cannot find symbol
> [ERROR] symbol:   class ArrayWritable
> [ERROR] location: class
> org.apache.hive.benchmark.storage.ColumnarStorageBench
> [ERROR]
>
> /home/xzhang/tmp/hive1.1.0/apache-hive-1.1.0-src/itests/hive-jmh/src/main/java/org/apache/hive/benchmark/storage/ColumnarStorageBench.java:[407,10]
> cannot find symbol
> [ERROR] symbol:   class Writable
> [ERROR] location: class
> org.apache.hive.benchmark.storage.ColumnarStorageBench
> [ERROR]
>
> /home/xzhang/tmp/hive1.1.0/apache-hive-1.1.0-src/itests/hive-jmh/src/main/java/org/apache/hive/benchmark/storage/ColumnarStorageBench.java:[422,10]
> cannot find symbol
> [ERROR] symbol:   class RecordReader
> [ERROR] location: class
> org.apache.hive.benchmark.storage.ColumnarStorageBench
> [ERROR]
>
> /home/xzhang/tmp/hive1.1.0/apache-hive-1.1.0-src/itests/hive-jmh/src/main/java/org/apache/hive/benchmark/storage/ColumnarStorageBench.java:[234,13]
> cannot find symbol
> [ERROR] symbol:   class JobConf
> [ERROR] location: class
> org.apache.hive.benchmark.storage.ColumnarStorageBench.StorageFormatTest
> [ERROR]
>
> /home/xzhang/tmp/hive1.1.0/apache-hive-1.1.0-src/itests/hive-jmh/src/main/java/org/apache/hive/benchmark/storage/ColumnarStorageBench.java:[236,13]
> cannot find symbol
> [ERROR] symbol:   class InputFormat
> [ERROR] location: class
> org.apache.hive.benchmark.storage.ColumnarStorageBench.StorageFormatTest
> [ERROR]
>
> /home/xzhang/tmp/hive1.1.0/apache-hive-1.1.0-src/itests/hive-jmh/src/main/java/org/apache/hive/benchmark/storage/ColumnarStorageBench.java:[238,82]
> cannot find symbol
> [ERROR] symbol:   class InputFormat
> [ERROR] location: class
> org.apache.hive.benchmark.storage.ColumnarStorageBench.StorageFormatTest
> [ERROR]
>
> /home/xzhang/tmp/hive1.1.0/apache-hive-1.1.0-src/itests/hive-jmh/src/main/java/org/apache/hive/benchmark/storage/ColumnarStorageBench.java:[248,12]
> cannot find symbol
> [ERROR] symbol:   class Writable
> [ERROR] location: class
> org.apache.hive.benchmark.storage.ColumnarStorageBench.StorageFormatTest
> [ERROR]
>
> /home/xzhang/tmp/hive1.1.0/apache-hive-1.1.0-src/itests/hive-jmh/src/main/java/org/apache/hive/benchmark/storage/ColumnarStorageBench.java:[252,31]
> cannot find symbol
> [ERROR] symbol:   class Writable
> [ERROR] location: class
> org.apache.hive.benchmark.storage.ColumnarStorageBench.StorageFormatTest
> [ERROR]
>
> /home/xzhang/tmp/hive1.1.0/apache-hive-1.1.0-src/itests/hive-jmh/src/main/java/org/apache/hive/benchmark/storage/ColumnarStorageBench.java:[258,51]
> cannot find symbol
> [ERROR] symbol:   class Writable
> [ERROR] location: class
> org.apache.hive.benchmark.storage.ColumnarStorageBench.StorageFormatTest
> [ERROR]
>
> /home/xzhang/tmp/hive1.1.0/apache-hive-1.1.0-src/itests/hive-jmh/src/main/java/org/apache/hive/benchmark/storage/ColumnarStorageBench.java:[266,31]
> cannot find symbol
> [ERROR] symbol:   class RecordReader
> [ERROR] location: class
> org.apache.hive.benchmark.storage.ColumnarStorageBench.StorageFormatTest
> [ERROR]
>
> /home/xzhang/tmp/hive1.1.0/apache-hive-1.1.0-src/itests/hive-jmh/src/main/java/org/apache/hive/benchmark/storage/ColumnarStorageBench.java:[277,41]
> cannot find symbol
> [ERROR] symbol:   class Path
> [ERROR] location: class
> org.apache.hive.benchmark.storage.ColumnarStorageBench.StorageFormatTest
> [ERROR]
>
> /home/xzhang/tmp/hive1.1.0/apache-hive-1.1.0-src/itests/hive-jmh/src/main/java/org/apache/hive/benchmark/storage/ColumnarStorageBench.java:[281,41]
> cannot find symbol
> [ERROR] symbol:   class Path
> [ERROR] location: class
> org.apache.hive.benchmark.storage.ColumnarStorageBench.StorageFormatTest
> [ERROR]
>
> /home/xzhang/tmp/hive1.1.0/apache-hive-1.1.0-src/itests/hive-jmh/src/main/java/org/apache/hive/benchmark/storage/ColumnarStorageBench.java:[281,12]
> cannot find symbol
> [ERROR] symbol:   class RecordReader
> [ERROR] location: class
> org.apache.hive.benchmark.storage.ColumnarStorageBench.StorageFormatTest
> [ERROR]
>
> /home/xzhang/tmp/hive1.1.0/apache-hive-1.1.0-src/itests/hive-jmh/src/main/java/org/apache/hive/benchmark/storage/ColumnarStorageBench.java:[17,30]
> package org.apache.hadoop.conf does not exist
> [ERROR]
>
> /home/xzhang/tmp/hive1.1.0/apache-hive-1.1.0-src/itests/hive-jmh/src/main/java/org/apache/hive/benchmark/storage/ColumnarStorageBench.java:[18,28]
> cannot find symbol
> [ERROR] symbol:   class FileSystem
> [ERROR] location: package org.apache.hadoop.fs
> [ERROR]
>
> /home/xzhang/tmp/hive1.1.0/apache-hive-1.1.0-src/itests/hive-jmh/src/main/java/org/apache/hive/benchmark/storage/ColumnarStorageBench.java:[19,28]
> cannot find symbol
> [ERROR] symbol:   class Path
> [ERROR] location: package org.apache.hadoop.fs
> [ERROR]
>
> /home/xzhang/tmp/hive1.1.0/apache-hive-1.1.0-src/itests/hive-jmh/src/main/java/org/apache/hive/benchmark/storage/ColumnarStorageBench.java:[41,28]
> package org.apache.hadoop.io does not exist
> [ERROR]
>
> /home/xzhang/tmp/hive1.1.0/apache-hive-1.1.0-src/itests/hive-jmh/src/main/java/org/apache/hive/benchmark/storage/ColumnarStorageBench.java:[42,28]
> package org.apache.hadoop.io does not exist
> [ERROR]
>
> /home/xzhang/tmp/hive1.1.0/apache-hive-1.1.0-src/itests/hive-jmh/src/main/java/org/apache/hive/benchmark/storage/ColumnarStorageBench.java:[43,28]
> package org.apache.hadoop.io does not exist
> [ERROR]
>
> /home/xzhang/tmp/hive1.1.0/apache-hive-1.1.0-src/itests/hive-jmh/src/main/java/org/apache/hive/benchmark/storage/ColumnarStorageBench.java:[44,28]
> package org.apache.hadoop.io does not exist
> [ERROR]
>
> /home/xzhang/tmp/hive1.1.0/apache-hive-1.1.0-src/itests/hive-jmh/src/main/java/org/apache/hive/benchmark/storage/ColumnarStorageBench.java:[45,28]
> package org.apache.hadoop.io does not exist
> [ERROR]
>
> /home/xzhang/tmp/hive1.1.0/apache-hive-1.1.0-src/itests/hive-jmh/src/main/java/org/apache/hive/benchmark/storage/ColumnarStorageBench.java:[47,32]
> cannot find symbol
> [ERROR] symbol:   class FileSplit
> [ERROR] location: package org.apache.hadoop.mapred
> [ERROR]
>
> /home/xzhang/tmp/hive1.1.0/apache-hive-1.1.0-src/itests/hive-jmh/src/main/java/org/apache/hive/benchmark/storage/ColumnarStorageBench.java:[48,32]
> cannot find symbol
> [ERROR] symbol:   class InputFormat
> [ERROR] location: package org.apache.hadoop.mapred
> [ERROR]
>
> /home/xzhang/tmp/hive1.1.0/apache-hive-1.1.0-src/itests/hive-jmh/src/main/java/org/apache/hive/benchmark/storage/ColumnarStorageBench.java:[49,32]
> cannot find symbol
> [ERROR] symbol:   class JobConf
> [ERROR] location: package org.apache.hadoop.mapred
> [ERROR]
>
> /home/xzhang/tmp/hive1.1.0/apache-hive-1.1.0-src/itests/hive-jmh/src/main/java/org/apache/hive/benchmark/storage/ColumnarStorageBench.java:[50,32]
> cannot find symbol
> [ERROR] symbol:   class RecordReader
> [ERROR] location: package org.apache.hadoop.mapred
> [ERROR]
>
> /home/xzhang/tmp/hive1.1.0/apache-hive-1.1.0-src/itests/hive-jmh/src/main/java/org/apache/hive/benchmark/storage/ColumnarStorageBench.java:[100,11]
> cannot find symbol
> [ERROR] symbol:   class Path
> [ERROR] location: class
> org.apache.hive.benchmark.storage.ColumnarStorageBench
> [ERROR]
>
> /home/xzhang/tmp/hive1.1.0/apache-hive-1.1.0-src/itests/hive-jmh/src/main/java/org/apache/hive/benchmark/storage/ColumnarStorageBench.java:[101,11]
> cannot find symbol
> [ERROR] symbol:   class FileSystem
> [ERROR] location: class
> org.apache.hive.benchmark.storage.ColumnarStorageBench
> [ERROR]
>
> /home/xzhang/tmp/hive1.1.0/apache-hive-1.1.0-src/itests/hive-jmh/src/main/java/org/apache/hive/benchmark/storage/ColumnarStorageBench.java:[109,11]
> cannot find symbol
> [ERROR] symbol:   class RecordReader
> [ERROR] location: class
> org.apache.hive.benchmark.storage.ColumnarStorageBench
> [ERROR]
>
> /home/xzhang/tmp/hive1.1.0/apache-hive-1.1.0-src/itests/hive-jmh/src/main/java/org/apache/hive/benchmark/storage/ColumnarStorageBench.java:[114,11]
> cannot find symbol
> [ERROR] symbol:   class Writable
> [ERROR] location: class
> org.apache.hive.benchmark.storage.ColumnarStorageBench
> [ERROR]
>
> /home/xzhang/tmp/hive1.1.0/apache-hive-1.1.0-src/itests/hive-jmh/src/main/java/org/apache/hive/benchmark/storage/ColumnarStorageBench.java:[155,27]
> cannot find symbol
> [ERROR] symbol:   class Path
> [ERROR] location: class
> org.apache.hive.benchmark.storage.ColumnarStorageBench
> [ERROR]
>
> /home/xzhang/tmp/hive1.1.0/apache-hive-1.1.0-src/itests/hive-jmh/src/main/java/org/apache/hive/benchmark/storage/ColumnarStorageBench.java:[159,32]
> cannot find symbol
> [ERROR] symbol:   class Writable
> [ERROR] location: class
> org.apache.hive.benchmark.storage.ColumnarStorageBench
> [ERROR]
>
> /home/xzhang/tmp/hive1.1.0/apache-hive-1.1.0-src/itests/hive-jmh/src/main/java/org/apache/hive/benchmark/storage/ColumnarStorageBench.java:[159,11]
> cannot find symbol
> [ERROR] symbol:   class ArrayWritable
> [ERROR] location: class
> org.apache.hive.benchmark.storage.ColumnarStorageBench
> [ERROR]
>
> /home/xzhang/tmp/hive1.1.0/apache-hive-1.1.0-src/itests/hive-jmh/src/main/java/org/apache/hive/benchmark/storage/ColumnarStorageBench.java:[163,11]
> cannot find symbol
> [ERROR] symbol:   class Writable
> [ERROR] location: class
> org.apache.hive.benchmark.storage.ColumnarStorageBench
> [ERROR]
>
> /home/xzhang/tmp/hive1.1.0/apache-hive-1.1.0-src/itests/hive-jmh/src/main/java/org/apache/hive/benchmark/storage/ColumnarStorageBench.java:[184,11]
> cannot find symbol
> [ERROR] symbol:   class ArrayWritable
> [ERROR] location: class
> org.apache.hive.benchmark.storage.ColumnarStorageBench
> [ERROR]
>
> /home/xzhang/tmp/hive1.1.0/apache-hive-1.1.0-src/itests/hive-jmh/src/main/java/org/apache/hive/benchmark/storage/ColumnarStorageBench.java:[407,10]
> cannot find symbol
> [ERROR] symbol:   class Writable
> [ERROR] location: class
> org.apache.hive.benchmark.storage.ColumnarStorageBench
> [ERROR]
>
> /home/xzhang/tmp/hive1.1.0/apache-hive-1.1.0-src/itests/hive-jmh/src/main/java/org/apache/hive/benchmark/storage/ColumnarStorageBench.java:[422,10]
> cannot find symbol
> [ERROR] symbol:   class RecordReader
> [ERROR] location: class
> org.apache.hive.benchmark.storage.ColumnarStorageBench
> [ERROR]
>
> /home/xzhang/tmp/hive1.1.0/apache-hive-1.1.0-src/itests/hive-jmh/src/main/java/org/apache/hive/benchmark/storage/ColumnarStorageBench.java:[234,13]
> cannot find symbol
> [ERROR] symbol:   class JobConf
> [ERROR] location: class
> org.apache.hive.benchmark.storage.ColumnarStorageBench.StorageFormatTest
> [ERROR]
>
> /home/xzhang/tmp/hive1.1.0/apache-hive-1.1.0-src/itests/hive-jmh/src/main/java/org/apache/hive/benchmark/storage/ColumnarStorageBench.java:[236,13]
> cannot find symbol
> [ERROR] symbol:   class InputFormat
> [ERROR] location: class
> org.apache.hive.benchmark.storage.ColumnarStorageBench.StorageFormatTest
> [ERROR]
>
> /home/xzhang/tmp/hive1.1.0/apache-hive-1.1.0-src/itests/hive-jmh/src/main/java/org/apache/hive/benchmark/storage/ColumnarStorageBench.java:[238,82]
> cannot find symbol
> [ERROR] symbol:   class InputFormat
> [ERROR] location: class
> org.apache.hive.benchmark.storage.ColumnarStorageBench.StorageFormatTest
> [ERROR]
>
> /home/xzhang/tmp/hive1.1.0/apache-hive-1.1.0-src/itests/hive-jmh/src/main/java/org/apache/hive/benchmark/storage/ColumnarStorageBench.java:[248,12]
> cannot find symbol
> [ERROR] symbol:   class Writable
> [ERROR] location: class
> org.apache.hive.benchmark.storage.ColumnarStorageBench.StorageFormatTest
> [ERROR]
>
> /home/xzhang/tmp/hive1.1.0/apache-hive-1.1.0-src/itests/hive-jmh/src/main/java/org/apache/hive/benchmark/storage/ColumnarStorageBench.java:[252,31]
> cannot find symbol
> [ERROR] symbol:   class Writable
> [ERROR] location: class
> org.apache.hive.benchmark.storage.ColumnarStorageBench.StorageFormatTest
> [ERROR]
>
> /home/xzhang/tmp/hive1.1.0/apache-hive-1.1.0-src/itests/hive-jmh/src/main/java/org/apache/hive/benchmark/storage/ColumnarStorageBench.java:[258,51]
> cannot find symbol
> [ERROR] symbol:   class Writable
> [ERROR] location: class
> org.apache.hive.benchmark.storage.ColumnarStorageBench.StorageFormatTest
> [ERROR]
>
> /home/xzhang/tmp/hive1.1.0/apache-hive-1.1.0-src/itests/hive-jmh/src/main/java/org/apache/hive/benchmark/storage/ColumnarStorageBench.java:[266,31]
> cannot find symbol
> [ERROR] symbol:   class RecordReader
> [ERROR] location: class
> org.apache.hive.benchmark.storage.ColumnarStorageBench.StorageFormatTest
> [ERROR]
>
> /home/xzhang/tmp/hive1.1.0/apache-hive-1.1.0-src/itests/hive-jmh/src/main/java/org/apache/hive/benchmark/storage/ColumnarStorageBench.java:[277,41]
> cannot find symbol
> [ERROR] symbol:   class Path
> [ERROR] location: class
> org.apache.hive.benchmark.storage.ColumnarStorageBench.StorageFormatTest
> [ERROR]
>
> /home/xzhang/tmp/hive1.1.0/apache-hive-1.1.0-src/itests/hive-jmh/src/main/java/org/apache/hive/benchmark/storage/ColumnarStorageBench.java:[281,41]
> cannot find symbol
> [ERROR] symbol:   class Path
> [ERROR] location: class
> org.apache.hive.benchmark.storage.ColumnarStorageBench.StorageFormatTest
> [ERROR]
>
> /home/xzhang/tmp/hive1.1.0/apache-hive-1.1.0-src/itests/hive-jmh/src/main/java/org/apache/hive/benchmark/storage/ColumnarStorageBench.java:[281,12]
> cannot find symbol
> [ERROR] symbol:   class RecordReader
> [ERROR] location: class
> org.apache.hive.benchmark.storage.ColumnarStorageBench.StorageFormatTest
> [ERROR]
>
> /home/xzhang/tmp/hive1.1.0/apache-hive-1.1.0-src/itests/hive-jmh/src/main/java/org/apache/hive/benchmark/storage/ColumnarStorageBench.java:[133,26]
> cannot find symbol
> [ERROR] symbol:   class Writable
> [ERROR] location: class
> org.apache.hive.benchmark.storage.ColumnarStorageBench
> [ERROR]
>
> /home/xzhang/tmp/hive1.1.0/apache-hive-1.1.0-src/itests/hive-jmh/src/main/java/org/apache/hive/benchmark/storage/ColumnarStorageBench.java:[160,16]
> cannot find symbol
> [ERROR] symbol:   class ArrayWritable
> [ERROR] location: class
> org.apache.hive.benchmark.storage.ColumnarStorageBench
> [ERROR]
>
> /home/xzhang/tmp/hive1.1.0/apache-hive-1.1.0-src/itests/hive-jmh/src/main/java/org/apache/hive/benchmark/storage/ColumnarStorageBench.java:[160,30]
> cannot find symbol
> [ERROR] symbol:   class Writable
> [ERROR] location: class
> org.apache.hive.benchmark.storage.ColumnarStorageBench
> [ERROR]
>
> /home/xzhang/tmp/hive1.1.0/apache-hive-1.1.0-src/itests/hive-jmh/src/main/java/org/apache/hive/benchmark/storage/ColumnarStorageBench.java:[168,20]
> cannot find symbol
> [ERROR] symbol:   class IntWritable
> [ERROR] location: class
> org.apache.hive.benchmark.storage.ColumnarStorageBench
> [ERROR]
>
> /home/xzhang/tmp/hive1.1.0/apache-hive-1.1.0-src/itests/hive-jmh/src/main/java/org/apache/hive/benchmark/storage/ColumnarStorageBench.java:[172,20]
> cannot find symbol
> [ERROR] symbol:   class BooleanWritable
> [ERROR] location: class
> org.apache.hive.benchmark.storage.ColumnarStorageBench
> [ERROR]
>
> /home/xzhang/tmp/hive1.1.0/apache-hive-1.1.0-src/itests/hive-jmh/src/main/java/org/apache/hive/benchmark/storage/ColumnarStorageBench.java:[178,20]
> cannot find symbol
> [ERROR] symbol:   class BytesWritable
> [ERROR] location: class
> org.apache.hive.benchmark.storage.ColumnarStorageBench
> [ERROR]
>
> /home/xzhang/tmp/hive1.1.0/apache-hive-1.1.0-src/itests/hive-jmh/src/main/java/org/apache/hive/benchmark/storage/ColumnarStorageBench.java:[185,5]
> cannot find symbol
> [ERROR] symbol:   class Writable
> [ERROR] location: class
> org.apache.hive.benchmark.storage.ColumnarStorageBench
> [ERROR]
>
> /home/xzhang/tmp/hive1.1.0/apache-hive-1.1.0-src/itests/hive-jmh/src/main/java/org/apache/hive/benchmark/storage/ColumnarStorageBench.java:[185,29]
> cannot find symbol
> [ERROR] symbol:   class Writable
> [ERROR] location: class
> org.apache.hive.benchmark.storage.ColumnarStorageBench
> [ERROR]
>
> /home/xzhang/tmp/hive1.1.0/apache-hive-1.1.0-src/itests/hive-jmh/src/main/java/org/apache/hive/benchmark/storage/ColumnarStorageBench.java:[239,21]
> cannot find symbol
> [ERROR] symbol:   class JobConf
> [ERROR] location: class
> org.apache.hive.benchmark.storage.ColumnarStorageBench.StorageFormatTest
> [ERROR]
>
> /home/xzhang/tmp/hive1.1.0/apache-hive-1.1.0-src/itests/hive-jmh/src/main/java/org/apache/hive/benchmark/storage/ColumnarStorageBench.java:[244,7]
> cannot find symbol
> [ERROR] symbol:   class Configuration
> [ERROR] location: class
> org.apache.hive.benchmark.storage.ColumnarStorageBench.StorageFormatTest
> [ERROR]
>
> /home/xzhang/tmp/hive1.1.0/apache-hive-1.1.0-src/itests/hive-jmh/src/main/java/org/apache/hive/benchmark/storage/ColumnarStorageBench.java:[244,32]
> cannot find symbol
> [ERROR] symbol:   class Configuration
> [ERROR] location: class
> org.apache.hive.benchmark.storage.ColumnarStorageBench.StorageFormatTest
> [ERROR]
>
> /home/xzhang/tmp/hive1.1.0/apache-hive-1.1.0-src/itests/hive-jmh/src/main/java/org/apache/hive/benchmark/storage/ColumnarStorageBench.java:[278,26]
> cannot access org.apache.hadoop.mapred.OutputFormat
> [ERROR] class file for org.apache.hadoop.mapred.OutputFormat not found
> [ERROR]
>
> /home/xzhang/tmp/hive1.1.0/apache-hive-1.1.0-src/itests/hive-jmh/src/main/java/org/apache/hive/benchmark/storage/ColumnarStorageBench.java:[283,15]
> cannot find symbol
> [ERROR] symbol:   class FileSplit
> [ERROR] location: class
> org.apache.hive.benchmark.storage.ColumnarStorageBench.StorageFormatTest
> [ERROR]
>
> /home/xzhang/tmp/hive1.1.0/apache-hive-1.1.0-src/itests/hive-jmh/src/main/java/org/apache/hive/benchmark/storage/ColumnarStorageBench.java:[293,12]
> cannot access org.apache.hadoop.mapred.FileOutputFormat
> [ERROR] class file for org.apache.hadoop.mapred.FileOutputFormat not found
> [ERROR]
>
> /home/xzhang/tmp/hive1.1.0/apache-hive-1.1.0-src/itests/hive-jmh/src/main/java/org/apache/hive/benchmark/storage/ColumnarStorageBench.java:[342,34]
> cannot find symbol
> [ERROR] symbol:   class Configuration
> [ERROR] location: class
> org.apache.hive.benchmark.storage.ColumnarStorageBench
> [ERROR]
>
> /home/xzhang/tmp/hive1.1.0/apache-hive-1.1.0-src/itests/hive-jmh/src/main/java/org/apache/hive/benchmark/storage/ColumnarStorageBench.java:[342,10]
> cannot find symbol
> [ERROR] symbol:   variable FileSystem
> [ERROR] location: class
> org.apache.hive.benchmark.storage.ColumnarStorageBench
> [ERROR]
>
> /home/xzhang/tmp/hive1.1.0/apache-hive-1.1.0-src/itests/hive-jmh/src/main/java/org/apache/hive/benchmark/storage/ColumnarStorageBench.java:[345,21]
> cannot find symbol
> [ERROR] symbol:   class Path
> [ERROR] location: class
> org.apache.hive.benchmark.storage.ColumnarStorageBench
> [ERROR]
>
> /home/xzhang/tmp/hive1.1.0/apache-hive-1.1.0-src/itests/hive-jmh/src/main/java/org/apache/hive/benchmark/storage/ColumnarStorageBench.java:[348,20]
> cannot find symbol
> [ERROR] symbol:   class Path
> [ERROR] location: class
> org.apache.hive.benchmark.storage.ColumnarStorageBench
> [ERROR]
>
> /home/xzhang/tmp/hive1.1.0/apache-hive-1.1.0-src/itests/hive-jmh/src/main/java/org/apache/hive/benchmark/storage/ColumnarStorageBench.java:[375,28]
> cannot find symbol
> [ERROR] symbol:   class Path
> [ERROR] location: class
> org.apache.hive.benchmark.storage.ColumnarStorageBench
> [ERROR] -> [Help 1]
> [ERROR]
> [ERROR] To see the full stack trace of the errors, re-run Maven with the -e
> switch.
> [ERROR] Re-run Maven using the -X switch to enable full debug logging.
> [ERROR]
> [ERROR] For more information about the errors and possible solutions,
> please read the following articles:
> [ERROR] [Help 1]
> http://cwiki.apache.org/confluence/display/MAVEN/MojoFailureException
> [ERROR]
> [ERROR] After correcting the problems, you can resume the build with the
> command
> [ERROR]   mvn <goals> -rf :hive-jmh
>
>
> On Sat, Feb 14, 2015 at 9:14 PM, Szehon Ho <szehon@cloudera.com> wrote:
>
> > Hi Brock,
> >
> > Where is your key used to sign the release?  I checked in usual places (
> > https://people.apache.org/keys/group/hive.asc,
> > https://people.apache.org/keys/group/hive.asc) and couldn't find your
> key
> > in there?  I might be missing the location.
> >
> > Other that than, everything checks out:
> > 1. Verified md5 on src and bin
> > 2. Built src, ran queries from both HiveCLI and Beeline
> > 3. On bin, ran queries from both HiveCLI and Beeline
> > 4. Verified no SNAPSHOT dependencies listed in poms
> >
> > Thanks
> > Szehon
> >
> > On Sat, Feb 14, 2015 at 2:48 PM, Brock Noland <brock@cloudera.com>
> wrote:
> >
> > > Apache Hive 1.1.0 Release Candidate 0 is available here:
> > > http://people.apache.org/~brock/apache-hive-1.1.0-rc0/
> > >
> > > Maven artifacts are available here:
> > > *
> https://repository.apache.org/content/repositories/orgapachehive-1023/
> > > <
> https://repository.apache.org/content/repositories/orgapachehive-1023/
> > >*
> > >
> > > Source tag for RC1 is at:
> > > http://svn.apache.org/repos/asf/hive/tags/release-1.1.0-rc0/
> > >
> > > Voting will conclude in 96 hours (due to the holiday)
> > >
> >
>

Mime
  • Unnamed multipart/alternative (inline, None, 0 bytes)
View raw message