hive-dev mailing list archives

Site index · List index
Message view « Date » · « Thread »
Top « Date » · « Thread »
From "Hive QA (JIRA)" <j...@apache.org>
Subject [jira] [Commented] (HIVE-9471) Bad seek in uncompressed ORC, at row-group boundary.
Date Thu, 29 Jan 2015 15:27:35 GMT

    [ https://issues.apache.org/jira/browse/HIVE-9471?page=com.atlassian.jira.plugin.system.issuetabpanels:comment-tabpanel&focusedCommentId=14297013#comment-14297013
] 

Hive QA commented on HIVE-9471:
-------------------------------



{color:red}Overall{color}: -1 at least one tests failed

Here are the results of testing the latest attachment:
https://issues.apache.org/jira/secure/attachment/12695233/HIVE-9471.3.patch

{color:red}ERROR:{color} -1 due to 5 failed/errored test(s), 7405 tests executed
*Failed tests:*
{noformat}
org.apache.hadoop.hive.cli.TestSparkCliDriver.testCliDriver_join38
org.apache.hadoop.hive.cli.TestSparkCliDriver.testCliDriver_subquery_in
org.apache.hadoop.hive.thrift.TestHadoop20SAuthBridge.testMetastoreProxyUser
org.apache.hadoop.hive.thrift.TestHadoop20SAuthBridge.testSaslWithHiveMetaStore
org.apache.hive.hcatalog.templeton.TestWebHCatE2e.getHiveVersion
{noformat}

Test results: http://ec2-174-129-184-35.compute-1.amazonaws.com/jenkins/job/PreCommit-HIVE-TRUNK-Build/2569/testReport
Console output: http://ec2-174-129-184-35.compute-1.amazonaws.com/jenkins/job/PreCommit-HIVE-TRUNK-Build/2569/console
Test logs: http://ec2-174-129-184-35.compute-1.amazonaws.com/logs/PreCommit-HIVE-TRUNK-Build-2569/

Messages:
{noformat}
Executing org.apache.hive.ptest.execution.PrepPhase
Executing org.apache.hive.ptest.execution.ExecutionPhase
Executing org.apache.hive.ptest.execution.ReportingPhase
Tests exited with: TestsFailedException: 5 tests failed
{noformat}

This message is automatically generated.

ATTACHMENT ID: 12695233 - PreCommit-HIVE-TRUNK-Build

> Bad seek in uncompressed ORC, at row-group boundary.
> ----------------------------------------------------
>
>                 Key: HIVE-9471
>                 URL: https://issues.apache.org/jira/browse/HIVE-9471
>             Project: Hive
>          Issue Type: Bug
>          Components: File Formats, Serializers/Deserializers
>    Affects Versions: 0.14.0
>            Reporter: Mithun Radhakrishnan
>            Assignee: Mithun Radhakrishnan
>         Attachments: HIVE-9471.2.patch, HIVE-9471.3.patch, data.txt, orc_bad_seek_failure_case.hive,
orc_bad_seek_setup.hive
>
>
> Under at least one specific condition, using index-filters in ORC causes a bad seek into
the ORC row-group.
> {code:title=stacktrace}
> java.io.IOException: java.lang.IllegalArgumentException: Seek in Stream for column 2
kind DATA to 0 is outside of the data
> 	at org.apache.hadoop.hive.ql.exec.FetchOperator.getNextRow(FetchOperator.java:507)
> 	at org.apache.hadoop.hive.ql.exec.FetchOperator.pushRow(FetchOperator.java:414)
> 	at org.apache.hadoop.hive.ql.exec.FetchTask.fetch(FetchTask.java:138)
> 	at org.apache.hadoop.hive.ql.Driver.getResults(Driver.java:1655)
> 	at org.apache.hadoop.hive.cli.CliDriver.processLocalCmd(CliDriver.java:227)
> 	at org.apache.hadoop.hive.cli.CliDriver.processCmd(CliDriver.java:159)
> 	at org.apache.hadoop.hive.cli.CliDriver.processLine(CliDriver.java:370)
> 	at org.apache.hadoop.hive.cli.CliDriver.processLine(CliDriver.java:305)
> ...
> Caused by: java.lang.IllegalArgumentException: Seek in Stream for column 2 kind DATA
to 0 is outside of the data
> 	at org.apache.hadoop.hive.ql.io.orc.InStream$UncompressedStream.seek(InStream.java:112)
> 	at org.apache.hadoop.hive.ql.io.orc.InStream$UncompressedStream.seek(InStream.java:96)
> 	at org.apache.hadoop.hive.ql.io.orc.RunLengthIntegerReaderV2.seek(RunLengthIntegerReaderV2.java:310)
> 	at org.apache.hadoop.hive.ql.io.orc.RecordReaderImpl$StringDictionaryTreeReader.seek(RecordReaderImpl.java:1596)
> 	at org.apache.hadoop.hive.ql.io.orc.RecordReaderImpl$StringTreeReader.seek(RecordReaderImpl.java:1337)
> 	at org.apache.hadoop.hive.ql.io.orc.RecordReaderImpl$StructTreeReader.seek(RecordReaderImpl.java:1852)
> {code}
> I'll attach the script to reproduce the problem herewith.



--
This message was sent by Atlassian JIRA
(v6.3.4#6332)

Mime
View raw message