hive-dev mailing list archives

Site index · List index
Message view « Date » · « Thread »
Top « Date » · « Thread »
From "Hive QA (JIRA)" <j...@apache.org>
Subject [jira] [Commented] (HIVE-9431) CBO (Calcite Return Path): Removing AST from ParseContext
Date Thu, 29 Jan 2015 00:28:34 GMT

    [ https://issues.apache.org/jira/browse/HIVE-9431?page=com.atlassian.jira.plugin.system.issuetabpanels:comment-tabpanel&focusedCommentId=14296140#comment-14296140
] 

Hive QA commented on HIVE-9431:
-------------------------------



{color:red}Overall{color}: -1 no tests executed

Here are the results of testing the latest attachment:
https://issues.apache.org/jira/secure/attachment/12695096/HIVE-9431.02.patch

Test results: http://ec2-174-129-184-35.compute-1.amazonaws.com/jenkins/job/PreCommit-HIVE-TRUNK-Build/2557/testReport
Console output: http://ec2-174-129-184-35.compute-1.amazonaws.com/jenkins/job/PreCommit-HIVE-TRUNK-Build/2557/console
Test logs: http://ec2-174-129-184-35.compute-1.amazonaws.com/logs/PreCommit-HIVE-TRUNK-Build-2557/

Messages:
{noformat}
**** This message was trimmed, see log for full details ****
As a result, alternative(s) 9 were disabled for that input
warning(200): IdentifiersParser.g:526:5: 
Decision can match input such as "{AMPERSAND..BITWISEXOR, DIV..DIVIDE, EQUAL..EQUAL_NS, GREATERTHAN..GREATERTHANOREQUALTO,
KW_AND, KW_ARRAY, KW_BETWEEN..KW_BOOLEAN, KW_CASE, KW_DOUBLE, KW_FLOAT, KW_IF, KW_IN, KW_INT,
KW_LIKE, KW_MAP, KW_NOT, KW_OR, KW_REGEXP, KW_RLIKE, KW_SMALLINT, KW_STRING..KW_STRUCT, KW_TINYINT,
KW_UNIONTYPE, KW_WHEN, LESSTHAN..LESSTHANOREQUALTO, MINUS..NOTEQUAL, PLUS, STAR, TILDE}" using
multiple alternatives: 1, 3

As a result, alternative(s) 3 were disabled for that input
[INFO] 
[INFO] --- maven-remote-resources-plugin:1.5:process (default) @ hive-exec ---
[INFO] 
[INFO] --- maven-resources-plugin:2.6:resources (default-resources) @ hive-exec ---
[INFO] Using 'UTF-8' encoding to copy filtered resources.
[INFO] Copying 2 resources
[INFO] Copying 3 resources
[INFO] 
[INFO] --- maven-antrun-plugin:1.7:run (define-classpath) @ hive-exec ---
[INFO] Executing tasks

main:
[INFO] Executed tasks
[INFO] 
[INFO] --- maven-compiler-plugin:3.1:compile (default-compile) @ hive-exec ---
[INFO] Compiling 2087 source files to /data/hive-ptest/working/apache-svn-trunk-source/ql/target/classes
[INFO] -------------------------------------------------------------
[ERROR] COMPILATION ERROR : 
[INFO] -------------------------------------------------------------
[ERROR] /data/hive-ptest/working/apache-svn-trunk-source/ql/src/java/org/apache/hadoop/hive/ql/parse/SemanticAnalyzer.java:[10160,1]
illegal start of expression
[ERROR] /data/hive-ptest/working/apache-svn-trunk-source/ql/src/java/org/apache/hadoop/hive/ql/parse/SemanticAnalyzer.java:[10160,3]
illegal start of expression
[ERROR] /data/hive-ptest/working/apache-svn-trunk-source/ql/src/java/org/apache/hadoop/hive/ql/parse/SemanticAnalyzer.java:[10160,5]
illegal start of expression
[ERROR] /data/hive-ptest/working/apache-svn-trunk-source/ql/src/java/org/apache/hadoop/hive/ql/parse/SemanticAnalyzer.java:[10161,5]
> expected
[ERROR] /data/hive-ptest/working/apache-svn-trunk-source/ql/src/java/org/apache/hadoop/hive/ql/parse/SemanticAnalyzer.java:[10161,17]
';' expected
[ERROR] /data/hive-ptest/working/apache-svn-trunk-source/ql/src/java/org/apache/hadoop/hive/ql/parse/SemanticAnalyzer.java:[10161,23]
illegal start of expression
[ERROR] /data/hive-ptest/working/apache-svn-trunk-source/ql/src/java/org/apache/hadoop/hive/ql/parse/SemanticAnalyzer.java:[10161,24]
';' expected
[ERROR] /data/hive-ptest/working/apache-svn-trunk-source/ql/src/java/org/apache/hadoop/hive/ql/parse/SemanticAnalyzer.java:[10163,1]
illegal start of expression
[ERROR] /data/hive-ptest/working/apache-svn-trunk-source/ql/src/java/org/apache/hadoop/hive/ql/parse/SemanticAnalyzer.java:[10163,3]
illegal start of expression
[ERROR] /data/hive-ptest/working/apache-svn-trunk-source/ql/src/java/org/apache/hadoop/hive/ql/parse/SemanticAnalyzer.java:[10163,5]
illegal start of expression
[ERROR] /data/hive-ptest/working/apache-svn-trunk-source/ql/src/java/org/apache/hadoop/hive/ql/parse/SemanticAnalyzer.java:[10163,7]
illegal start of expression
[ERROR] /data/hive-ptest/working/apache-svn-trunk-source/ql/src/java/org/apache/hadoop/hive/ql/parse/SemanticAnalyzer.java:[10164,17]
')' expected
[ERROR] /data/hive-ptest/working/apache-svn-trunk-source/ql/src/java/org/apache/hadoop/hive/ql/parse/SemanticAnalyzer.java:[10164,23]
illegal start of expression
[ERROR] /data/hive-ptest/working/apache-svn-trunk-source/ql/src/java/org/apache/hadoop/hive/ql/parse/SemanticAnalyzer.java:[10164,24]
';' expected
[ERROR] /data/hive-ptest/working/apache-svn-trunk-source/ql/src/java/org/apache/hadoop/hive/ql/parse/SemanticAnalyzer.java:[10166,1]
illegal start of expression
[ERROR] /data/hive-ptest/working/apache-svn-trunk-source/ql/src/java/org/apache/hadoop/hive/ql/parse/SemanticAnalyzer.java:[10166,4]
illegal start of expression
[ERROR] /data/hive-ptest/working/apache-svn-trunk-source/ql/src/java/org/apache/hadoop/hive/ql/parse/SemanticAnalyzer.java:[10166,7]
illegal start of expression
[ERROR] /data/hive-ptest/working/apache-svn-trunk-source/ql/src/java/org/apache/hadoop/hive/ql/parse/SemanticAnalyzer.java:[10166,18]
')' expected
[ERROR] /data/hive-ptest/working/apache-svn-trunk-source/ql/src/java/org/apache/hadoop/hive/ql/parse/SemanticAnalyzer.java:[10167,20]
not a statement
[ERROR] /data/hive-ptest/working/apache-svn-trunk-source/ql/src/java/org/apache/hadoop/hive/ql/parse/SemanticAnalyzer.java:[10167,34]
';' expected
[ERROR] /data/hive-ptest/working/apache-svn-trunk-source/ql/src/java/org/apache/hadoop/hive/ql/parse/SemanticAnalyzer.java:[10167,55]
';' expected
[ERROR] /data/hive-ptest/working/apache-svn-trunk-source/ql/src/java/org/apache/hadoop/hive/ql/parse/SemanticAnalyzer.java:[10168,20]
not a statement
[ERROR] /data/hive-ptest/working/apache-svn-trunk-source/ql/src/java/org/apache/hadoop/hive/ql/parse/SemanticAnalyzer.java:[10168,40]
';' expected
[ERROR] /data/hive-ptest/working/apache-svn-trunk-source/ql/src/java/org/apache/hadoop/hive/ql/parse/SemanticAnalyzer.java:[10168,67]
';' expected
[ERROR] /data/hive-ptest/working/apache-svn-trunk-source/ql/src/java/org/apache/hadoop/hive/ql/parse/SemanticAnalyzer.java:[10169,9]
not a statement
[ERROR] /data/hive-ptest/working/apache-svn-trunk-source/ql/src/java/org/apache/hadoop/hive/ql/parse/SemanticAnalyzer.java:[10169,22]
';' expected
[ERROR] /data/hive-ptest/working/apache-svn-trunk-source/ql/src/java/org/apache/hadoop/hive/ql/parse/SemanticAnalyzer.java:[10169,24]
not a statement
[ERROR] /data/hive-ptest/working/apache-svn-trunk-source/ql/src/java/org/apache/hadoop/hive/ql/parse/SemanticAnalyzer.java:[10169,36]
';' expected
[ERROR] /data/hive-ptest/working/apache-svn-trunk-source/ql/src/java/org/apache/hadoop/hive/ql/parse/SemanticAnalyzer.java:[10169,38]
not a statement
[ERROR] /data/hive-ptest/working/apache-svn-trunk-source/ql/src/java/org/apache/hadoop/hive/ql/parse/SemanticAnalyzer.java:[10169,41]
';' expected
[ERROR] /data/hive-ptest/working/apache-svn-trunk-source/ql/src/java/org/apache/hadoop/hive/ql/parse/SemanticAnalyzer.java:[10169,43]
not a statement
[ERROR] /data/hive-ptest/working/apache-svn-trunk-source/ql/src/java/org/apache/hadoop/hive/ql/parse/SemanticAnalyzer.java:[10169,59]
';' expected
[ERROR] /data/hive-ptest/working/apache-svn-trunk-source/ql/src/java/org/apache/hadoop/hive/ql/parse/SemanticAnalyzer.java:[10169,61]
not a statement
[ERROR] /data/hive-ptest/working/apache-svn-trunk-source/ql/src/java/org/apache/hadoop/hive/ql/parse/SemanticAnalyzer.java:[10169,72]
';' expected
[ERROR] /data/hive-ptest/working/apache-svn-trunk-source/ql/src/java/org/apache/hadoop/hive/ql/parse/SemanticAnalyzer.java:[10169,74]
not a statement
[ERROR] /data/hive-ptest/working/apache-svn-trunk-source/ql/src/java/org/apache/hadoop/hive/ql/parse/SemanticAnalyzer.java:[10169,78]
';' expected
[ERROR] /data/hive-ptest/working/apache-svn-trunk-source/ql/src/java/org/apache/hadoop/hive/ql/parse/SemanticAnalyzer.java:[10170,9]
not a statement
[ERROR] /data/hive-ptest/working/apache-svn-trunk-source/ql/src/java/org/apache/hadoop/hive/ql/parse/SemanticAnalyzer.java:[10170,32]
';' expected
[ERROR] /data/hive-ptest/working/apache-svn-trunk-source/ql/src/java/org/apache/hadoop/hive/ql/parse/SemanticAnalyzer.java:[10170,34]
not a statement
[ERROR] /data/hive-ptest/working/apache-svn-trunk-source/ql/src/java/org/apache/hadoop/hive/ql/parse/SemanticAnalyzer.java:[10170,54]
';' expected
[ERROR] /data/hive-ptest/working/apache-svn-trunk-source/ql/src/java/org/apache/hadoop/hive/ql/parse/SemanticAnalyzer.java:[10170,56]
not a statement
[ERROR] /data/hive-ptest/working/apache-svn-trunk-source/ql/src/java/org/apache/hadoop/hive/ql/parse/SemanticAnalyzer.java:[10170,72]
';' expected
[ERROR] /data/hive-ptest/working/apache-svn-trunk-source/ql/src/java/org/apache/hadoop/hive/ql/parse/SemanticAnalyzer.java:[10170,74]
not a statement
[ERROR] /data/hive-ptest/working/apache-svn-trunk-source/ql/src/java/org/apache/hadoop/hive/ql/parse/SemanticAnalyzer.java:[10170,90]
';' expected
[ERROR] /data/hive-ptest/working/apache-svn-trunk-source/ql/src/java/org/apache/hadoop/hive/ql/parse/SemanticAnalyzer.java:[10171,9]
not a statement
[ERROR] /data/hive-ptest/working/apache-svn-trunk-source/ql/src/java/org/apache/hadoop/hive/ql/parse/SemanticAnalyzer.java:[10171,23]
';' expected
[ERROR] /data/hive-ptest/working/apache-svn-trunk-source/ql/src/java/org/apache/hadoop/hive/ql/parse/SemanticAnalyzer.java:[10171,25]
not a statement
[ERROR] /data/hive-ptest/working/apache-svn-trunk-source/ql/src/java/org/apache/hadoop/hive/ql/parse/SemanticAnalyzer.java:[10171,42]
';' expected
[ERROR] /data/hive-ptest/working/apache-svn-trunk-source/ql/src/java/org/apache/hadoop/hive/ql/parse/SemanticAnalyzer.java:[10171,44]
not a statement
[ERROR] /data/hive-ptest/working/apache-svn-trunk-source/ql/src/java/org/apache/hadoop/hive/ql/parse/SemanticAnalyzer.java:[10171,50]
';' expected
[ERROR] /data/hive-ptest/working/apache-svn-trunk-source/ql/src/java/org/apache/hadoop/hive/ql/parse/SemanticAnalyzer.java:[10171,52]
not a statement
[ERROR] /data/hive-ptest/working/apache-svn-trunk-source/ql/src/java/org/apache/hadoop/hive/ql/parse/SemanticAnalyzer.java:[10171,61]
';' expected
[ERROR] /data/hive-ptest/working/apache-svn-trunk-source/ql/src/java/org/apache/hadoop/hive/ql/parse/SemanticAnalyzer.java:[10171,63]
not a statement
[ERROR] /data/hive-ptest/working/apache-svn-trunk-source/ql/src/java/org/apache/hadoop/hive/ql/parse/SemanticAnalyzer.java:[10171,85]
';' expected
[ERROR] /data/hive-ptest/working/apache-svn-trunk-source/ql/src/java/org/apache/hadoop/hive/ql/parse/SemanticAnalyzer.java:[10172,9]
not a statement
[ERROR] /data/hive-ptest/working/apache-svn-trunk-source/ql/src/java/org/apache/hadoop/hive/ql/parse/SemanticAnalyzer.java:[10172,25]
';' expected
[ERROR] /data/hive-ptest/working/apache-svn-trunk-source/ql/src/java/org/apache/hadoop/hive/ql/parse/SemanticAnalyzer.java:[10172,27]
not a statement
[ERROR] /data/hive-ptest/working/apache-svn-trunk-source/ql/src/java/org/apache/hadoop/hive/ql/parse/SemanticAnalyzer.java:[10172,76]
';' expected
[ERROR] /data/hive-ptest/working/apache-svn-trunk-source/ql/src/java/org/apache/hadoop/hive/ql/parse/SemanticAnalyzer.java:[10172,78]
not a statement
[ERROR] /data/hive-ptest/working/apache-svn-trunk-source/ql/src/java/org/apache/hadoop/hive/ql/parse/SemanticAnalyzer.java:[10172,93]
';' expected
[INFO] 60 errors 
[INFO] -------------------------------------------------------------
[INFO] ------------------------------------------------------------------------
[INFO] Reactor Summary:
[INFO] 
[INFO] Hive .............................................. SUCCESS [11.410s]
[INFO] Hive Shims Common ................................. SUCCESS [13.223s]
[INFO] Hive Shims 0.20S .................................. SUCCESS [3.446s]
[INFO] Hive Shims 0.23 ................................... SUCCESS [11.684s]
[INFO] Hive Shims Scheduler .............................. SUCCESS [2.270s]
[INFO] Hive Shims ........................................ SUCCESS [2.653s]
[INFO] Hive Common ....................................... SUCCESS [54.362s]
[INFO] Hive Serde ........................................ SUCCESS [21.897s]
[INFO] Hive Metastore .................................... SUCCESS [36.989s]
[INFO] Hive Ant Utilities ................................ SUCCESS [1.795s]
[INFO] Spark Remote Client ............................... SUCCESS [26.546s]
[INFO] Hive Query Language ............................... FAILURE [39.166s]
[INFO] Hive Service ...................................... SKIPPED
[INFO] Hive Accumulo Handler ............................. SKIPPED
[INFO] Hive JDBC ......................................... SKIPPED
[INFO] Hive Beeline ...................................... SKIPPED
[INFO] Hive CLI .......................................... SKIPPED
[INFO] Hive Contrib ...................................... SKIPPED
[INFO] Hive HBase Handler ................................ SKIPPED
[INFO] Hive HCatalog ..................................... SKIPPED
[INFO] Hive HCatalog Core ................................ SKIPPED
[INFO] Hive HCatalog Pig Adapter ......................... SKIPPED
[INFO] Hive HCatalog Server Extensions ................... SKIPPED
[INFO] Hive HCatalog Webhcat Java Client ................. SKIPPED
[INFO] Hive HCatalog Webhcat ............................. SKIPPED
[INFO] Hive HCatalog Streaming ........................... SKIPPED
[INFO] Hive HWI .......................................... SKIPPED
[INFO] Hive ODBC ......................................... SKIPPED
[INFO] Hive Shims Aggregator ............................. SKIPPED
[INFO] Hive TestUtils .................................... SKIPPED
[INFO] Hive Packaging .................................... SKIPPED
[INFO] ------------------------------------------------------------------------
[INFO] BUILD FAILURE
[INFO] ------------------------------------------------------------------------
[INFO] Total time: 3:48.631s
[INFO] Finished at: Wed Jan 28 19:27:51 EST 2015
[INFO] Final Memory: 97M/437M
[INFO] ------------------------------------------------------------------------
[ERROR] Failed to execute goal org.apache.maven.plugins:maven-compiler-plugin:3.1:compile
(default-compile) on project hive-exec: Compilation failure: Compilation failure:
[ERROR] /data/hive-ptest/working/apache-svn-trunk-source/ql/src/java/org/apache/hadoop/hive/ql/parse/SemanticAnalyzer.java:[10160,1]
illegal start of expression
[ERROR] /data/hive-ptest/working/apache-svn-trunk-source/ql/src/java/org/apache/hadoop/hive/ql/parse/SemanticAnalyzer.java:[10160,3]
illegal start of expression
[ERROR] /data/hive-ptest/working/apache-svn-trunk-source/ql/src/java/org/apache/hadoop/hive/ql/parse/SemanticAnalyzer.java:[10160,5]
illegal start of expression
[ERROR] /data/hive-ptest/working/apache-svn-trunk-source/ql/src/java/org/apache/hadoop/hive/ql/parse/SemanticAnalyzer.java:[10161,5]
> expected
[ERROR] /data/hive-ptest/working/apache-svn-trunk-source/ql/src/java/org/apache/hadoop/hive/ql/parse/SemanticAnalyzer.java:[10161,17]
';' expected
[ERROR] /data/hive-ptest/working/apache-svn-trunk-source/ql/src/java/org/apache/hadoop/hive/ql/parse/SemanticAnalyzer.java:[10161,23]
illegal start of expression
[ERROR] /data/hive-ptest/working/apache-svn-trunk-source/ql/src/java/org/apache/hadoop/hive/ql/parse/SemanticAnalyzer.java:[10161,24]
';' expected
[ERROR] /data/hive-ptest/working/apache-svn-trunk-source/ql/src/java/org/apache/hadoop/hive/ql/parse/SemanticAnalyzer.java:[10163,1]
illegal start of expression
[ERROR] /data/hive-ptest/working/apache-svn-trunk-source/ql/src/java/org/apache/hadoop/hive/ql/parse/SemanticAnalyzer.java:[10163,3]
illegal start of expression
[ERROR] /data/hive-ptest/working/apache-svn-trunk-source/ql/src/java/org/apache/hadoop/hive/ql/parse/SemanticAnalyzer.java:[10163,5]
illegal start of expression
[ERROR] /data/hive-ptest/working/apache-svn-trunk-source/ql/src/java/org/apache/hadoop/hive/ql/parse/SemanticAnalyzer.java:[10163,7]
illegal start of expression
[ERROR] /data/hive-ptest/working/apache-svn-trunk-source/ql/src/java/org/apache/hadoop/hive/ql/parse/SemanticAnalyzer.java:[10164,17]
')' expected
[ERROR] /data/hive-ptest/working/apache-svn-trunk-source/ql/src/java/org/apache/hadoop/hive/ql/parse/SemanticAnalyzer.java:[10164,23]
illegal start of expression
[ERROR] /data/hive-ptest/working/apache-svn-trunk-source/ql/src/java/org/apache/hadoop/hive/ql/parse/SemanticAnalyzer.java:[10164,24]
';' expected
[ERROR] /data/hive-ptest/working/apache-svn-trunk-source/ql/src/java/org/apache/hadoop/hive/ql/parse/SemanticAnalyzer.java:[10166,1]
illegal start of expression
[ERROR] /data/hive-ptest/working/apache-svn-trunk-source/ql/src/java/org/apache/hadoop/hive/ql/parse/SemanticAnalyzer.java:[10166,4]
illegal start of expression
[ERROR] /data/hive-ptest/working/apache-svn-trunk-source/ql/src/java/org/apache/hadoop/hive/ql/parse/SemanticAnalyzer.java:[10166,7]
illegal start of expression
[ERROR] /data/hive-ptest/working/apache-svn-trunk-source/ql/src/java/org/apache/hadoop/hive/ql/parse/SemanticAnalyzer.java:[10166,18]
')' expected
[ERROR] /data/hive-ptest/working/apache-svn-trunk-source/ql/src/java/org/apache/hadoop/hive/ql/parse/SemanticAnalyzer.java:[10167,20]
not a statement
[ERROR] /data/hive-ptest/working/apache-svn-trunk-source/ql/src/java/org/apache/hadoop/hive/ql/parse/SemanticAnalyzer.java:[10167,34]
';' expected
[ERROR] /data/hive-ptest/working/apache-svn-trunk-source/ql/src/java/org/apache/hadoop/hive/ql/parse/SemanticAnalyzer.java:[10167,55]
';' expected
[ERROR] /data/hive-ptest/working/apache-svn-trunk-source/ql/src/java/org/apache/hadoop/hive/ql/parse/SemanticAnalyzer.java:[10168,20]
not a statement
[ERROR] /data/hive-ptest/working/apache-svn-trunk-source/ql/src/java/org/apache/hadoop/hive/ql/parse/SemanticAnalyzer.java:[10168,40]
';' expected
[ERROR] /data/hive-ptest/working/apache-svn-trunk-source/ql/src/java/org/apache/hadoop/hive/ql/parse/SemanticAnalyzer.java:[10168,67]
';' expected
[ERROR] /data/hive-ptest/working/apache-svn-trunk-source/ql/src/java/org/apache/hadoop/hive/ql/parse/SemanticAnalyzer.java:[10169,9]
not a statement
[ERROR] /data/hive-ptest/working/apache-svn-trunk-source/ql/src/java/org/apache/hadoop/hive/ql/parse/SemanticAnalyzer.java:[10169,22]
';' expected
[ERROR] /data/hive-ptest/working/apache-svn-trunk-source/ql/src/java/org/apache/hadoop/hive/ql/parse/SemanticAnalyzer.java:[10169,24]
not a statement
[ERROR] /data/hive-ptest/working/apache-svn-trunk-source/ql/src/java/org/apache/hadoop/hive/ql/parse/SemanticAnalyzer.java:[10169,36]
';' expected
[ERROR] /data/hive-ptest/working/apache-svn-trunk-source/ql/src/java/org/apache/hadoop/hive/ql/parse/SemanticAnalyzer.java:[10169,38]
not a statement
[ERROR] /data/hive-ptest/working/apache-svn-trunk-source/ql/src/java/org/apache/hadoop/hive/ql/parse/SemanticAnalyzer.java:[10169,41]
';' expected
[ERROR] /data/hive-ptest/working/apache-svn-trunk-source/ql/src/java/org/apache/hadoop/hive/ql/parse/SemanticAnalyzer.java:[10169,43]
not a statement
[ERROR] /data/hive-ptest/working/apache-svn-trunk-source/ql/src/java/org/apache/hadoop/hive/ql/parse/SemanticAnalyzer.java:[10169,59]
';' expected
[ERROR] /data/hive-ptest/working/apache-svn-trunk-source/ql/src/java/org/apache/hadoop/hive/ql/parse/SemanticAnalyzer.java:[10169,61]
not a statement
[ERROR] /data/hive-ptest/working/apache-svn-trunk-source/ql/src/java/org/apache/hadoop/hive/ql/parse/SemanticAnalyzer.java:[10169,72]
';' expected
[ERROR] /data/hive-ptest/working/apache-svn-trunk-source/ql/src/java/org/apache/hadoop/hive/ql/parse/SemanticAnalyzer.java:[10169,74]
not a statement
[ERROR] /data/hive-ptest/working/apache-svn-trunk-source/ql/src/java/org/apache/hadoop/hive/ql/parse/SemanticAnalyzer.java:[10169,78]
';' expected
[ERROR] /data/hive-ptest/working/apache-svn-trunk-source/ql/src/java/org/apache/hadoop/hive/ql/parse/SemanticAnalyzer.java:[10170,9]
not a statement
[ERROR] /data/hive-ptest/working/apache-svn-trunk-source/ql/src/java/org/apache/hadoop/hive/ql/parse/SemanticAnalyzer.java:[10170,32]
';' expected
[ERROR] /data/hive-ptest/working/apache-svn-trunk-source/ql/src/java/org/apache/hadoop/hive/ql/parse/SemanticAnalyzer.java:[10170,34]
not a statement
[ERROR] /data/hive-ptest/working/apache-svn-trunk-source/ql/src/java/org/apache/hadoop/hive/ql/parse/SemanticAnalyzer.java:[10170,54]
';' expected
[ERROR] /data/hive-ptest/working/apache-svn-trunk-source/ql/src/java/org/apache/hadoop/hive/ql/parse/SemanticAnalyzer.java:[10170,56]
not a statement
[ERROR] /data/hive-ptest/working/apache-svn-trunk-source/ql/src/java/org/apache/hadoop/hive/ql/parse/SemanticAnalyzer.java:[10170,72]
';' expected
[ERROR] /data/hive-ptest/working/apache-svn-trunk-source/ql/src/java/org/apache/hadoop/hive/ql/parse/SemanticAnalyzer.java:[10170,74]
not a statement
[ERROR] /data/hive-ptest/working/apache-svn-trunk-source/ql/src/java/org/apache/hadoop/hive/ql/parse/SemanticAnalyzer.java:[10170,90]
';' expected
[ERROR] /data/hive-ptest/working/apache-svn-trunk-source/ql/src/java/org/apache/hadoop/hive/ql/parse/SemanticAnalyzer.java:[10171,9]
not a statement
[ERROR] /data/hive-ptest/working/apache-svn-trunk-source/ql/src/java/org/apache/hadoop/hive/ql/parse/SemanticAnalyzer.java:[10171,23]
';' expected
[ERROR] /data/hive-ptest/working/apache-svn-trunk-source/ql/src/java/org/apache/hadoop/hive/ql/parse/SemanticAnalyzer.java:[10171,25]
not a statement
[ERROR] /data/hive-ptest/working/apache-svn-trunk-source/ql/src/java/org/apache/hadoop/hive/ql/parse/SemanticAnalyzer.java:[10171,42]
';' expected
[ERROR] /data/hive-ptest/working/apache-svn-trunk-source/ql/src/java/org/apache/hadoop/hive/ql/parse/SemanticAnalyzer.java:[10171,44]
not a statement
[ERROR] /data/hive-ptest/working/apache-svn-trunk-source/ql/src/java/org/apache/hadoop/hive/ql/parse/SemanticAnalyzer.java:[10171,50]
';' expected
[ERROR] /data/hive-ptest/working/apache-svn-trunk-source/ql/src/java/org/apache/hadoop/hive/ql/parse/SemanticAnalyzer.java:[10171,52]
not a statement
[ERROR] /data/hive-ptest/working/apache-svn-trunk-source/ql/src/java/org/apache/hadoop/hive/ql/parse/SemanticAnalyzer.java:[10171,61]
';' expected
[ERROR] /data/hive-ptest/working/apache-svn-trunk-source/ql/src/java/org/apache/hadoop/hive/ql/parse/SemanticAnalyzer.java:[10171,63]
not a statement
[ERROR] /data/hive-ptest/working/apache-svn-trunk-source/ql/src/java/org/apache/hadoop/hive/ql/parse/SemanticAnalyzer.java:[10171,85]
';' expected
[ERROR] /data/hive-ptest/working/apache-svn-trunk-source/ql/src/java/org/apache/hadoop/hive/ql/parse/SemanticAnalyzer.java:[10172,9]
not a statement
[ERROR] /data/hive-ptest/working/apache-svn-trunk-source/ql/src/java/org/apache/hadoop/hive/ql/parse/SemanticAnalyzer.java:[10172,25]
';' expected
[ERROR] /data/hive-ptest/working/apache-svn-trunk-source/ql/src/java/org/apache/hadoop/hive/ql/parse/SemanticAnalyzer.java:[10172,27]
not a statement
[ERROR] /data/hive-ptest/working/apache-svn-trunk-source/ql/src/java/org/apache/hadoop/hive/ql/parse/SemanticAnalyzer.java:[10172,76]
';' expected
[ERROR] /data/hive-ptest/working/apache-svn-trunk-source/ql/src/java/org/apache/hadoop/hive/ql/parse/SemanticAnalyzer.java:[10172,78]
not a statement
[ERROR] /data/hive-ptest/working/apache-svn-trunk-source/ql/src/java/org/apache/hadoop/hive/ql/parse/SemanticAnalyzer.java:[10172,93]
';' expected
[ERROR] -> [Help 1]
[ERROR] 
[ERROR] To see the full stack trace of the errors, re-run Maven with the -e switch.
[ERROR] Re-run Maven using the -X switch to enable full debug logging.
[ERROR] 
[ERROR] For more information about the errors and possible solutions, please read the following
articles:
[ERROR] [Help 1] http://cwiki.apache.org/confluence/display/MAVEN/MojoFailureException
[ERROR] 
[ERROR] After correcting the problems, you can resume the build with the command
[ERROR]   mvn <goals> -rf :hive-exec
+ exit 1
'
{noformat}

This message is automatically generated.

ATTACHMENT ID: 12695096 - PreCommit-HIVE-TRUNK-Build

> CBO (Calcite Return Path): Removing AST from ParseContext
> ---------------------------------------------------------
>
>                 Key: HIVE-9431
>                 URL: https://issues.apache.org/jira/browse/HIVE-9431
>             Project: Hive
>          Issue Type: Sub-task
>          Components: CBO
>            Reporter: Jesus Camacho Rodriguez
>            Assignee: Jesus Camacho Rodriguez
>             Fix For: 0.15.0
>
>         Attachments: HIVE-9431.01.patch, HIVE-9431.02.patch, HIVE-9431.patch
>
>




--
This message was sent by Atlassian JIRA
(v6.3.4#6332)

Mime
View raw message