hive-dev mailing list archives

Site index · List index
Message view « Date » · « Thread »
Top « Date » · « Thread »
From "Hive QA (JIRA)" <j...@apache.org>
Subject [jira] [Commented] (HIVE-9394) SparkCliDriver tests have sporadic timeout error
Date Sat, 17 Jan 2015 05:44:34 GMT

    [ https://issues.apache.org/jira/browse/HIVE-9394?page=com.atlassian.jira.plugin.system.issuetabpanels:comment-tabpanel&focusedCommentId=14281223#comment-14281223
] 

Hive QA commented on HIVE-9394:
-------------------------------



{color:red}Overall{color}: -1 at least one tests failed

Here are the results of testing the latest attachment:
https://issues.apache.org/jira/secure/attachment/12692712/HIVE-9394.patch

{color:red}ERROR:{color} -1 due to 3 failed/errored test(s), 7315 tests executed
*Failed tests:*
{noformat}
org.apache.hadoop.hive.cli.TestSparkCliDriver.testCliDriver_mergejoins_mixed
org.apache.hadoop.hive.ql.TestMTQueries.testMTQueries1
org.apache.hive.hcatalog.streaming.TestStreaming.testTransactionBatchCommit_Json
{noformat}

Test results: http://ec2-174-129-184-35.compute-1.amazonaws.com/jenkins/job/PreCommit-HIVE-TRUNK-Build/2401/testReport
Console output: http://ec2-174-129-184-35.compute-1.amazonaws.com/jenkins/job/PreCommit-HIVE-TRUNK-Build/2401/console
Test logs: http://ec2-174-129-184-35.compute-1.amazonaws.com/logs/PreCommit-HIVE-TRUNK-Build-2401/

Messages:
{noformat}
Executing org.apache.hive.ptest.execution.PrepPhase
Executing org.apache.hive.ptest.execution.ExecutionPhase
Executing org.apache.hive.ptest.execution.ReportingPhase
Tests exited with: TestsFailedException: 3 tests failed
{noformat}

This message is automatically generated.

ATTACHMENT ID: 12692712 - PreCommit-HIVE-TRUNK-Build

> SparkCliDriver tests have sporadic timeout error
> ------------------------------------------------
>
>                 Key: HIVE-9394
>                 URL: https://issues.apache.org/jira/browse/HIVE-9394
>             Project: Hive
>          Issue Type: Test
>          Components: Tests
>    Affects Versions: 0.15.0
>            Reporter: Szehon Ho
>            Assignee: Szehon Ho
>         Attachments: HIVE-9394.patch
>
>
> There have been some sporadic exceptions in pre-commit tests like:
> {noformat}
> 2015-01-15 08:31:40,805 WARN  [main]: client.SparkClientImpl (SparkClientImpl.java:<init>(90))
- Error while waiting for client to connect.
> java.util.concurrent.ExecutionException: java.util.concurrent.TimeoutException: Timed
out waiting for client connection.
> 	at io.netty.util.concurrent.AbstractFuture.get(AbstractFuture.java:37)
> 	at org.apache.hive.spark.client.SparkClientImpl.<init>(SparkClientImpl.java:88)
> 	at org.apache.hive.spark.client.SparkClientFactory.createClient(SparkClientFactory.java:75)
> 	at org.apache.hadoop.hive.ql.exec.spark.RemoteHiveSparkClient.<init>(RemoteHiveSparkClient.java:82)
> 	at org.apache.hadoop.hive.ql.exec.spark.HiveSparkClientFactory.createHiveSparkClient(HiveSparkClientFactory.java:53)
> 	at org.apache.hadoop.hive.ql.exec.spark.session.SparkSessionImpl.open(SparkSessionImpl.java:56)
> 	at org.apache.hadoop.hive.ql.exec.spark.session.SparkSessionManagerImpl.getSession(SparkSessionManagerImpl.java:128)
> 	at org.apache.hadoop.hive.ql.exec.spark.SparkUtilities.getSparkSession(SparkUtilities.java:84)
> 	at org.apache.hadoop.hive.ql.exec.spark.SparkTask.execute(SparkTask.java:96)
> 	at org.apache.hadoop.hive.ql.exec.Task.executeTask(Task.java:160)
> 	at org.apache.hadoop.hive.ql.exec.TaskRunner.runSequential(TaskRunner.java:88)
> 	at org.apache.hadoop.hive.ql.Driver.launchTask(Driver.java:1634)
> 	at org.apache.hadoop.hive.ql.Driver.execute(Driver.java:1393)
> 	at org.apache.hadoop.hive.ql.Driver.runInternal(Driver.java:1179)
> 	at org.apache.hadoop.hive.ql.Driver.run(Driver.java:1045)
> 	at org.apache.hadoop.hive.ql.Driver.run(Driver.java:1035)
> 	at org.apache.hadoop.hive.cli.CliDriver.processLocalCmd(CliDriver.java:207)
> 	at org.apache.hadoop.hive.cli.CliDriver.processCmd(CliDriver.java:159)
> 	at org.apache.hadoop.hive.cli.CliDriver.processLine(CliDriver.java:370)
> 	at org.apache.hadoop.hive.cli.CliDriver.processLine(CliDriver.java:305)
> 	at org.apache.hadoop.hive.ql.QTestUtil.executeClient(QTestUtil.java:882)
> 	at org.apache.hadoop.hive.cli.TestSparkCliDriver.runTest(TestSparkCliDriver.java:234)
> 	at org.apache.hadoop.hive.cli.TestSparkCliDriver.testCliDriver_alter_merge_orc(TestSparkCliDriver.java:162)
> 	at sun.reflect.NativeMethodAccessorImpl.invoke0(Native Method)
> 	at sun.reflect.NativeMethodAccessorImpl.invoke(NativeMethodAccessorImpl.java:57)
> 	at sun.reflect.DelegatingMethodAccessorImpl.invoke(DelegatingMethodAccessorImpl.java:43)
> 	at java.lang.reflect.Method.invoke(Method.java:606)
> 	at junit.framework.TestCase.runTest(TestCase.java:176)
> 	at junit.framework.TestCase.runBare(TestCase.java:141)
> 	at junit.framework.TestResult$1.protect(TestResult.java:122)
> 	at junit.framework.TestResult.runProtected(TestResult.java:142)
> 	at junit.framework.TestResult.run(TestResult.java:125)
> 	at junit.framework.TestCase.run(TestCase.java:129)
> 	at junit.framework.TestSuite.runTest(TestSuite.java:255)
> 	at junit.framework.TestSuite.run(TestSuite.java:250)
> 	at org.junit.internal.runners.JUnit38ClassRunner.run(JUnit38ClassRunner.java:84)
> 	at org.apache.maven.surefire.junit4.JUnit4Provider.execute(JUnit4Provider.java:264)
> 	at org.apache.maven.surefire.junit4.JUnit4Provider.executeTestSet(JUnit4Provider.java:153)
> 	at org.apache.maven.surefire.junit4.JUnit4Provider.invoke(JUnit4Provider.java:124)
> 	at org.apache.maven.surefire.booter.ForkedBooter.invokeProviderInSameClassLoader(ForkedBooter.java:200)
> 	at org.apache.maven.surefire.booter.ForkedBooter.runSuitesInProcess(ForkedBooter.java:153)
> 	at org.apache.maven.surefire.booter.ForkedBooter.main(ForkedBooter.java:103)
> Caused by: java.util.concurrent.TimeoutException: Timed out waiting for client connection.
> 	at org.apache.hive.spark.client.rpc.RpcServer$2.run(RpcServer.java:125)
> 	at io.netty.util.concurrent.PromiseTask$RunnableAdapter.call(PromiseTask.java:38)
> 	at io.netty.util.concurrent.ScheduledFutureTask.run(ScheduledFutureTask.java:123)
> 	at io.netty.util.concurrent.SingleThreadEventExecutor.runAllTasks(SingleThreadEventExecutor.java:380)
> 	at io.netty.channel.nio.NioEventLoop.run(NioEventLoop.java:357)
> 	at io.netty.util.concurrent.SingleThreadEventExecutor$2.run(SingleThreadEventExecutor.java:116)
> 	at java.lang.Thread.run(Thread.java:744)
> {noformat}
> I think this is caused by the RemoteDriver not sending the "Hello" message to the client,
which causes it to timeout.



--
This message was sent by Atlassian JIRA
(v6.3.4#6332)

Mime
View raw message