hive-dev mailing list archives

Site index · List index
Message view « Date » · « Thread »
Top « Date » · « Thread »
From "Hive QA (JIRA)" <j...@apache.org>
Subject [jira] [Commented] (HIVE-9213) Improve the mask pattern in QTestUtil to save partial directory info in test result
Date Fri, 26 Dec 2014 05:50:13 GMT

    [ https://issues.apache.org/jira/browse/HIVE-9213?page=com.atlassian.jira.plugin.system.issuetabpanels:comment-tabpanel&focusedCommentId=14258949#comment-14258949
] 

Hive QA commented on HIVE-9213:
-------------------------------



{color:red}Overall{color}: -1 no tests executed

Here are the results of testing the latest attachment:
https://issues.apache.org/jira/secure/attachment/12689150/HIVE-9213.1.patch

Test results: http://ec2-174-129-184-35.compute-1.amazonaws.com/jenkins/job/PreCommit-HIVE-TRUNK-Build/2199/testReport
Console output: http://ec2-174-129-184-35.compute-1.amazonaws.com/jenkins/job/PreCommit-HIVE-TRUNK-Build/2199/console
Test logs: http://ec2-174-129-184-35.compute-1.amazonaws.com/logs/PreCommit-HIVE-TRUNK-Build-2199/

Messages:
{noformat}
**** This message was trimmed, see log for full details ****
     [copy] Copying 8 files to /data/hive-ptest/working/apache-svn-trunk-source/itests/target/tmp/conf
[INFO] Executed tasks
[INFO] 
[INFO] --- maven-site-plugin:3.3:attach-descriptor (attach-descriptor) @ hive-it ---
[INFO] 
[INFO] --- maven-install-plugin:2.4:install (default-install) @ hive-it ---
[INFO] Installing /data/hive-ptest/working/apache-svn-trunk-source/itests/pom.xml to /data/hive-ptest/working/maven/org/apache/hive/hive-it/0.15.0-SNAPSHOT/hive-it-0.15.0-SNAPSHOT.pom
[INFO]                                                                         
[INFO] ------------------------------------------------------------------------
[INFO] Building Hive Integration - Custom Serde 0.15.0-SNAPSHOT
[INFO] ------------------------------------------------------------------------
[INFO] 
[INFO] --- maven-clean-plugin:2.5:clean (default-clean) @ hive-it-custom-serde ---
[INFO] Deleting /data/hive-ptest/working/apache-svn-trunk-source/itests/custom-serde (includes
= [datanucleus.log, derby.log], excludes = [])
[INFO] 
[INFO] --- maven-enforcer-plugin:1.3.1:enforce (enforce-no-snapshots) @ hive-it-custom-serde
---
[INFO] 
[INFO] --- maven-remote-resources-plugin:1.5:process (default) @ hive-it-custom-serde ---
[INFO] 
[INFO] --- maven-resources-plugin:2.6:resources (default-resources) @ hive-it-custom-serde
---
[INFO] Using 'UTF-8' encoding to copy filtered resources.
[INFO] Copying 1 resource
[INFO] Copying 3 resources
[INFO] 
[INFO] --- maven-antrun-plugin:1.7:run (define-classpath) @ hive-it-custom-serde ---
[INFO] Executing tasks

main:
[INFO] Executed tasks
[INFO] 
[INFO] --- maven-compiler-plugin:3.1:compile (default-compile) @ hive-it-custom-serde ---
[INFO] Compiling 10 source files to /data/hive-ptest/working/apache-svn-trunk-source/itests/custom-serde/target/classes
[WARNING] /data/hive-ptest/working/apache-svn-trunk-source/itests/custom-serde/src/main/java/org/apache/hadoop/hive/serde2/CustomSerDe2.java:
Some input files use or override a deprecated API.
[WARNING] /data/hive-ptest/working/apache-svn-trunk-source/itests/custom-serde/src/main/java/org/apache/hadoop/hive/serde2/CustomSerDe2.java:
Recompile with -Xlint:deprecation for details.
[INFO] 
[INFO] --- maven-resources-plugin:2.6:testResources (default-testResources) @ hive-it-custom-serde
---
[INFO] Using 'UTF-8' encoding to copy filtered resources.
[INFO] skip non existing resourceDirectory /data/hive-ptest/working/apache-svn-trunk-source/itests/custom-serde/src/test/resources
[INFO] Copying 3 resources
[INFO] 
[INFO] --- maven-antrun-plugin:1.7:run (setup-test-dirs) @ hive-it-custom-serde ---
[INFO] Executing tasks

main:
    [mkdir] Created dir: /data/hive-ptest/working/apache-svn-trunk-source/itests/custom-serde/target/tmp
    [mkdir] Created dir: /data/hive-ptest/working/apache-svn-trunk-source/itests/custom-serde/target/warehouse
    [mkdir] Created dir: /data/hive-ptest/working/apache-svn-trunk-source/itests/custom-serde/target/tmp/conf
     [copy] Copying 8 files to /data/hive-ptest/working/apache-svn-trunk-source/itests/custom-serde/target/tmp/conf
[INFO] Executed tasks
[INFO] 
[INFO] --- maven-compiler-plugin:3.1:testCompile (default-testCompile) @ hive-it-custom-serde
---
[INFO] No sources to compile
[INFO] 
[INFO] --- maven-surefire-plugin:2.16:test (default-test) @ hive-it-custom-serde ---
[INFO] Tests are skipped.
[INFO] 
[INFO] --- maven-jar-plugin:2.2:jar (default-jar) @ hive-it-custom-serde ---
[INFO] Building jar: /data/hive-ptest/working/apache-svn-trunk-source/itests/custom-serde/target/hive-it-custom-serde-0.15.0-SNAPSHOT.jar
[INFO] 
[INFO] --- maven-site-plugin:3.3:attach-descriptor (attach-descriptor) @ hive-it-custom-serde
---
[INFO] 
[INFO] --- maven-install-plugin:2.4:install (default-install) @ hive-it-custom-serde ---
[INFO] Installing /data/hive-ptest/working/apache-svn-trunk-source/itests/custom-serde/target/hive-it-custom-serde-0.15.0-SNAPSHOT.jar
to /data/hive-ptest/working/maven/org/apache/hive/hive-it-custom-serde/0.15.0-SNAPSHOT/hive-it-custom-serde-0.15.0-SNAPSHOT.jar
[INFO] Installing /data/hive-ptest/working/apache-svn-trunk-source/itests/custom-serde/pom.xml
to /data/hive-ptest/working/maven/org/apache/hive/hive-it-custom-serde/0.15.0-SNAPSHOT/hive-it-custom-serde-0.15.0-SNAPSHOT.pom
[INFO]                                                                         
[INFO] ------------------------------------------------------------------------
[INFO] Building Hive Integration - HCatalog Unit Tests 0.15.0-SNAPSHOT
[INFO] ------------------------------------------------------------------------
[INFO] 
[INFO] --- maven-clean-plugin:2.5:clean (default-clean) @ hive-hcatalog-it-unit ---
[INFO] Deleting /data/hive-ptest/working/apache-svn-trunk-source/itests/hcatalog-unit (includes
= [datanucleus.log, derby.log], excludes = [])
[INFO] 
[INFO] --- maven-enforcer-plugin:1.3.1:enforce (enforce-no-snapshots) @ hive-hcatalog-it-unit
---
[INFO] 
[INFO] --- maven-remote-resources-plugin:1.5:process (default) @ hive-hcatalog-it-unit ---
[INFO] 
[INFO] --- maven-resources-plugin:2.6:resources (default-resources) @ hive-hcatalog-it-unit
---
[INFO] Using 'UTF-8' encoding to copy filtered resources.
[INFO] skip non existing resourceDirectory /data/hive-ptest/working/apache-svn-trunk-source/itests/hcatalog-unit/src/main/resources
[INFO] Copying 3 resources
[INFO] 
[INFO] --- maven-antrun-plugin:1.7:run (define-classpath) @ hive-hcatalog-it-unit ---
[INFO] Executing tasks

main:
[INFO] Executed tasks
[INFO] 
[INFO] --- maven-compiler-plugin:3.1:compile (default-compile) @ hive-hcatalog-it-unit ---
[INFO] No sources to compile
[INFO] 
[INFO] --- maven-resources-plugin:2.6:testResources (default-testResources) @ hive-hcatalog-it-unit
---
[INFO] Using 'UTF-8' encoding to copy filtered resources.
[INFO] skip non existing resourceDirectory /data/hive-ptest/working/apache-svn-trunk-source/itests/hcatalog-unit/src/test/resources
[INFO] Copying 3 resources
[INFO] 
[INFO] --- maven-antrun-plugin:1.7:run (setup-test-dirs) @ hive-hcatalog-it-unit ---
[INFO] Executing tasks

main:
    [mkdir] Created dir: /data/hive-ptest/working/apache-svn-trunk-source/itests/hcatalog-unit/target/tmp
    [mkdir] Created dir: /data/hive-ptest/working/apache-svn-trunk-source/itests/hcatalog-unit/target/warehouse
    [mkdir] Created dir: /data/hive-ptest/working/apache-svn-trunk-source/itests/hcatalog-unit/target/tmp/conf
     [copy] Copying 8 files to /data/hive-ptest/working/apache-svn-trunk-source/itests/hcatalog-unit/target/tmp/conf
[INFO] Executed tasks
[INFO] 
[INFO] --- maven-compiler-plugin:3.1:testCompile (default-testCompile) @ hive-hcatalog-it-unit
---
[INFO] Compiling 6 source files to /data/hive-ptest/working/apache-svn-trunk-source/itests/hcatalog-unit/target/test-classes
[WARNING] /data/hive-ptest/working/apache-svn-trunk-source/itests/hcatalog-unit/src/test/java/org/apache/hive/hcatalog/hbase/ManyMiniCluster.java:
Some input files use or override a deprecated API.
[WARNING] /data/hive-ptest/working/apache-svn-trunk-source/itests/hcatalog-unit/src/test/java/org/apache/hive/hcatalog/hbase/ManyMiniCluster.java:
Recompile with -Xlint:deprecation for details.
[INFO] 
[INFO] --- maven-surefire-plugin:2.16:test (default-test) @ hive-hcatalog-it-unit ---
[INFO] Tests are skipped.
[INFO] 
[INFO] --- maven-jar-plugin:2.2:jar (default-jar) @ hive-hcatalog-it-unit ---
[INFO] Building jar: /data/hive-ptest/working/apache-svn-trunk-source/itests/hcatalog-unit/target/hive-hcatalog-it-unit-0.15.0-SNAPSHOT.jar
[INFO] 
[INFO] --- maven-site-plugin:3.3:attach-descriptor (attach-descriptor) @ hive-hcatalog-it-unit
---
[INFO] 
[INFO] --- maven-jar-plugin:2.2:test-jar (default) @ hive-hcatalog-it-unit ---
[INFO] Building jar: /data/hive-ptest/working/apache-svn-trunk-source/itests/hcatalog-unit/target/hive-hcatalog-it-unit-0.15.0-SNAPSHOT-tests.jar
[INFO] 
[INFO] --- maven-install-plugin:2.4:install (default-install) @ hive-hcatalog-it-unit ---
[INFO] Installing /data/hive-ptest/working/apache-svn-trunk-source/itests/hcatalog-unit/target/hive-hcatalog-it-unit-0.15.0-SNAPSHOT.jar
to /data/hive-ptest/working/maven/org/apache/hive/hive-hcatalog-it-unit/0.15.0-SNAPSHOT/hive-hcatalog-it-unit-0.15.0-SNAPSHOT.jar
[INFO] Installing /data/hive-ptest/working/apache-svn-trunk-source/itests/hcatalog-unit/pom.xml
to /data/hive-ptest/working/maven/org/apache/hive/hive-hcatalog-it-unit/0.15.0-SNAPSHOT/hive-hcatalog-it-unit-0.15.0-SNAPSHOT.pom
[INFO] Installing /data/hive-ptest/working/apache-svn-trunk-source/itests/hcatalog-unit/target/hive-hcatalog-it-unit-0.15.0-SNAPSHOT-tests.jar
to /data/hive-ptest/working/maven/org/apache/hive/hive-hcatalog-it-unit/0.15.0-SNAPSHOT/hive-hcatalog-it-unit-0.15.0-SNAPSHOT-tests.jar
[INFO]                                                                         
[INFO] ------------------------------------------------------------------------
[INFO] Building Hive Integration - Testing Utilities 0.15.0-SNAPSHOT
[INFO] ------------------------------------------------------------------------
[INFO] 
[INFO] --- maven-clean-plugin:2.5:clean (default-clean) @ hive-it-util ---
[INFO] Deleting /data/hive-ptest/working/apache-svn-trunk-source/itests/util (includes = [datanucleus.log,
derby.log], excludes = [])
[INFO] 
[INFO] --- maven-enforcer-plugin:1.3.1:enforce (enforce-no-snapshots) @ hive-it-util ---
[INFO] 
[INFO] --- maven-remote-resources-plugin:1.5:process (default) @ hive-it-util ---
[INFO] 
[INFO] --- maven-resources-plugin:2.6:resources (default-resources) @ hive-it-util ---
[INFO] Using 'UTF-8' encoding to copy filtered resources.
[INFO] skip non existing resourceDirectory /data/hive-ptest/working/apache-svn-trunk-source/itests/util/src/main/resources
[INFO] Copying 3 resources
[INFO] 
[INFO] --- maven-antrun-plugin:1.7:run (define-classpath) @ hive-it-util ---
[INFO] Executing tasks

main:
[INFO] Executed tasks
[INFO] 
[INFO] --- maven-compiler-plugin:3.1:compile (default-compile) @ hive-it-util ---
[INFO] Compiling 50 source files to /data/hive-ptest/working/apache-svn-trunk-source/itests/util/target/classes
[INFO] -------------------------------------------------------------
[WARNING] COMPILATION WARNING : 
[INFO] -------------------------------------------------------------
[WARNING] /data/hive-ptest/working/apache-svn-trunk-source/itests/util/src/main/java/org/apache/hadoop/hive/ql/hooks/VerifyHooksRunInOrder.java:
Some input files use or override a deprecated API.
[WARNING] /data/hive-ptest/working/apache-svn-trunk-source/itests/util/src/main/java/org/apache/hadoop/hive/ql/hooks/VerifyHooksRunInOrder.java:
Recompile with -Xlint:deprecation for details.
[INFO] 2 warnings 
[INFO] -------------------------------------------------------------
[INFO] -------------------------------------------------------------
[ERROR] COMPILATION ERROR : 
[INFO] -------------------------------------------------------------
[ERROR] /data/hive-ptest/working/apache-svn-trunk-source/itests/util/src/main/java/org/apache/hadoop/hive/ql/QTestUtil.java:[1188,41]
cannot find symbol
  symbol:   variable encrypted
  location: class org.apache.hadoop.hive.ql.QTestUtil.MiniClusterType
[INFO] 1 error
[INFO] -------------------------------------------------------------
[INFO] ------------------------------------------------------------------------
[INFO] Reactor Summary:
[INFO] 
[INFO] Hive Integration - Parent ......................... SUCCESS [7.841s]
[INFO] Hive Integration - Custom Serde ................... SUCCESS [12.914s]
[INFO] Hive Integration - HCatalog Unit Tests ............ SUCCESS [16.262s]
[INFO] Hive Integration - Testing Utilities .............. FAILURE [15.636s]
[INFO] Hive Integration - Unit Tests ..................... SKIPPED
[INFO] Hive Integration - Test Serde ..................... SKIPPED
[INFO] Hive Integration - QFile Tests .................... SKIPPED
[INFO] Hive Integration - Unit Tests - Hadoop 2 .......... SKIPPED
[INFO] Hive Integration - Unit Tests with miniKdc ........ SKIPPED
[INFO] ------------------------------------------------------------------------
[INFO] BUILD FAILURE
[INFO] ------------------------------------------------------------------------
[INFO] Total time: 56.713s
[INFO] Finished at: Fri Dec 26 00:48:40 EST 2014
[INFO] Final Memory: 57M/137M
[INFO] ------------------------------------------------------------------------
[ERROR] Failed to execute goal org.apache.maven.plugins:maven-compiler-plugin:3.1:compile
(default-compile) on project hive-it-util: Compilation failure
[ERROR] /data/hive-ptest/working/apache-svn-trunk-source/itests/util/src/main/java/org/apache/hadoop/hive/ql/QTestUtil.java:[1188,41]
cannot find symbol
[ERROR] symbol:   variable encrypted
[ERROR] location: class org.apache.hadoop.hive.ql.QTestUtil.MiniClusterType
[ERROR] -> [Help 1]
[ERROR] 
[ERROR] To see the full stack trace of the errors, re-run Maven with the -e switch.
[ERROR] Re-run Maven using the -X switch to enable full debug logging.
[ERROR] 
[ERROR] For more information about the errors and possible solutions, please read the following
articles:
[ERROR] [Help 1] http://cwiki.apache.org/confluence/display/MAVEN/MojoFailureException
[ERROR] 
[ERROR] After correcting the problems, you can resume the build with the command
[ERROR]   mvn <goals> -rf :hive-it-util
+ exit 1
'
{noformat}

This message is automatically generated.

ATTACHMENT ID: 12689150 - PreCommit-HIVE-TRUNK-Build

> Improve the mask pattern in QTestUtil to save partial directory info in test result
> -----------------------------------------------------------------------------------
>
>                 Key: HIVE-9213
>                 URL: https://issues.apache.org/jira/browse/HIVE-9213
>             Project: Hive
>          Issue Type: Sub-task
>            Reporter: Dong Chen
>            Assignee: Dong Chen
>             Fix For: encryption-branch
>
>         Attachments: HIVE-9213.1.patch, HIVE-9213.patch
>
>
> The mask pattern in QTestUtil will mask directory in test result, since the directory
varies in different test env.
> However, in Encryption test, the directory info is needed to verify the intermediate
files are put in proper table. The whole directory is not necessary, and part of it is enough.



--
This message was sent by Atlassian JIRA
(v6.3.4#6332)

Mime
View raw message