hive-dev mailing list archives

Site index · List index
Message view « Date » · « Thread »
Top « Date » · « Thread »
From "Chengxiang Li (JIRA)" <>
Subject [jira] [Created] (HIVE-9048) Hive build failed on hadoop-1 after HIVE-8828.
Date Tue, 09 Dec 2014 02:08:12 GMT
Chengxiang Li created HIVE-9048:

             Summary: Hive build failed on hadoop-1 after HIVE-8828.
                 Key: HIVE-9048
             Project: Hive
          Issue Type: Bug
            Reporter: Chengxiang Li
            Assignee: Chengxiang Li

HIVE-8828 introduce which included in hadoop-tools(in
hadoop-1)/hadoop-archives(in hadoop-2), while hadoop-tools is not added into hadoop-1 dependency.
This lead to the following compile error:
[ERROR] Failed to execute goal org.apache.maven.plugins:maven-compiler-plugin:2.3.2:compile
(default-compile) on project hive-exec: Compilation failure: Compilation failure:
[ERROR] /home/cxli/sources/github/chengxiangli/hive/ql/src/java/org/apache/hadoop/hive/ql/exec/[175,30]
error: package does not exist
[ERROR] /home/cxli/sources/github/chengxiangli/hive/ql/src/java/org/apache/hadoop/hive/ql/exec/[1322,8]
error: cannot find symbol
[ERROR] class DDLTask
[ERROR] /home/cxli/sources/github/chengxiangli/hive/ql/src/java/org/apache/hadoop/hive/ql/exec/[1322,33]
error: cannot find symbol
[ERROR] -> [Help 1]


This message was sent by Atlassian JIRA

View raw message