hive-dev mailing list archives

Site index · List index
Message view « Date » · « Thread »
Top « Date » · « Thread »
From "Hive QA (JIRA)" <j...@apache.org>
Subject [jira] [Commented] (HIVE-8988) Support advanced aggregation in Hive to Calcite path
Date Thu, 11 Dec 2014 22:31:14 GMT

    [ https://issues.apache.org/jira/browse/HIVE-8988?page=com.atlassian.jira.plugin.system.issuetabpanels:comment-tabpanel&focusedCommentId=14243272#comment-14243272
] 

Hive QA commented on HIVE-8988:
-------------------------------



{color:red}Overall{color}: -1 no tests executed

Here are the results of testing the latest attachment:
https://issues.apache.org/jira/secure/attachment/12686661/HIVE-8988.patch

Test results: http://ec2-174-129-184-35.compute-1.amazonaws.com/jenkins/job/PreCommit-HIVE-TRUNK-Build/2045/testReport
Console output: http://ec2-174-129-184-35.compute-1.amazonaws.com/jenkins/job/PreCommit-HIVE-TRUNK-Build/2045/console
Test logs: http://ec2-174-129-184-35.compute-1.amazonaws.com/logs/PreCommit-HIVE-TRUNK-Build-2045/

Messages:
{noformat}
**** This message was trimmed, see log for full details ****
As a result, alternative(s) 2 were disabled for that input
warning(200): IdentifiersParser.g:166:7: 
Decision can match input such as "STAR" using multiple alternatives: 1, 2

As a result, alternative(s) 2 were disabled for that input
warning(200): IdentifiersParser.g:179:5: 
Decision can match input such as "KW_ARRAY" using multiple alternatives: 2, 6

As a result, alternative(s) 6 were disabled for that input
warning(200): IdentifiersParser.g:179:5: 
Decision can match input such as "KW_STRUCT" using multiple alternatives: 4, 6

As a result, alternative(s) 6 were disabled for that input
warning(200): IdentifiersParser.g:179:5: 
Decision can match input such as "KW_UNIONTYPE" using multiple alternatives: 5, 6

As a result, alternative(s) 6 were disabled for that input
warning(200): IdentifiersParser.g:270:5: 
Decision can match input such as "KW_TRUE" using multiple alternatives: 2, 7

As a result, alternative(s) 7 were disabled for that input
warning(200): IdentifiersParser.g:270:5: 
Decision can match input such as "KW_FALSE" using multiple alternatives: 2, 7

As a result, alternative(s) 7 were disabled for that input
warning(200): IdentifiersParser.g:270:5: 
Decision can match input such as "KW_NULL" using multiple alternatives: 1, 7

As a result, alternative(s) 7 were disabled for that input
warning(200): IdentifiersParser.g:401:5: 
Decision can match input such as "{KW_LIKE, KW_REGEXP, KW_RLIKE} KW_SORT KW_BY" using multiple
alternatives: 2, 9

As a result, alternative(s) 9 were disabled for that input
warning(200): IdentifiersParser.g:401:5: 
Decision can match input such as "{KW_LIKE, KW_REGEXP, KW_RLIKE} KW_MAP LPAREN" using multiple
alternatives: 2, 9

As a result, alternative(s) 9 were disabled for that input
warning(200): IdentifiersParser.g:401:5: 
Decision can match input such as "{KW_LIKE, KW_REGEXP, KW_RLIKE} KW_GROUP KW_BY" using multiple
alternatives: 2, 9

As a result, alternative(s) 9 were disabled for that input
warning(200): IdentifiersParser.g:401:5: 
Decision can match input such as "{KW_LIKE, KW_REGEXP, KW_RLIKE} KW_CLUSTER KW_BY" using multiple
alternatives: 2, 9

As a result, alternative(s) 9 were disabled for that input
warning(200): IdentifiersParser.g:401:5: 
Decision can match input such as "{KW_LIKE, KW_REGEXP, KW_RLIKE} KW_DISTRIBUTE KW_BY" using
multiple alternatives: 2, 9

As a result, alternative(s) 9 were disabled for that input
warning(200): IdentifiersParser.g:401:5: 
Decision can match input such as "{KW_LIKE, KW_REGEXP, KW_RLIKE} KW_INSERT KW_OVERWRITE" using
multiple alternatives: 2, 9

As a result, alternative(s) 9 were disabled for that input
warning(200): IdentifiersParser.g:401:5: 
Decision can match input such as "{KW_LIKE, KW_REGEXP, KW_RLIKE} KW_UNION KW_ALL" using multiple
alternatives: 2, 9

As a result, alternative(s) 9 were disabled for that input
warning(200): IdentifiersParser.g:401:5: 
Decision can match input such as "{KW_LIKE, KW_REGEXP, KW_RLIKE} KW_INSERT KW_INTO" using
multiple alternatives: 2, 9

As a result, alternative(s) 9 were disabled for that input
warning(200): IdentifiersParser.g:401:5: 
Decision can match input such as "KW_BETWEEN KW_MAP LPAREN" using multiple alternatives: 8,
9

As a result, alternative(s) 9 were disabled for that input
warning(200): IdentifiersParser.g:401:5: 
Decision can match input such as "{KW_LIKE, KW_REGEXP, KW_RLIKE} KW_LATERAL KW_VIEW" using
multiple alternatives: 2, 9

As a result, alternative(s) 9 were disabled for that input
warning(200): IdentifiersParser.g:401:5: 
Decision can match input such as "{KW_LIKE, KW_REGEXP, KW_RLIKE} KW_ORDER KW_BY" using multiple
alternatives: 2, 9

As a result, alternative(s) 9 were disabled for that input
warning(200): IdentifiersParser.g:526:5: 
Decision can match input such as "{AMPERSAND..BITWISEXOR, DIV..DIVIDE, EQUAL..EQUAL_NS, GREATERTHAN..GREATERTHANOREQUALTO,
KW_AND, KW_ARRAY, KW_BETWEEN..KW_BOOLEAN, KW_CASE, KW_DOUBLE, KW_FLOAT, KW_IF, KW_IN, KW_INT,
KW_LIKE, KW_MAP, KW_NOT, KW_OR, KW_REGEXP, KW_RLIKE, KW_SMALLINT, KW_STRING..KW_STRUCT, KW_TINYINT,
KW_UNIONTYPE, KW_WHEN, LESSTHAN..LESSTHANOREQUALTO, MINUS..NOTEQUAL, PLUS, STAR, TILDE}" using
multiple alternatives: 1, 3

As a result, alternative(s) 3 were disabled for that input
[INFO] 
[INFO] --- maven-remote-resources-plugin:1.5:process (default) @ hive-exec ---
[INFO] 
[INFO] --- maven-resources-plugin:2.6:resources (default-resources) @ hive-exec ---
[INFO] Using 'UTF-8' encoding to copy filtered resources.
[INFO] Copying 2 resources
[INFO] Copying 3 resources
[INFO] 
[INFO] --- maven-antrun-plugin:1.7:run (define-classpath) @ hive-exec ---
[INFO] Executing tasks

main:
[INFO] Executed tasks
[INFO] 
[INFO] --- maven-compiler-plugin:3.1:compile (default-compile) @ hive-exec ---
[INFO] Compiling 1992 source files to /data/hive-ptest/working/apache-svn-trunk-source/ql/target/classes
[INFO] -------------------------------------------------------------
[WARNING] COMPILATION WARNING : 
[INFO] -------------------------------------------------------------
[WARNING] /data/hive-ptest/working/apache-svn-trunk-source/ql/src/java/org/apache/hadoop/hive/ql/exec/persistence/MapJoinBytesTableContainer.java:
Some input files use or override a deprecated API.
[WARNING] /data/hive-ptest/working/apache-svn-trunk-source/ql/src/java/org/apache/hadoop/hive/ql/exec/persistence/MapJoinBytesTableContainer.java:
Recompile with -Xlint:deprecation for details.
[WARNING] /data/hive-ptest/working/apache-svn-trunk-source/ql/src/gen/thrift/gen-javabean/org/apache/hadoop/hive/ql/plan/api/Query.java:
Some input files use unchecked or unsafe operations.
[WARNING] /data/hive-ptest/working/apache-svn-trunk-source/ql/src/gen/thrift/gen-javabean/org/apache/hadoop/hive/ql/plan/api/Query.java:
Recompile with -Xlint:unchecked for details.
[INFO] 4 warnings 
[INFO] -------------------------------------------------------------
[INFO] -------------------------------------------------------------
[ERROR] COMPILATION ERROR : 
[INFO] -------------------------------------------------------------
[ERROR] /data/hive-ptest/working/apache-svn-trunk-source/ql/src/java/org/apache/hadoop/hive/ql/optimizer/calcite/translator/RexNodeConverter.java:[32,39]
package org.apache.calcite.avatica.util does not exist
[ERROR] /data/hive-ptest/working/apache-svn-trunk-source/ql/src/java/org/apache/hadoop/hive/ql/optimizer/calcite/translator/ASTBuilder.java:[24,39]
package org.apache.calcite.avatica.util does not exist
[ERROR] /data/hive-ptest/working/apache-svn-trunk-source/ql/src/java/org/apache/hadoop/hive/ql/parse/SemanticAnalyzer.java:[13746,71]
cannot find symbol
  symbol:   variable GROUP_ID
  location: class org.apache.calcite.sql.fun.SqlStdOperatorTable
[ERROR] /data/hive-ptest/working/apache-svn-trunk-source/ql/src/java/org/apache/hadoop/hive/ql/optimizer/calcite/translator/RexNodeConverter.java:[313,7]
cannot find symbol
  symbol:   class ByteString
  location: class org.apache.hadoop.hive.ql.optimizer.calcite.translator.RexNodeConverter
[ERROR] /data/hive-ptest/working/apache-svn-trunk-source/ql/src/java/org/apache/hadoop/hive/ql/optimizer/calcite/translator/RexNodeConverter.java:[313,27]
cannot find symbol
  symbol:   class ByteString
  location: class org.apache.hadoop.hive.ql.optimizer.calcite.translator.RexNodeConverter
[ERROR] /data/hive-ptest/working/apache-svn-trunk-source/ql/src/java/org/apache/hadoop/hive/ql/optimizer/calcite/translator/ASTConverter.java:[185,47]
cannot find symbol
  symbol:   variable GROUP_ID
  location: class org.apache.calcite.sql.fun.SqlStdOperatorTable
[ERROR] /data/hive-ptest/working/apache-svn-trunk-source/ql/src/java/org/apache/hadoop/hive/ql/optimizer/calcite/translator/ASTBuilder.java:[148,7]
cannot find symbol
  symbol:   class ByteString
  location: class org.apache.hadoop.hive.ql.optimizer.calcite.translator.ASTBuilder
[ERROR] /data/hive-ptest/working/apache-svn-trunk-source/ql/src/java/org/apache/hadoop/hive/ql/optimizer/calcite/translator/ASTBuilder.java:[148,24]
cannot find symbol
  symbol:   class ByteString
  location: class org.apache.hadoop.hive.ql.optimizer.calcite.translator.ASTBuilder
[INFO] 8 errors 
[INFO] -------------------------------------------------------------
[INFO] ------------------------------------------------------------------------
[INFO] Reactor Summary:
[INFO] 
[INFO] Hive .............................................. SUCCESS [8.269s]
[INFO] Hive Shims Common ................................. SUCCESS [13.245s]
[INFO] Hive Shims 0.20S .................................. SUCCESS [5.098s]
[INFO] Hive Shims 0.23 ................................... SUCCESS [8.894s]
[INFO] Hive Shims Scheduler .............................. SUCCESS [2.288s]
[INFO] Hive Shims ........................................ SUCCESS [2.655s]
[INFO] Hive Common ....................................... SUCCESS [27.156s]
[INFO] Hive Serde ........................................ SUCCESS [14.918s]
[INFO] Hive Metastore .................................... SUCCESS [35.124s]
[INFO] Hive Ant Utilities ................................ SUCCESS [2.580s]
[INFO] Hive Query Language ............................... FAILURE [59.473s]
[INFO] Hive Service ...................................... SKIPPED
[INFO] Hive Accumulo Handler ............................. SKIPPED
[INFO] Hive JDBC ......................................... SKIPPED
[INFO] Hive Beeline ...................................... SKIPPED
[INFO] Hive CLI .......................................... SKIPPED
[INFO] Hive Contrib ...................................... SKIPPED
[INFO] Hive HBase Handler ................................ SKIPPED
[INFO] Hive HCatalog ..................................... SKIPPED
[INFO] Hive HCatalog Core ................................ SKIPPED
[INFO] Hive HCatalog Pig Adapter ......................... SKIPPED
[INFO] Hive HCatalog Server Extensions ................... SKIPPED
[INFO] Hive HCatalog Webhcat Java Client ................. SKIPPED
[INFO] Hive HCatalog Webhcat ............................. SKIPPED
[INFO] Hive HCatalog Streaming ........................... SKIPPED
[INFO] Hive HWI .......................................... SKIPPED
[INFO] Hive ODBC ......................................... SKIPPED
[INFO] Hive Shims Aggregator ............................. SKIPPED
[INFO] Hive TestUtils .................................... SKIPPED
[INFO] Hive Packaging .................................... SKIPPED
[INFO] ------------------------------------------------------------------------
[INFO] BUILD FAILURE
[INFO] ------------------------------------------------------------------------
[INFO] Total time: 3:02.721s
[INFO] Finished at: Thu Dec 11 17:29:33 EST 2014
[INFO] Final Memory: 89M/481M
[INFO] ------------------------------------------------------------------------
[ERROR] Failed to execute goal org.apache.maven.plugins:maven-compiler-plugin:3.1:compile
(default-compile) on project hive-exec: Compilation failure: Compilation failure:
[ERROR] /data/hive-ptest/working/apache-svn-trunk-source/ql/src/java/org/apache/hadoop/hive/ql/optimizer/calcite/translator/RexNodeConverter.java:[32,39]
package org.apache.calcite.avatica.util does not exist
[ERROR] /data/hive-ptest/working/apache-svn-trunk-source/ql/src/java/org/apache/hadoop/hive/ql/optimizer/calcite/translator/ASTBuilder.java:[24,39]
package org.apache.calcite.avatica.util does not exist
[ERROR] /data/hive-ptest/working/apache-svn-trunk-source/ql/src/java/org/apache/hadoop/hive/ql/parse/SemanticAnalyzer.java:[13746,71]
cannot find symbol
[ERROR] symbol:   variable GROUP_ID
[ERROR] location: class org.apache.calcite.sql.fun.SqlStdOperatorTable
[ERROR] /data/hive-ptest/working/apache-svn-trunk-source/ql/src/java/org/apache/hadoop/hive/ql/optimizer/calcite/translator/RexNodeConverter.java:[313,7]
cannot find symbol
[ERROR] symbol:   class ByteString
[ERROR] location: class org.apache.hadoop.hive.ql.optimizer.calcite.translator.RexNodeConverter
[ERROR] /data/hive-ptest/working/apache-svn-trunk-source/ql/src/java/org/apache/hadoop/hive/ql/optimizer/calcite/translator/RexNodeConverter.java:[313,27]
cannot find symbol
[ERROR] symbol:   class ByteString
[ERROR] location: class org.apache.hadoop.hive.ql.optimizer.calcite.translator.RexNodeConverter
[ERROR] /data/hive-ptest/working/apache-svn-trunk-source/ql/src/java/org/apache/hadoop/hive/ql/optimizer/calcite/translator/ASTConverter.java:[185,47]
cannot find symbol
[ERROR] symbol:   variable GROUP_ID
[ERROR] location: class org.apache.calcite.sql.fun.SqlStdOperatorTable
[ERROR] /data/hive-ptest/working/apache-svn-trunk-source/ql/src/java/org/apache/hadoop/hive/ql/optimizer/calcite/translator/ASTBuilder.java:[148,7]
cannot find symbol
[ERROR] symbol:   class ByteString
[ERROR] location: class org.apache.hadoop.hive.ql.optimizer.calcite.translator.ASTBuilder
[ERROR] /data/hive-ptest/working/apache-svn-trunk-source/ql/src/java/org/apache/hadoop/hive/ql/optimizer/calcite/translator/ASTBuilder.java:[148,24]
cannot find symbol
[ERROR] symbol:   class ByteString
[ERROR] location: class org.apache.hadoop.hive.ql.optimizer.calcite.translator.ASTBuilder
[ERROR] -> [Help 1]
[ERROR] 
[ERROR] To see the full stack trace of the errors, re-run Maven with the -e switch.
[ERROR] Re-run Maven using the -X switch to enable full debug logging.
[ERROR] 
[ERROR] For more information about the errors and possible solutions, please read the following
articles:
[ERROR] [Help 1] http://cwiki.apache.org/confluence/display/MAVEN/MojoFailureException
[ERROR] 
[ERROR] After correcting the problems, you can resume the build with the command
[ERROR]   mvn <goals> -rf :hive-exec
+ exit 1
'
{noformat}

This message is automatically generated.

ATTACHMENT ID: 12686661 - PreCommit-HIVE-TRUNK-Build

> Support advanced aggregation in Hive to Calcite path 
> -----------------------------------------------------
>
>                 Key: HIVE-8988
>                 URL: https://issues.apache.org/jira/browse/HIVE-8988
>             Project: Hive
>          Issue Type: Improvement
>    Affects Versions: 0.15.0
>            Reporter: Jesus Camacho Rodriguez
>            Assignee: Jesus Camacho Rodriguez
>              Labels: grouping, logical, optiq
>             Fix For: 0.15.0
>
>         Attachments: HIVE-8988.patch
>
>
> To close the gap between Hive and Calcite, we need to support the translation of GroupingSets
into Calcite; currently this is not implemented.



--
This message was sent by Atlassian JIRA
(v6.3.4#6332)

Mime
View raw message