hive-dev mailing list archives

Site index · List index
Message view « Date » · « Thread »
Top « Date » · « Thread »
From "Hive QA (JIRA)" <j...@apache.org>
Subject [jira] [Commented] (HIVE-7641) INSERT ... SELECT with no source table leads to NPE
Date Sat, 13 Dec 2014 03:27:13 GMT

    [ https://issues.apache.org/jira/browse/HIVE-7641?page=com.atlassian.jira.plugin.system.issuetabpanels:comment-tabpanel&focusedCommentId=14245156#comment-14245156
] 

Hive QA commented on HIVE-7641:
-------------------------------



{color:red}Overall{color}: -1 at least one tests failed

Here are the results of testing the latest attachment:
https://issues.apache.org/jira/secure/attachment/12686793/HIVE-7641.4.patch.txt

{color:red}ERROR:{color} -1 due to 1 failed/errored test(s), 6701 tests executed
*Failed tests:*
{noformat}
org.apache.hadoop.hive.cli.TestMiniTezCliDriver.testCliDriver_optimize_nullscan
{noformat}

Test results: http://ec2-174-129-184-35.compute-1.amazonaws.com/jenkins/job/PreCommit-HIVE-TRUNK-Build/2064/testReport
Console output: http://ec2-174-129-184-35.compute-1.amazonaws.com/jenkins/job/PreCommit-HIVE-TRUNK-Build/2064/console
Test logs: http://ec2-174-129-184-35.compute-1.amazonaws.com/logs/PreCommit-HIVE-TRUNK-Build-2064/

Messages:
{noformat}
Executing org.apache.hive.ptest.execution.PrepPhase
Executing org.apache.hive.ptest.execution.ExecutionPhase
Executing org.apache.hive.ptest.execution.ReportingPhase
Tests exited with: TestsFailedException: 1 tests failed
{noformat}

This message is automatically generated.

ATTACHMENT ID: 12686793 - PreCommit-HIVE-TRUNK-Build

> INSERT ... SELECT with no source table leads to NPE
> ---------------------------------------------------
>
>                 Key: HIVE-7641
>                 URL: https://issues.apache.org/jira/browse/HIVE-7641
>             Project: Hive
>          Issue Type: Bug
>          Components: Query Processor
>    Affects Versions: 0.13.1
>            Reporter: Lenni Kuff
>            Assignee: Navis
>         Attachments: HIVE-7641.1.patch.txt, HIVE-7641.2.patch.txt, HIVE-7641.3.patch.txt,
HIVE-7641.4.patch.txt
>
>
> When no source table is provided for an INSERT statement Hive fails with NPE. 
> {code}
> 0: jdbc:hive2://localhost:11050/default> create table test_tbl(i int);
> No rows affected (0.333 seconds)
> 0: jdbc:hive2://localhost:11050/default> insert into table test_tbl select 1;
> Error: Error while compiling statement: FAILED: NullPointerException null (state=42000,code=40000)
> -- Get a NPE even when using incorrect syntax (no TABLE keyword)
> 0: jdbc:hive2://localhost:11050/default> insert into test_tbl select 1;
> Error: Error while compiling statement: FAILED: NullPointerException null (state=42000,code=40000)
> -- Works when a source table is provided
> 0: jdbc:hive2://localhost:11050/default> insert into table test_tbl select 1 from
foo;
> No rows affected (5.751 seconds)
> {code}



--
This message was sent by Atlassian JIRA
(v6.3.4#6332)

Mime
View raw message