hive-dev mailing list archives

Site index · List index
Message view « Date » · « Thread »
Top « Date » · « Thread »
From "Hive QA (JIRA)" <j...@apache.org>
Subject [jira] [Commented] (HIVE-8892) Use MEMORY_AND_DISK for RDD caching [Spark Branch]
Date Sun, 16 Nov 2014 19:35:34 GMT

    [ https://issues.apache.org/jira/browse/HIVE-8892?page=com.atlassian.jira.plugin.system.issuetabpanels:comment-tabpanel&focusedCommentId=14214023#comment-14214023
] 

Hive QA commented on HIVE-8892:
-------------------------------



{color:red}Overall{color}: -1 no tests executed

Here are the results of testing the latest attachment:
https://issues.apache.org/jira/secure/attachment/12681799/HIVE-8892.1-spark.patch

Test results: http://ec2-174-129-184-35.compute-1.amazonaws.com/jenkins/job/PreCommit-HIVE-SPARK-Build/369/testReport
Console output: http://ec2-174-129-184-35.compute-1.amazonaws.com/jenkins/job/PreCommit-HIVE-SPARK-Build/369/console
Test logs: http://ec2-174-129-184-35.compute-1.amazonaws.com/logs/PreCommit-HIVE-SPARK-Build-369/

Messages:
{noformat}
**** This message was trimmed, see log for full details ****
[INFO] Installing /data/hive-ptest/working/apache-svn-spark-source/shims/0.20/target/hive-shims-0.20-0.15.0-SNAPSHOT.jar
to /data/hive-ptest/working/maven/org/apache/hive/shims/hive-shims-0.20/0.15.0-SNAPSHOT/hive-shims-0.20-0.15.0-SNAPSHOT.jar
[INFO] Installing /data/hive-ptest/working/apache-svn-spark-source/shims/0.20/pom.xml to /data/hive-ptest/working/maven/org/apache/hive/shims/hive-shims-0.20/0.15.0-SNAPSHOT/hive-shims-0.20-0.15.0-SNAPSHOT.pom
[INFO]                                                                         
[INFO] ------------------------------------------------------------------------
[INFO] Building Hive Shims Secure Common 0.15.0-SNAPSHOT
[INFO] ------------------------------------------------------------------------
[INFO] 
[INFO] --- maven-clean-plugin:2.5:clean (default-clean) @ hive-shims-common-secure ---
[INFO] Deleting /data/hive-ptest/working/apache-svn-spark-source/shims/common-secure (includes
= [datanucleus.log, derby.log], excludes = [])
[INFO] 
[INFO] --- maven-remote-resources-plugin:1.5:process (default) @ hive-shims-common-secure
---
[INFO] 
[INFO] --- maven-resources-plugin:2.6:resources (default-resources) @ hive-shims-common-secure
---
[INFO] Using 'UTF-8' encoding to copy filtered resources.
[INFO] skip non existing resourceDirectory /data/hive-ptest/working/apache-svn-spark-source/shims/common-secure/src/main/resources
[INFO] Copying 3 resources
[INFO] 
[INFO] --- maven-antrun-plugin:1.7:run (define-classpath) @ hive-shims-common-secure ---
[INFO] Executing tasks

main:
[INFO] Executed tasks
[INFO] 
[INFO] --- maven-compiler-plugin:3.1:compile (default-compile) @ hive-shims-common-secure
---
[INFO] Compiling 12 source files to /data/hive-ptest/working/apache-svn-spark-source/shims/common-secure/target/classes
[WARNING] /data/hive-ptest/working/apache-svn-spark-source/shims/common-secure/src/main/java/org/apache/hadoop/hive/shims/HadoopShimsSecure.java:
/data/hive-ptest/working/apache-svn-spark-source/shims/common-secure/src/main/java/org/apache/hadoop/hive/shims/HadoopShimsSecure.java
uses or overrides a deprecated API.
[WARNING] /data/hive-ptest/working/apache-svn-spark-source/shims/common-secure/src/main/java/org/apache/hadoop/hive/shims/HadoopShimsSecure.java:
Recompile with -Xlint:deprecation for details.
[WARNING] /data/hive-ptest/working/apache-svn-spark-source/shims/common-secure/src/main/java/org/apache/hadoop/hive/shims/HadoopShimsSecure.java:
Some input files use unchecked or unsafe operations.
[WARNING] /data/hive-ptest/working/apache-svn-spark-source/shims/common-secure/src/main/java/org/apache/hadoop/hive/shims/HadoopShimsSecure.java:
Recompile with -Xlint:unchecked for details.
[INFO] 
[INFO] --- maven-resources-plugin:2.6:testResources (default-testResources) @ hive-shims-common-secure
---
[INFO] Using 'UTF-8' encoding to copy filtered resources.
[INFO] skip non existing resourceDirectory /data/hive-ptest/working/apache-svn-spark-source/shims/common-secure/src/test/resources
[INFO] Copying 3 resources
[INFO] 
[INFO] --- maven-antrun-plugin:1.7:run (setup-test-dirs) @ hive-shims-common-secure ---
[INFO] Executing tasks

main:
    [mkdir] Created dir: /data/hive-ptest/working/apache-svn-spark-source/shims/common-secure/target/tmp
    [mkdir] Created dir: /data/hive-ptest/working/apache-svn-spark-source/shims/common-secure/target/warehouse
    [mkdir] Created dir: /data/hive-ptest/working/apache-svn-spark-source/shims/common-secure/target/tmp/conf
     [copy] Copying 9 files to /data/hive-ptest/working/apache-svn-spark-source/shims/common-secure/target/tmp/conf
[INFO] Executed tasks
[INFO] 
[INFO] --- maven-compiler-plugin:3.1:testCompile (default-testCompile) @ hive-shims-common-secure
---
[INFO] No sources to compile
[INFO] 
[INFO] --- maven-surefire-plugin:2.16:test (default-test) @ hive-shims-common-secure ---
[INFO] Tests are skipped.
[INFO] 
[INFO] --- maven-jar-plugin:2.2:jar (default-jar) @ hive-shims-common-secure ---
[INFO] Building jar: /data/hive-ptest/working/apache-svn-spark-source/shims/common-secure/target/hive-shims-common-secure-0.15.0-SNAPSHOT.jar
[INFO] 
[INFO] --- maven-site-plugin:3.3:attach-descriptor (attach-descriptor) @ hive-shims-common-secure
---
[INFO] 
[INFO] --- maven-install-plugin:2.4:install (default-install) @ hive-shims-common-secure ---
[INFO] Installing /data/hive-ptest/working/apache-svn-spark-source/shims/common-secure/target/hive-shims-common-secure-0.15.0-SNAPSHOT.jar
to /data/hive-ptest/working/maven/org/apache/hive/shims/hive-shims-common-secure/0.15.0-SNAPSHOT/hive-shims-common-secure-0.15.0-SNAPSHOT.jar
[INFO] Installing /data/hive-ptest/working/apache-svn-spark-source/shims/common-secure/pom.xml
to /data/hive-ptest/working/maven/org/apache/hive/shims/hive-shims-common-secure/0.15.0-SNAPSHOT/hive-shims-common-secure-0.15.0-SNAPSHOT.pom
[INFO]                                                                         
[INFO] ------------------------------------------------------------------------
[INFO] Building Hive Shims 0.20S 0.15.0-SNAPSHOT
[INFO] ------------------------------------------------------------------------
[INFO] 
[INFO] --- maven-clean-plugin:2.5:clean (default-clean) @ hive-shims-0.20S ---
[INFO] Deleting /data/hive-ptest/working/apache-svn-spark-source/shims/0.20S (includes = [datanucleus.log,
derby.log], excludes = [])
[INFO] 
[INFO] --- maven-remote-resources-plugin:1.5:process (default) @ hive-shims-0.20S ---
[INFO] 
[INFO] --- maven-resources-plugin:2.6:resources (default-resources) @ hive-shims-0.20S ---
[INFO] Using 'UTF-8' encoding to copy filtered resources.
[INFO] skip non existing resourceDirectory /data/hive-ptest/working/apache-svn-spark-source/shims/0.20S/src/main/resources
[INFO] Copying 3 resources
[INFO] 
[INFO] --- maven-antrun-plugin:1.7:run (define-classpath) @ hive-shims-0.20S ---
[INFO] Executing tasks

main:
[INFO] Executed tasks
[INFO] 
[INFO] --- maven-compiler-plugin:3.1:compile (default-compile) @ hive-shims-0.20S ---
[INFO] Compiling 3 source files to /data/hive-ptest/working/apache-svn-spark-source/shims/0.20S/target/classes
[WARNING] /data/hive-ptest/working/apache-svn-spark-source/shims/0.20S/src/main/java/org/apache/hadoop/hive/shims/Hadoop20SShims.java:
/data/hive-ptest/working/apache-svn-spark-source/shims/0.20S/src/main/java/org/apache/hadoop/hive/shims/Hadoop20SShims.java
uses or overrides a deprecated API.
[WARNING] /data/hive-ptest/working/apache-svn-spark-source/shims/0.20S/src/main/java/org/apache/hadoop/hive/shims/Hadoop20SShims.java:
Recompile with -Xlint:deprecation for details.
[INFO] 
[INFO] --- maven-resources-plugin:2.6:testResources (default-testResources) @ hive-shims-0.20S
---
[INFO] Using 'UTF-8' encoding to copy filtered resources.
[INFO] skip non existing resourceDirectory /data/hive-ptest/working/apache-svn-spark-source/shims/0.20S/src/test/resources
[INFO] Copying 3 resources
[INFO] 
[INFO] --- maven-antrun-plugin:1.7:run (setup-test-dirs) @ hive-shims-0.20S ---
[INFO] Executing tasks

main:
    [mkdir] Created dir: /data/hive-ptest/working/apache-svn-spark-source/shims/0.20S/target/tmp
    [mkdir] Created dir: /data/hive-ptest/working/apache-svn-spark-source/shims/0.20S/target/warehouse
    [mkdir] Created dir: /data/hive-ptest/working/apache-svn-spark-source/shims/0.20S/target/tmp/conf
     [copy] Copying 9 files to /data/hive-ptest/working/apache-svn-spark-source/shims/0.20S/target/tmp/conf
[INFO] Executed tasks
[INFO] 
[INFO] --- maven-compiler-plugin:3.1:testCompile (default-testCompile) @ hive-shims-0.20S
---
[INFO] No sources to compile
[INFO] 
[INFO] --- maven-surefire-plugin:2.16:test (default-test) @ hive-shims-0.20S ---
[INFO] Tests are skipped.
[INFO] 
[INFO] --- maven-jar-plugin:2.2:jar (default-jar) @ hive-shims-0.20S ---
[INFO] Building jar: /data/hive-ptest/working/apache-svn-spark-source/shims/0.20S/target/hive-shims-0.20S-0.15.0-SNAPSHOT.jar
[INFO] 
[INFO] --- maven-site-plugin:3.3:attach-descriptor (attach-descriptor) @ hive-shims-0.20S
---
[INFO] 
[INFO] --- maven-install-plugin:2.4:install (default-install) @ hive-shims-0.20S ---
[INFO] Installing /data/hive-ptest/working/apache-svn-spark-source/shims/0.20S/target/hive-shims-0.20S-0.15.0-SNAPSHOT.jar
to /data/hive-ptest/working/maven/org/apache/hive/shims/hive-shims-0.20S/0.15.0-SNAPSHOT/hive-shims-0.20S-0.15.0-SNAPSHOT.jar
[INFO] Installing /data/hive-ptest/working/apache-svn-spark-source/shims/0.20S/pom.xml to
/data/hive-ptest/working/maven/org/apache/hive/shims/hive-shims-0.20S/0.15.0-SNAPSHOT/hive-shims-0.20S-0.15.0-SNAPSHOT.pom
[INFO]                                                                         
[INFO] ------------------------------------------------------------------------
[INFO] Building Hive Shims 0.23 0.15.0-SNAPSHOT
[INFO] ------------------------------------------------------------------------
Downloading: http://repository.apache.org/snapshots/org/apache/tez/tez-api/0.5.2-SNAPSHOT/maven-metadata.xml
Downloading: http://ec2-50-18-79-139.us-west-1.compute.amazonaws.com/data/spark_2.10-1.2-SNAPSHOT/org/apache/tez/tez-api/0.5.2-SNAPSHOT/maven-metadata.xml
Downloading: http://ec2-50-18-79-139.us-west-1.compute.amazonaws.com/data/spark_2.10-1.2-SNAPSHOT/org/apache/tez/tez-api/0.5.2-SNAPSHOT/tez-api-0.5.2-SNAPSHOT.pom
Downloading: http://repository.apache.org/snapshots/org/apache/tez/tez-api/0.5.2-SNAPSHOT/tez-api-0.5.2-SNAPSHOT.pom
[WARNING] The POM for org.apache.tez:tez-api:jar:0.5.2-SNAPSHOT is missing, no dependency
information available
Downloading: http://ec2-50-18-79-139.us-west-1.compute.amazonaws.com/data/spark_2.10-1.2-SNAPSHOT/org/apache/tez/tez-runtime-library/0.5.2-SNAPSHOT/maven-metadata.xml
Downloading: http://repository.apache.org/snapshots/org/apache/tez/tez-runtime-library/0.5.2-SNAPSHOT/maven-metadata.xml
Downloading: http://ec2-50-18-79-139.us-west-1.compute.amazonaws.com/data/spark_2.10-1.2-SNAPSHOT/org/apache/tez/tez-runtime-library/0.5.2-SNAPSHOT/tez-runtime-library-0.5.2-SNAPSHOT.pom
Downloading: http://repository.apache.org/snapshots/org/apache/tez/tez-runtime-library/0.5.2-SNAPSHOT/tez-runtime-library-0.5.2-SNAPSHOT.pom
[WARNING] The POM for org.apache.tez:tez-runtime-library:jar:0.5.2-SNAPSHOT is missing, no
dependency information available
Downloading: http://ec2-50-18-79-139.us-west-1.compute.amazonaws.com/data/spark_2.10-1.2-SNAPSHOT/org/apache/tez/tez-mapreduce/0.5.2-SNAPSHOT/maven-metadata.xml
Downloading: http://repository.apache.org/snapshots/org/apache/tez/tez-mapreduce/0.5.2-SNAPSHOT/maven-metadata.xml
Downloading: http://ec2-50-18-79-139.us-west-1.compute.amazonaws.com/data/spark_2.10-1.2-SNAPSHOT/org/apache/tez/tez-mapreduce/0.5.2-SNAPSHOT/tez-mapreduce-0.5.2-SNAPSHOT.pom
Downloading: http://repository.apache.org/snapshots/org/apache/tez/tez-mapreduce/0.5.2-SNAPSHOT/tez-mapreduce-0.5.2-SNAPSHOT.pom
[WARNING] The POM for org.apache.tez:tez-mapreduce:jar:0.5.2-SNAPSHOT is missing, no dependency
information available
Downloading: http://repository.apache.org/snapshots/org/apache/tez/tez-tests/0.5.2-SNAPSHOT/maven-metadata.xml
Downloading: http://ec2-50-18-79-139.us-west-1.compute.amazonaws.com/data/spark_2.10-1.2-SNAPSHOT/org/apache/tez/tez-tests/0.5.2-SNAPSHOT/maven-metadata.xml
Downloading: http://ec2-50-18-79-139.us-west-1.compute.amazonaws.com/data/spark_2.10-1.2-SNAPSHOT/org/apache/tez/tez-tests/0.5.2-SNAPSHOT/tez-tests-0.5.2-SNAPSHOT.pom
Downloading: http://repository.apache.org/snapshots/org/apache/tez/tez-tests/0.5.2-SNAPSHOT/tez-tests-0.5.2-SNAPSHOT.pom
[WARNING] The POM for org.apache.tez:tez-tests:jar:tests:0.5.2-SNAPSHOT is missing, no dependency
information available
Downloading: http://ec2-50-18-79-139.us-west-1.compute.amazonaws.com/data/spark_2.10-1.2-SNAPSHOT/org/apache/tez/tez-api/0.5.2-SNAPSHOT/tez-api-0.5.2-SNAPSHOT.jar
Downloading: http://ec2-50-18-79-139.us-west-1.compute.amazonaws.com/data/spark_2.10-1.2-SNAPSHOT/org/apache/tez/tez-runtime-library/0.5.2-SNAPSHOT/tez-runtime-library-0.5.2-SNAPSHOT.jar
Downloading: http://ec2-50-18-79-139.us-west-1.compute.amazonaws.com/data/spark_2.10-1.2-SNAPSHOT/org/apache/tez/tez-mapreduce/0.5.2-SNAPSHOT/tez-mapreduce-0.5.2-SNAPSHOT.jar
Downloading: http://ec2-50-18-79-139.us-west-1.compute.amazonaws.com/data/spark_2.10-1.2-SNAPSHOT/org/apache/tez/tez-tests/0.5.2-SNAPSHOT/tez-tests-0.5.2-SNAPSHOT-tests.jar
Downloading: http://repository.apache.org/snapshots/org/apache/tez/tez-api/0.5.2-SNAPSHOT/tez-api-0.5.2-SNAPSHOT.jar
Downloading: http://repository.apache.org/snapshots/org/apache/tez/tez-runtime-library/0.5.2-SNAPSHOT/tez-runtime-library-0.5.2-SNAPSHOT.jar
Downloading: http://repository.apache.org/snapshots/org/apache/tez/tez-tests/0.5.2-SNAPSHOT/tez-tests-0.5.2-SNAPSHOT-tests.jar
Downloading: http://repository.apache.org/snapshots/org/apache/tez/tez-mapreduce/0.5.2-SNAPSHOT/tez-mapreduce-0.5.2-SNAPSHOT.jar
[INFO] ------------------------------------------------------------------------
[INFO] Reactor Summary:
[INFO] 
[INFO] Hive .............................................. SUCCESS [3.411s]
[INFO] Hive Shims Common ................................. SUCCESS [2.252s]
[INFO] Hive Shims 0.20 ................................... SUCCESS [0.943s]
[INFO] Hive Shims Secure Common .......................... SUCCESS [1.311s]
[INFO] Hive Shims 0.20S .................................. SUCCESS [0.787s]
[INFO] Hive Shims 0.23 ................................... FAILURE [1.484s]
[INFO] Hive Shims Scheduler .............................. SKIPPED
[INFO] Hive Shims ........................................ SKIPPED
[INFO] Hive Common ....................................... SKIPPED
[INFO] Hive Serde ........................................ SKIPPED
[INFO] Hive Metastore .................................... SKIPPED
[INFO] Hive Ant Utilities ................................ SKIPPED
[INFO] Hive Query Language ............................... SKIPPED
[INFO] Hive Service ...................................... SKIPPED
[INFO] Hive Accumulo Handler ............................. SKIPPED
[INFO] Hive JDBC ......................................... SKIPPED
[INFO] Hive Beeline ...................................... SKIPPED
[INFO] Hive CLI .......................................... SKIPPED
[INFO] Hive Contrib ...................................... SKIPPED
[INFO] Hive HBase Handler ................................ SKIPPED
[INFO] Hive HCatalog ..................................... SKIPPED
[INFO] Hive HCatalog Core ................................ SKIPPED
[INFO] Hive HCatalog Pig Adapter ......................... SKIPPED
[INFO] Hive HCatalog Server Extensions ................... SKIPPED
[INFO] Hive HCatalog Webhcat Java Client ................. SKIPPED
[INFO] Hive HCatalog Webhcat ............................. SKIPPED
[INFO] Hive HCatalog Streaming ........................... SKIPPED
[INFO] Hive HWI .......................................... SKIPPED
[INFO] Hive ODBC ......................................... SKIPPED
[INFO] Hive Shims Aggregator ............................. SKIPPED
[INFO] Spark Remote Client ............................... SKIPPED
[INFO] Hive TestUtils .................................... SKIPPED
[INFO] Hive Packaging .................................... SKIPPED
[INFO] ------------------------------------------------------------------------
[INFO] BUILD FAILURE
[INFO] ------------------------------------------------------------------------
[INFO] Total time: 11.138s
[INFO] Finished at: Sun Nov 16 14:36:25 EST 2014
[INFO] Final Memory: 44M/471M
[INFO] ------------------------------------------------------------------------
[ERROR] Failed to execute goal on project hive-shims-0.23: Could not resolve dependencies
for project org.apache.hive.shims:hive-shims-0.23:jar:0.15.0-SNAPSHOT: The following artifacts
could not be resolved: org.apache.tez:tez-api:jar:0.5.2-SNAPSHOT, org.apache.tez:tez-runtime-library:jar:0.5.2-SNAPSHOT,
org.apache.tez:tez-mapreduce:jar:0.5.2-SNAPSHOT, org.apache.tez:tez-tests:jar:tests:0.5.2-SNAPSHOT:
Could not find artifact org.apache.tez:tez-api:jar:0.5.2-SNAPSHOT in spark-snapshot (http://ec2-50-18-79-139.us-west-1.compute.amazonaws.com/data/spark_2.10-1.2-SNAPSHOT/)
-> [Help 1]
[ERROR] 
[ERROR] To see the full stack trace of the errors, re-run Maven with the -e switch.
[ERROR] Re-run Maven using the -X switch to enable full debug logging.
[ERROR] 
[ERROR] For more information about the errors and possible solutions, please read the following
articles:
[ERROR] [Help 1] http://cwiki.apache.org/confluence/display/MAVEN/DependencyResolutionException
[ERROR] 
[ERROR] After correcting the problems, you can resume the build with the command
[ERROR]   mvn <goals> -rf :hive-shims-0.23
'
{noformat}

This message is automatically generated.

ATTACHMENT ID: 12681799 - PreCommit-HIVE-SPARK-Build

> Use MEMORY_AND_DISK for RDD caching [Spark Branch]
> --------------------------------------------------
>
>                 Key: HIVE-8892
>                 URL: https://issues.apache.org/jira/browse/HIVE-8892
>             Project: Hive
>          Issue Type: Sub-task
>          Components: Spark
>            Reporter: Jimmy Xiang
>            Assignee: Jimmy Xiang
>            Priority: Minor
>         Attachments: HIVE-8892.1-spark.patch
>
>
> In HIVE-8844, we made the persistent policy for RDD caching configurable. We should do
something simpler and don't add additional configurations.



--
This message was sent by Atlassian JIRA
(v6.3.4#6332)

Mime
View raw message