hive-dev mailing list archives

Site index · List index
Message view « Date » · « Thread »
Top « Date » · « Thread »
From "Hive QA (JIRA)" <j...@apache.org>
Subject [jira] [Commented] (HIVE-8852) Update new spark progress API for local submitted job monitoring[Spark Branch]
Date Mon, 17 Nov 2014 05:27:33 GMT

    [ https://issues.apache.org/jira/browse/HIVE-8852?page=com.atlassian.jira.plugin.system.issuetabpanels:comment-tabpanel&focusedCommentId=14214285#comment-14214285
] 

Hive QA commented on HIVE-8852:
-------------------------------



{color:red}Overall{color}: -1 no tests executed

Here are the results of testing the latest attachment:
https://issues.apache.org/jira/secure/attachment/12681839/HIVE-8852.2-spark.patch

Test results: http://ec2-174-129-184-35.compute-1.amazonaws.com/jenkins/job/PreCommit-HIVE-SPARK-Build/372/testReport
Console output: http://ec2-174-129-184-35.compute-1.amazonaws.com/jenkins/job/PreCommit-HIVE-SPARK-Build/372/console
Test logs: http://ec2-174-129-184-35.compute-1.amazonaws.com/logs/PreCommit-HIVE-SPARK-Build-372/

Messages:
{noformat}
**** This message was trimmed, see log for full details ****
Downloading: http://repo.maven.apache.org/maven2/org/iq80/snappy/snappy/0.2/snappy-0.2.jar
Downloaded: http://repo.maven.apache.org/maven2/org/iq80/snappy/snappy/0.2/snappy-0.2.jar
(48 KB at 3964.8 KB/sec)
Downloading: http://repo.maven.apache.org/maven2/org/json/json/20090211/json-20090211.jar
Downloaded: http://repo.maven.apache.org/maven2/org/json/json/20090211/json-20090211.jar (45
KB at 3738.9 KB/sec)
Downloading: http://repo.maven.apache.org/maven2/com/twitter/parquet-column/1.5.0/parquet-column-1.5.0-tests.jar
Downloaded: http://repo.maven.apache.org/maven2/org/jodd/jodd-core/3.5.2/jodd-core-3.5.2.jar
(418 KB at 4016.9 KB/sec)
Downloading: http://repo.maven.apache.org/maven2/com/twitter/parquet-common/1.5.0/parquet-common-1.5.0.jar
Downloaded: http://repo.maven.apache.org/maven2/org/apache/avro/avro-ipc/1.7.5/avro-ipc-1.7.5-tests.jar
(329 KB at 1865.3 KB/sec)
Downloaded: http://repo.maven.apache.org/maven2/com/twitter/parquet-hadoop-bundle/1.5.0/parquet-hadoop-bundle-1.5.0.jar
(2513 KB at 12501.4 KB/sec)
Downloading: http://repo.maven.apache.org/maven2/com/twitter/parquet-encoding/1.5.0/parquet-encoding-1.5.0.jar
Downloading: http://repo.maven.apache.org/maven2/com/twitter/parquet-generator/1.5.0/parquet-generator-1.5.0.jar
Downloaded: http://repo.maven.apache.org/maven2/com/twitter/parquet-column/1.5.0/parquet-column-1.5.0-tests.jar
(118 KB at 2406.0 KB/sec)
Downloading: http://repo.maven.apache.org/maven2/org/fusesource/jansi/jansi/1.11/jansi-1.11.jar
Downloaded: http://repo.maven.apache.org/maven2/org/codehaus/groovy/groovy-all/2.1.6/groovy-all-2.1.6.jar
(6228 KB at 34793.2 KB/sec)
Downloading: http://repo.maven.apache.org/maven2/org/apache/hadoop/hadoop-annotations/2.4.0/hadoop-annotations-2.4.0.jar
Downloaded: http://repo.maven.apache.org/maven2/com/twitter/parquet-generator/1.5.0/parquet-generator-1.5.0.jar
(10 KB at 760.7 KB/sec)
Downloading: http://repo.maven.apache.org/maven2/org/apache/tez/tez-runtime-internals/0.5.2/tez-runtime-internals-0.5.2.jar
Downloaded: http://repo.maven.apache.org/maven2/com/twitter/parquet-encoding/1.5.0/parquet-encoding-1.5.0.jar
(267 KB at 13316.6 KB/sec)
Downloading: http://repo.maven.apache.org/maven2/com/twitter/chill_2.10/0.5.0/chill_2.10-0.5.0.jar
Downloaded: http://repo.maven.apache.org/maven2/org/apache/hadoop/hadoop-annotations/2.4.0/hadoop-annotations-2.4.0.jar
(17 KB at 1512.3 KB/sec)
Downloading: http://repo.maven.apache.org/maven2/com/twitter/chill-java/0.5.0/chill-java-0.5.0.jar
Downloaded: http://repo.maven.apache.org/maven2/org/fusesource/jansi/jansi/1.11/jansi-1.11.jar
(112 KB at 4469.3 KB/sec)
Downloading: http://repo.maven.apache.org/maven2/org/apache/hadoop/hadoop-client/2.5.0/hadoop-client-2.5.0.jar
Downloaded: http://repo.maven.apache.org/maven2/org/apache/tez/tez-runtime-internals/0.5.2/tez-runtime-internals-0.5.2.jar
(115 KB at 6739.9 KB/sec)
Downloading: http://repo.maven.apache.org/maven2/org/apache/hadoop/hadoop-mapreduce-client-app/2.5.0/hadoop-mapreduce-client-app-2.5.0.jar
Downloaded: http://repo.maven.apache.org/maven2/com/twitter/chill_2.10/0.5.0/chill_2.10-0.5.0.jar
(216 KB at 15418.0 KB/sec)
Downloading: http://repo.maven.apache.org/maven2/org/apache/hadoop/hadoop-mapreduce-client-jobclient/2.5.0/hadoop-mapreduce-client-jobclient-2.5.0.jar
Downloaded: http://repo.maven.apache.org/maven2/com/twitter/chill-java/0.5.0/chill-java-0.5.0.jar
(46 KB at 3041.3 KB/sec)
Downloading: http://repo.maven.apache.org/maven2/org/apache/curator/curator-recipes/2.4.0/curator-recipes-2.4.0.jar
Downloaded: http://repo.maven.apache.org/maven2/org/apache/hadoop/hadoop-client/2.5.0/hadoop-client-2.5.0.jar
(3 KB at 207.9 KB/sec)
Downloading: http://repo.maven.apache.org/maven2/org/eclipse/jetty/jetty-plus/8.1.14.v20131031/jetty-plus-8.1.14.v20131031.jar
Downloaded: http://repo.maven.apache.org/maven2/org/apache/hadoop/hadoop-mapreduce-client-app/2.5.0/hadoop-mapreduce-client-app-2.5.0.jar
(480 KB at 21813.3 KB/sec)
Downloading: http://repo.maven.apache.org/maven2/org/eclipse/jetty/orbit/javax.transaction/1.1.1.v201105210645/javax.transaction-1.1.1.v201105210645.jar
Downloaded: http://repo.maven.apache.org/maven2/org/eclipse/jetty/jetty-plus/8.1.14.v20131031/jetty-plus-8.1.14.v20131031.jar
(84 KB at 4626.8 KB/sec)
Downloading: http://repo.maven.apache.org/maven2/org/eclipse/jetty/jetty-webapp/8.1.14.v20131031/jetty-webapp-8.1.14.v20131031.jar
Downloaded: http://repo.maven.apache.org/maven2/org/apache/curator/curator-recipes/2.4.0/curator-recipes-2.4.0.jar
(236 KB at 12403.5 KB/sec)
Downloading: http://repo.maven.apache.org/maven2/org/eclipse/jetty/jetty-xml/8.1.14.v20131031/jetty-xml-8.1.14.v20131031.jar
Downloaded: http://repo.maven.apache.org/maven2/org/eclipse/jetty/orbit/javax.transaction/1.1.1.v201105210645/javax.transaction-1.1.1.v201105210645.jar
(29 KB at 2368.0 KB/sec)
Downloading: http://repo.maven.apache.org/maven2/org/eclipse/jetty/jetty-servlet/8.1.14.v20131031/jetty-servlet-8.1.14.v20131031.jar
Downloaded: http://repo.maven.apache.org/maven2/org/eclipse/jetty/jetty-xml/8.1.14.v20131031/jetty-xml-8.1.14.v20131031.jar
(39 KB at 2934.6 KB/sec)
Downloading: http://repo.maven.apache.org/maven2/org/eclipse/jetty/jetty-jndi/8.1.14.v20131031/jetty-jndi-8.1.14.v20131031.jar
Downloaded: http://repo.maven.apache.org/maven2/org/eclipse/jetty/jetty-webapp/8.1.14.v20131031/jetty-webapp-8.1.14.v20131031.jar
(108 KB at 5375.8 KB/sec)
Downloading: http://repo.maven.apache.org/maven2/org/eclipse/jetty/orbit/javax.mail.glassfish/1.4.1.v201005082020/javax.mail.glassfish-1.4.1.v201005082020.jar
Downloaded: http://repo.maven.apache.org/maven2/org/eclipse/jetty/jetty-servlet/8.1.14.v20131031/jetty-servlet-8.1.14.v20131031.jar
(100 KB at 6622.0 KB/sec)
Downloading: http://repo.maven.apache.org/maven2/org/eclipse/jetty/orbit/javax.activation/1.1.0.v201105071233/javax.activation-1.1.0.v201105071233.jar
Downloaded: http://repo.maven.apache.org/maven2/org/eclipse/jetty/jetty-jndi/8.1.14.v20131031/jetty-jndi-8.1.14.v20131031.jar
(40 KB at 3005.4 KB/sec)
Downloading: http://repo.maven.apache.org/maven2/org/eclipse/jetty/jetty-security/8.1.14.v20131031/jetty-security-8.1.14.v20131031.jar
Downloaded: http://repo.maven.apache.org/maven2/org/eclipse/jetty/orbit/javax.activation/1.1.0.v201105071233/javax.activation-1.1.0.v201105071233.jar
(54 KB at 3543.9 KB/sec)
Downloading: http://repo.maven.apache.org/maven2/org/eclipse/jetty/jetty-util/8.1.14.v20131031/jetty-util-8.1.14.v20131031.jar
Downloaded: http://repo.maven.apache.org/maven2/org/eclipse/jetty/jetty-security/8.1.14.v20131031/jetty-security-8.1.14.v20131031.jar
(88 KB at 5854.4 KB/sec)
Downloading: http://repo.maven.apache.org/maven2/org/eclipse/jetty/jetty-server/8.1.14.v20131031/jetty-server-8.1.14.v20131031.jar
Downloaded: http://repo.maven.apache.org/maven2/org/eclipse/jetty/jetty-util/8.1.14.v20131031/jetty-util-8.1.14.v20131031.jar
(281 KB at 15607.6 KB/sec)
Downloading: http://repo.maven.apache.org/maven2/org/eclipse/jetty/orbit/javax.servlet/3.0.0.v201112011016/javax.servlet-3.0.0.v201112011016.jar
Downloaded: http://repo.maven.apache.org/maven2/com/twitter/parquet-common/1.5.0/parquet-common-1.5.0.jar
(12 KB at 69.6 KB/sec)
Downloading: http://repo.maven.apache.org/maven2/org/eclipse/jetty/jetty-continuation/8.1.14.v20131031/jetty-continuation-8.1.14.v20131031.jar
Downloaded: http://repo.maven.apache.org/maven2/org/eclipse/jetty/orbit/javax.mail.glassfish/1.4.1.v201005082020/javax.mail.glassfish-1.4.1.v201005082020.jar
(480 KB at 11412.1 KB/sec)
Downloading: http://repo.maven.apache.org/maven2/org/eclipse/jetty/jetty-http/8.1.14.v20131031/jetty-http-8.1.14.v20131031.jar
Downloaded: http://repo.maven.apache.org/maven2/org/apache/hadoop/hadoop-mapreduce-client-jobclient/2.5.0/hadoop-mapreduce-client-jobclient-2.5.0.jar
(35 KB at 405.8 KB/sec)
Downloading: http://repo.maven.apache.org/maven2/org/eclipse/jetty/jetty-io/8.1.14.v20131031/jetty-io-8.1.14.v20131031.jar
Downloaded: http://repo.maven.apache.org/maven2/org/eclipse/jetty/orbit/javax.servlet/3.0.0.v201112011016/javax.servlet-3.0.0.v201112011016.jar
(196 KB at 13046.0 KB/sec)
Downloaded: http://repo.maven.apache.org/maven2/org/eclipse/jetty/jetty-server/8.1.14.v20131031/jetty-server-8.1.14.v20131031.jar
(350 KB at 12475.7 KB/sec)
Downloading: http://repo.maven.apache.org/maven2/org/slf4j/jul-to-slf4j/1.7.5/jul-to-slf4j-1.7.5.jar
Downloading: http://repo.maven.apache.org/maven2/org/slf4j/jcl-over-slf4j/1.7.5/jcl-over-slf4j-1.7.5.jar
Downloaded: http://repo.maven.apache.org/maven2/org/eclipse/jetty/jetty-io/8.1.14.v20131031/jetty-io-8.1.14.v20131031.jar
(102 KB at 11308.5 KB/sec)
Downloading: http://repo.maven.apache.org/maven2/com/ning/compress-lzf/1.0.0/compress-lzf-1.0.0.jar
Downloaded: http://repo.maven.apache.org/maven2/org/eclipse/jetty/jetty-continuation/8.1.14.v20131031/jetty-continuation-8.1.14.v20131031.jar
(21 KB at 1476.1 KB/sec)
Downloading: http://repo.maven.apache.org/maven2/net/jpountz/lz4/lz4/1.2.0/lz4-1.2.0.jar
Downloaded: http://repo.maven.apache.org/maven2/org/eclipse/jetty/jetty-http/8.1.14.v20131031/jetty-http-8.1.14.v20131031.jar
(94 KB at 5215.0 KB/sec)
Downloading: http://repo.maven.apache.org/maven2/org/roaringbitmap/RoaringBitmap/0.4.5/RoaringBitmap-0.4.5.jar
Downloaded: http://repo.maven.apache.org/maven2/com/ning/compress-lzf/1.0.0/compress-lzf-1.0.0.jar
(76 KB at 7553.3 KB/sec)
Downloading: http://repo.maven.apache.org/maven2/commons-net/commons-net/2.2/commons-net-2.2.jar
Downloaded: http://repo.maven.apache.org/maven2/org/slf4j/jul-to-slf4j/1.7.5/jul-to-slf4j-1.7.5.jar
(5 KB at 372.6 KB/sec)
Downloading: http://repo.maven.apache.org/maven2/org/spark-project/akka/akka-remote_2.10/2.3.4-spark/akka-remote_2.10-2.3.4-spark.jar
Downloaded: http://repo.maven.apache.org/maven2/org/slf4j/jcl-over-slf4j/1.7.5/jcl-over-slf4j-1.7.5.jar
(17 KB at 1152.1 KB/sec)
Downloading: http://repo.maven.apache.org/maven2/org/spark-project/akka/akka-actor_2.10/2.3.4-spark/akka-actor_2.10-2.3.4-spark.jar
Downloaded: http://repo.maven.apache.org/maven2/net/jpountz/lz4/lz4/1.2.0/lz4-1.2.0.jar (162
KB at 8979.2 KB/sec)
Downloading: http://repo.maven.apache.org/maven2/com/typesafe/config/1.2.1/config-1.2.1.jar
Downloaded: http://repo.maven.apache.org/maven2/commons-net/commons-net/2.2/commons-net-2.2.jar
(208 KB at 12967.1 KB/sec)
Downloading: http://repo.maven.apache.org/maven2/org/spark-project/protobuf/protobuf-java/2.5.0-spark/protobuf-java-2.5.0-spark.jar
Downloaded: http://repo.maven.apache.org/maven2/org/roaringbitmap/RoaringBitmap/0.4.5/RoaringBitmap-0.4.5.jar
(107 KB at 5341.2 KB/sec)
Downloading: http://repo.maven.apache.org/maven2/org/uncommons/maths/uncommons-maths/1.2.2a/uncommons-maths-1.2.2a.jar
Downloaded: http://repo.maven.apache.org/maven2/com/typesafe/config/1.2.1/config-1.2.1.jar
(215 KB at 11284.6 KB/sec)
Downloading: http://repo.maven.apache.org/maven2/org/spark-project/akka/akka-slf4j_2.10/2.3.4-spark/akka-slf4j_2.10-2.3.4-spark.jar
Downloaded: http://repo.maven.apache.org/maven2/org/uncommons/maths/uncommons-maths/1.2.2a/uncommons-maths-1.2.2a.jar
(48 KB at 3682.3 KB/sec)
Downloading: http://repo.maven.apache.org/maven2/org/scala-lang/scala-library/2.10.4/scala-library-2.10.4.jar
Downloaded: http://repo.maven.apache.org/maven2/org/spark-project/akka/akka-slf4j_2.10/2.3.4-spark/akka-slf4j_2.10-2.3.4-spark.jar
(16 KB at 1265.1 KB/sec)
Downloading: http://repo.maven.apache.org/maven2/org/json4s/json4s-jackson_2.10/3.2.10/json4s-jackson_2.10-3.2.10.jar
Downloaded: http://repo.maven.apache.org/maven2/org/spark-project/protobuf/protobuf-java/2.5.0-spark/protobuf-java-2.5.0-spark.jar
(526 KB at 18115.4 KB/sec)
Downloading: http://repo.maven.apache.org/maven2/org/json4s/json4s-core_2.10/3.2.10/json4s-core_2.10-3.2.10.jar
Downloaded: http://repo.maven.apache.org/maven2/org/spark-project/akka/akka-remote_2.10/2.3.4-spark/akka-remote_2.10-2.3.4-spark.jar
(1322 KB at 27525.6 KB/sec)
Downloading: http://repo.maven.apache.org/maven2/org/json4s/json4s-ast_2.10/3.2.10/json4s-ast_2.10-3.2.10.jar
Downloaded: http://repo.maven.apache.org/maven2/org/json4s/json4s-jackson_2.10/3.2.10/json4s-jackson_2.10-3.2.10.jar
(40 KB at 3251.4 KB/sec)
Downloading: http://repo.maven.apache.org/maven2/org/scala-lang/scalap/2.10.0/scalap-2.10.0.jar
Downloaded: http://repo.maven.apache.org/maven2/org/json4s/json4s-ast_2.10/3.2.10/json4s-ast_2.10-3.2.10.jar
(82 KB at 5455.6 KB/sec)
Downloading: http://repo.maven.apache.org/maven2/org/scala-lang/scala-compiler/2.10.0/scala-compiler-2.10.0.jar
Downloaded: http://repo.maven.apache.org/maven2/org/spark-project/akka/akka-actor_2.10/2.3.4-spark/akka-actor_2.10-2.3.4-spark.jar
(2496 KB at 36693.4 KB/sec)
Downloading: http://repo.maven.apache.org/maven2/org/scala-lang/scala-reflect/2.10.0/scala-reflect-2.10.0.jar
Downloaded: http://repo.maven.apache.org/maven2/org/json4s/json4s-core_2.10/3.2.10/json4s-core_2.10-3.2.10.jar
(571 KB at 18418.9 KB/sec)
Downloading: http://repo.maven.apache.org/maven2/com/fasterxml/jackson/core/jackson-databind/2.3.1/jackson-databind-2.3.1.jar
Downloaded: http://repo.maven.apache.org/maven2/org/scala-lang/scalap/2.10.0/scalap-2.10.0.jar
(835 KB at 15754.2 KB/sec)
Downloading: http://repo.maven.apache.org/maven2/com/fasterxml/jackson/core/jackson-annotations/2.3.0/jackson-annotations-2.3.0.jar
Downloaded: http://repo.maven.apache.org/maven2/com/fasterxml/jackson/core/jackson-databind/2.3.1/jackson-databind-2.3.1.jar
(893 KB at 27902.6 KB/sec)
Downloading: http://repo.maven.apache.org/maven2/com/fasterxml/jackson/core/jackson-core/2.3.1/jackson-core-2.3.1.jar
Downloaded: http://repo.maven.apache.org/maven2/com/fasterxml/jackson/core/jackson-annotations/2.3.0/jackson-annotations-2.3.0.jar
(35 KB at 2282.4 KB/sec)
Downloading: http://repo.maven.apache.org/maven2/org/apache/mesos/mesos/0.18.1/mesos-0.18.1-shaded-protobuf.jar
Downloaded: http://repo.maven.apache.org/maven2/com/fasterxml/jackson/core/jackson-core/2.3.1/jackson-core-2.3.1.jar
(194 KB at 11373.3 KB/sec)
Downloading: http://repo.maven.apache.org/maven2/io/netty/netty-all/4.0.23.Final/netty-all-4.0.23.Final.jar
Downloaded: http://repo.maven.apache.org/maven2/org/scala-lang/scala-reflect/2.10.0/scala-reflect-2.10.0.jar
(3076 KB at 37969.6 KB/sec)
Downloading: http://repo.maven.apache.org/maven2/com/clearspring/analytics/stream/2.7.0/stream-2.7.0.jar
Downloaded: http://repo.maven.apache.org/maven2/com/clearspring/analytics/stream/2.7.0/stream-2.7.0.jar
(171 KB at 10015.6 KB/sec)
Downloading: http://repo.maven.apache.org/maven2/com/codahale/metrics/metrics-core/3.0.0/metrics-core-3.0.0.jar
Downloaded: http://repo.maven.apache.org/maven2/io/netty/netty-all/4.0.23.Final/netty-all-4.0.23.Final.jar
(1739 KB at 29970.2 KB/sec)
Downloading: http://repo.maven.apache.org/maven2/com/codahale/metrics/metrics-jvm/3.0.0/metrics-jvm-3.0.0.jar
Downloaded: http://repo.maven.apache.org/maven2/com/codahale/metrics/metrics-core/3.0.0/metrics-core-3.0.0.jar
(84 KB at 5206.8 KB/sec)
Downloading: http://repo.maven.apache.org/maven2/com/codahale/metrics/metrics-json/3.0.0/metrics-json-3.0.0.jar
Downloaded: http://repo.maven.apache.org/maven2/org/apache/mesos/mesos/0.18.1/mesos-0.18.1-shaded-protobuf.jar
(933 KB at 14126.5 KB/sec)
Downloading: http://repo.maven.apache.org/maven2/com/codahale/metrics/metrics-graphite/3.0.0/metrics-graphite-3.0.0.jar
Downloaded: http://repo.maven.apache.org/maven2/com/codahale/metrics/metrics-jvm/3.0.0/metrics-jvm-3.0.0.jar
(31 KB at 2318.6 KB/sec)
Downloading: http://repo.maven.apache.org/maven2/org/tachyonproject/tachyon-client/0.5.0/tachyon-client-0.5.0.jar
Downloaded: http://repo.maven.apache.org/maven2/com/codahale/metrics/metrics-json/3.0.0/metrics-json-3.0.0.jar
(16 KB at 1186.7 KB/sec)
Downloading: http://repo.maven.apache.org/maven2/org/tachyonproject/tachyon/0.5.0/tachyon-0.5.0.jar
Downloaded: http://repo.maven.apache.org/maven2/com/codahale/metrics/metrics-graphite/3.0.0/metrics-graphite-3.0.0.jar
(10 KB at 636.7 KB/sec)
Downloading: http://repo.maven.apache.org/maven2/org/spark-project/pyrolite/2.0.1/pyrolite-2.0.1.jar
Downloaded: http://repo.maven.apache.org/maven2/org/tachyonproject/tachyon-client/0.5.0/tachyon-client-0.5.0.jar
(3 KB at 187.7 KB/sec)
Downloading: http://repo.maven.apache.org/maven2/net/sf/py4j/py4j/0.8.2.1/py4j-0.8.2.1.jar
Downloaded: http://repo.maven.apache.org/maven2/net/sf/py4j/py4j/0.8.2.1/py4j-0.8.2.1.jar
(79 KB at 4386.4 KB/sec)
Downloading: http://repo.maven.apache.org/maven2/org/spark-project/spark/unused/1.0.0/unused-1.0.0.jar
Downloaded: http://repo.maven.apache.org/maven2/org/scala-lang/scala-library/2.10.4/scala-library-2.10.4.jar
(6960 KB at 34623.6 KB/sec)
Downloaded: http://repo.maven.apache.org/maven2/org/spark-project/pyrolite/2.0.1/pyrolite-2.0.1.jar
(67 KB at 1904.0 KB/sec)
Downloaded: http://repo.maven.apache.org/maven2/org/spark-project/spark/unused/1.0.0/unused-1.0.0.jar
(3 KB at 208.6 KB/sec)
Downloaded: http://repo.maven.apache.org/maven2/org/tachyonproject/tachyon/0.5.0/tachyon-0.5.0.jar
(2058 KB at 36736.1 KB/sec)
Downloaded: http://repo.maven.apache.org/maven2/org/scala-lang/scala-compiler/2.10.0/scala-compiler-2.10.0.jar
(13818 KB at 49526.2 KB/sec)
Downloading: http://ec2-50-18-79-139.us-west-1.compute.amazonaws.com/data/spark_2.10-1.2-SNAPSHOT/org/apache/calcite/calcite-core/0.9.2-incubating-SNAPSHOT/calcite-core-0.9.2-incubating-SNAPSHOT.jar
Downloading: http://ec2-50-18-79-139.us-west-1.compute.amazonaws.com/data/spark_2.10-1.2-SNAPSHOT/org/apache/spark/spark-core_2.10/1.2.0-SNAPSHOT/spark-core_2.10-1.2.0-SNAPSHOT.jar
Downloading: http://ec2-50-18-79-139.us-west-1.compute.amazonaws.com/data/spark_2.10-1.2-SNAPSHOT/org/apache/spark/spark-network-common_2.10/1.2.0-SNAPSHOT/spark-network-common_2.10-1.2.0-SNAPSHOT.jar
Downloading: http://ec2-50-18-79-139.us-west-1.compute.amazonaws.com/data/spark_2.10-1.2-SNAPSHOT/org/apache/calcite/calcite-avatica/0.9.2-incubating-SNAPSHOT/calcite-avatica-0.9.2-incubating-SNAPSHOT.jar
Downloading: http://ec2-50-18-79-139.us-west-1.compute.amazonaws.com/data/spark_2.10-1.2-SNAPSHOT/org/apache/spark/spark-network-shuffle_2.10/1.2.0-SNAPSHOT/spark-network-shuffle_2.10-1.2.0-SNAPSHOT.jar
[WARNING] Checksum validation failed, no checksums available from the repository for http://ec2-50-18-79-139.us-west-1.compute.amazonaws.com/data/spark_2.10-1.2-SNAPSHOT/org/apache/spark/spark-network-common_2.10/1.2.0-SNAPSHOT/spark-network-common_2.10-1.2.0-SNAPSHOT.jar
Downloaded: http://ec2-50-18-79-139.us-west-1.compute.amazonaws.com/data/spark_2.10-1.2-SNAPSHOT/org/apache/spark/spark-network-common_2.10/1.2.0-SNAPSHOT/spark-network-common_2.10-1.2.0-SNAPSHOT.jar
(79 KB at 4638.6 KB/sec)
[WARNING] Checksum validation failed, no checksums available from the repository for http://ec2-50-18-79-139.us-west-1.compute.amazonaws.com/data/spark_2.10-1.2-SNAPSHOT/org/apache/spark/spark-network-shuffle_2.10/1.2.0-SNAPSHOT/spark-network-shuffle_2.10-1.2.0-SNAPSHOT.jar
Downloaded: http://ec2-50-18-79-139.us-west-1.compute.amazonaws.com/data/spark_2.10-1.2-SNAPSHOT/org/apache/spark/spark-network-shuffle_2.10/1.2.0-SNAPSHOT/spark-network-shuffle_2.10-1.2.0-SNAPSHOT.jar
(57 KB at 3303.3 KB/sec)
[WARNING] Checksum validation failed, no checksums available from the repository for http://ec2-50-18-79-139.us-west-1.compute.amazonaws.com/data/spark_2.10-1.2-SNAPSHOT/org/apache/spark/spark-core_2.10/1.2.0-SNAPSHOT/spark-core_2.10-1.2.0-SNAPSHOT.jar
Downloaded: http://ec2-50-18-79-139.us-west-1.compute.amazonaws.com/data/spark_2.10-1.2-SNAPSHOT/org/apache/spark/spark-core_2.10/1.2.0-SNAPSHOT/spark-core_2.10-1.2.0-SNAPSHOT.jar
(6847 KB at 29260.3 KB/sec)
Downloading: http://repository.apache.org/snapshots/org/apache/calcite/calcite-core/0.9.2-incubating-SNAPSHOT/calcite-core-0.9.2-incubating-SNAPSHOT.jar
Downloading: http://repository.apache.org/snapshots/org/apache/calcite/calcite-avatica/0.9.2-incubating-SNAPSHOT/calcite-avatica-0.9.2-incubating-SNAPSHOT.jar
[INFO] ------------------------------------------------------------------------
[INFO] Reactor Summary:
[INFO] 
[INFO] Hive .............................................. SUCCESS [9.005s]
[INFO] Hive Shims Common ................................. SUCCESS [18.320s]
[INFO] Hive Shims 0.20 ................................... SUCCESS [7.698s]
[INFO] Hive Shims Secure Common .......................... SUCCESS [16.341s]
[INFO] Hive Shims 0.20S .................................. SUCCESS [1.661s]
[INFO] Hive Shims 0.23 ................................... SUCCESS [39.473s]
[INFO] Hive Shims Scheduler .............................. SUCCESS [0.580s]
[INFO] Hive Shims ........................................ SUCCESS [0.711s]
[INFO] Hive Common ....................................... SUCCESS [6.634s]
[INFO] Hive Serde ........................................ SUCCESS [5.776s]
[INFO] Hive Metastore .................................... SUCCESS [18.429s]
[INFO] Hive Ant Utilities ................................ SUCCESS [0.898s]
[INFO] Hive Query Language ............................... FAILURE [44.782s]
[INFO] Hive Service ...................................... SKIPPED
[INFO] Hive Accumulo Handler ............................. SKIPPED
[INFO] Hive JDBC ......................................... SKIPPED
[INFO] Hive Beeline ...................................... SKIPPED
[INFO] Hive CLI .......................................... SKIPPED
[INFO] Hive Contrib ...................................... SKIPPED
[INFO] Hive HBase Handler ................................ SKIPPED
[INFO] Hive HCatalog ..................................... SKIPPED
[INFO] Hive HCatalog Core ................................ SKIPPED
[INFO] Hive HCatalog Pig Adapter ......................... SKIPPED
[INFO] Hive HCatalog Server Extensions ................... SKIPPED
[INFO] Hive HCatalog Webhcat Java Client ................. SKIPPED
[INFO] Hive HCatalog Webhcat ............................. SKIPPED
[INFO] Hive HCatalog Streaming ........................... SKIPPED
[INFO] Hive HWI .......................................... SKIPPED
[INFO] Hive ODBC ......................................... SKIPPED
[INFO] Hive Shims Aggregator ............................. SKIPPED
[INFO] Spark Remote Client ............................... SKIPPED
[INFO] Hive TestUtils .................................... SKIPPED
[INFO] Hive Packaging .................................... SKIPPED
[INFO] ------------------------------------------------------------------------
[INFO] BUILD FAILURE
[INFO] ------------------------------------------------------------------------
[INFO] Total time: 2:52.098s
[INFO] Finished at: Mon Nov 17 00:28:28 EST 2014
[INFO] Final Memory: 72M/865M
[INFO] ------------------------------------------------------------------------
[ERROR] Failed to execute goal on project hive-exec: Could not resolve dependencies for project
org.apache.hive:hive-exec:jar:0.15.0-SNAPSHOT: The following artifacts could not be resolved:
org.apache.calcite:calcite-core:jar:0.9.2-incubating-SNAPSHOT, org.apache.calcite:calcite-avatica:jar:0.9.2-incubating-SNAPSHOT:
Could not find artifact org.apache.calcite:calcite-core:jar:0.9.2-incubating-SNAPSHOT in spark-snapshot
(http://ec2-50-18-79-139.us-west-1.compute.amazonaws.com/data/spark_2.10-1.2-SNAPSHOT/) ->
[Help 1]
[ERROR] 
[ERROR] To see the full stack trace of the errors, re-run Maven with the -e switch.
[ERROR] Re-run Maven using the -X switch to enable full debug logging.
[ERROR] 
[ERROR] For more information about the errors and possible solutions, please read the following
articles:
[ERROR] [Help 1] http://cwiki.apache.org/confluence/display/MAVEN/DependencyResolutionException
[ERROR] 
[ERROR] After correcting the problems, you can resume the build with the command
[ERROR]   mvn <goals> -rf :hive-exec
+ exit 1
'
{noformat}

This message is automatically generated.

ATTACHMENT ID: 12681839 - PreCommit-HIVE-SPARK-Build

> Update new spark progress API for local submitted job monitoring[Spark Branch]
> ------------------------------------------------------------------------------
>
>                 Key: HIVE-8852
>                 URL: https://issues.apache.org/jira/browse/HIVE-8852
>             Project: Hive
>          Issue Type: Sub-task
>          Components: Spark
>            Reporter: Chengxiang Li
>            Assignee: Rui Li
>              Labels: Spark-M3
>         Attachments: HIVE-8852.1-spark.patch, HIVE-8852.2-spark.patch, HIVE-8852.2-spark.patch,
HIVE-8852.2-spark.patch, HIVE-8852.3-spark.patch
>
>
> SPARK-2321 has enabled new Spark job progress API, we should update our current job monitoring
implementation based on it. This JIRA should only take care of spark job monitoring which
submitted through local spark context, job monitoring through remote spark context is tracked
with HIVE-8834.
> CLEAR LIBRARY CACHE



--
This message was sent by Atlassian JIRA
(v6.3.4#6332)

Mime
View raw message