hive-dev mailing list archives

Site index · List index
Message view « Date » · « Thread »
Top « Date » · « Thread »
From "Hive QA (JIRA)" <j...@apache.org>
Subject [jira] [Commented] (HIVE-8788) UT: fix partition test case
Date Tue, 25 Nov 2014 13:44:13 GMT

    [ https://issues.apache.org/jira/browse/HIVE-8788?page=com.atlassian.jira.plugin.system.issuetabpanels:comment-tabpanel&focusedCommentId=14224541#comment-14224541
] 

Hive QA commented on HIVE-8788:
-------------------------------



{color:red}Overall{color}: -1 at least one tests failed

Here are the results of testing the latest attachment:
https://issues.apache.org/jira/secure/attachment/12683518/HIVE-8788.1-spark.patch

{color:red}ERROR:{color} -1 due to 1 failed/errored test(s), 7181 tests executed
*Failed tests:*
{noformat}
org.apache.hadoop.hive.cli.TestCliDriver.testCliDriver_sample_islocalmode_hook
{noformat}

Test results: http://ec2-174-129-184-35.compute-1.amazonaws.com/jenkins/job/PreCommit-HIVE-SPARK-Build/427/testReport
Console output: http://ec2-174-129-184-35.compute-1.amazonaws.com/jenkins/job/PreCommit-HIVE-SPARK-Build/427/console
Test logs: http://ec2-50-18-27-0.us-west-1.compute.amazonaws.com/logs/PreCommit-HIVE-SPARK-Build-427/

Messages:
{noformat}
Executing org.apache.hive.ptest.execution.PrepPhase
Executing org.apache.hive.ptest.execution.ExecutionPhase
Executing org.apache.hive.ptest.execution.ReportingPhase
Tests exited with: TestsFailedException: 1 tests failed
{noformat}

This message is automatically generated.

ATTACHMENT ID: 12683518 - PreCommit-HIVE-SPARK-Build

> UT: fix partition test case
> ---------------------------
>
>                 Key: HIVE-8788
>                 URL: https://issues.apache.org/jira/browse/HIVE-8788
>             Project: Hive
>          Issue Type: Sub-task
>          Components: Tests
>    Affects Versions: spark-branch
>            Reporter: Thomas Friedrich
>            Assignee: Chinna Rao Lalam
>         Attachments: HIVE-8788-spark.patch, HIVE-8788.1-spark.patch
>
>
> The test limit_partition_metadataonly fails with 
> 2014-11-06 18:40:12,891 ERROR ql.Driver (SessionState.java:printError(829)) - FAILED:
SemanticException Number of partitions scanned (=4) on table srcpart exceeds limit (=1). This
is controlled by hive.limit.query.max.table.partition.
> org.apache.hadoop.hive.ql.parse.SemanticException: Number of partitions scanned (=4)
on table srcpart exceeds limit (=1). This is controlled by hive.limit.query.max.table.partition.
> 	at org.apache.hadoop.hive.ql.parse.SemanticAnalyzer.enforceScanLimits(SemanticAnalyzer.java:10358)
> 	at org.apache.hadoop.hive.ql.parse.SemanticAnalyzer.analyzeInternal(SemanticAnalyzer.java:10190)
> 	at org.apache.hadoop.hive.ql.parse.BaseSemanticAnalyzer.analyze(BaseSemanticAnalyzer.java:221)
> 	at org.apache.hadoop.hive.ql.Driver.compile(Driver.java:419)
> In the test, SemanticAnalyzer.enforceScanLimits expects only 1 partition ds=2008-04-08/hr=11
but gets 4 partitions:
> [srcpart(ds=2008-04-08/hr=11), srcpart(ds=2008-04-08/hr=12), srcpart(ds=2008-04-09/hr=11),
srcpart(ds=2008-04-09/hr=12)]
> In the log it shows that the ParitionPruner ran, and it should have only retained one
partition:
> 2014-11-07 14:18:09,147 DEBUG ppr.PartitionPruner (PartitionPruner.java:prune(206)) -
Filter w/ compacting: ((hr = 11) and (ds = '2008-04-08')); filter w/o compacting: ((hr = 11)
and (ds = '2008-04-08'))
> 2014-11-07 14:18:09,147 INFO  metastore.HiveMetaStore (HiveMetaStore.java:logInfo(719))
- 0: get_partitions_by_expr : db=default tbl=srcpart
> 2014-11-07 14:18:09,165 DEBUG ppr.PartitionPruner (PartitionPruner.java:prunePartitionNames(491))
- retained partition: ds=2008-04-08/hr=11



--
This message was sent by Atlassian JIRA
(v6.3.4#6332)

Mime
View raw message