hive-dev mailing list archives

Site index · List index
Message view « Date » · « Thread »
Top « Date » · « Thread »
From "Hive QA (JIRA)" <j...@apache.org>
Subject [jira] [Commented] (HIVE-8782) HBase handler doesn't compile with hadoop-1
Date Sat, 08 Nov 2014 03:05:34 GMT

    [ https://issues.apache.org/jira/browse/HIVE-8782?page=com.atlassian.jira.plugin.system.issuetabpanels:comment-tabpanel&focusedCommentId=14203177#comment-14203177
] 

Hive QA commented on HIVE-8782:
-------------------------------



{color:red}Overall{color}: -1 at least one tests failed

Here are the results of testing the latest attachment:
https://issues.apache.org/jira/secure/attachment/12680298/HIVE-8782.1.patch

{color:red}ERROR:{color} -1 due to 6 failed/errored test(s), 6672 tests executed
*Failed tests:*
{noformat}
org.apache.hadoop.hive.cli.TestCliDriver.testCliDriver_acid_join
org.apache.hadoop.hive.cli.TestCliDriver.testCliDriver_insert_nonacid_from_acid
org.apache.hadoop.hive.cli.TestMiniTezCliDriver.testCliDriver_optimize_nullscan
org.apache.hadoop.hive.cli.TestMinimrCliDriver.testCliDriver_schemeAuthority
org.apache.hive.hcatalog.streaming.TestStreaming.testEndpointConnection
org.apache.hive.hcatalog.streaming.TestStreaming.testRemainingTransactions
{noformat}

Test results: http://ec2-174-129-184-35.compute-1.amazonaws.com/jenkins/job/PreCommit-HIVE-TRUNK-Build/1695/testReport
Console output: http://ec2-174-129-184-35.compute-1.amazonaws.com/jenkins/job/PreCommit-HIVE-TRUNK-Build/1695/console
Test logs: http://ec2-174-129-184-35.compute-1.amazonaws.com/logs/PreCommit-HIVE-TRUNK-Build-1695/

Messages:
{noformat}
Executing org.apache.hive.ptest.execution.PrepPhase
Executing org.apache.hive.ptest.execution.ExecutionPhase
Executing org.apache.hive.ptest.execution.ReportingPhase
Tests exited with: TestsFailedException: 6 tests failed
{noformat}

This message is automatically generated.

ATTACHMENT ID: 12680298 - PreCommit-HIVE-TRUNK-Build

> HBase handler doesn't compile with hadoop-1
> -------------------------------------------
>
>                 Key: HIVE-8782
>                 URL: https://issues.apache.org/jira/browse/HIVE-8782
>             Project: Hive
>          Issue Type: Bug
>            Reporter: Jimmy Xiang
>            Assignee: Jimmy Xiang
>            Priority: Blocker
>         Attachments: HIVE-8782.1.patch
>
>
> {noformat}
> [ERROR] Failed to execute goal org.apache.maven.plugins:maven-compiler-plugin:3.1:compile
(default-compile) on project hive-hbase-handler: Compilation failure
> [ERROR] /home/jxiang/git-repos/apache/tmp/hive/hbase-handler/src/java/org/apache/hadoop/hive/hbase/HBaseStorageHandler.java:[482,31]
cannot find symbol
> [ERROR] symbol:   method mergeAll(org.apache.hadoop.security.Credentials)
> [ERROR] location: class org.apache.hadoop.security.Credentials
> [ERROR] -> [Help 1]
> [ERROR] 
> {noformat}



--
This message was sent by Atlassian JIRA
(v6.3.4#6332)

Mime
View raw message