hive-dev mailing list archives

Site index · List index
Message view « Date » · « Thread »
Top « Date » · « Thread »
From "Hive QA (JIRA)" <j...@apache.org>
Subject [jira] [Commented] (HIVE-8614) Upgrade hive to use tez version 0.5.2-SNAPSHOT
Date Mon, 27 Oct 2014 18:59:33 GMT

    [ https://issues.apache.org/jira/browse/HIVE-8614?page=com.atlassian.jira.plugin.system.issuetabpanels:comment-tabpanel&focusedCommentId=14185618#comment-14185618
] 

Hive QA commented on HIVE-8614:
-------------------------------



{color:red}Overall{color}: -1 no tests executed

Here are the results of testing the latest attachment:
https://issues.apache.org/jira/secure/attachment/12677363/HIVE-8614.2.patch

Test results: http://ec2-174-129-184-35.compute-1.amazonaws.com/jenkins/job/PreCommit-HIVE-TRUNK-Build/1480/testReport
Console output: http://ec2-174-129-184-35.compute-1.amazonaws.com/jenkins/job/PreCommit-HIVE-TRUNK-Build/1480/console
Test logs: http://ec2-174-129-184-35.compute-1.amazonaws.com/logs/PreCommit-HIVE-TRUNK-Build-1480/

Messages:
{noformat}
**** This message was trimmed, see log for full details ****
[INFO] 
[INFO] --- maven-compiler-plugin:3.1:testCompile (default-testCompile) @ hive-shims-0.20 ---
[INFO] No sources to compile
[INFO] 
[INFO] --- maven-surefire-plugin:2.16:test (default-test) @ hive-shims-0.20 ---
[INFO] Tests are skipped.
[INFO] 
[INFO] --- maven-jar-plugin:2.2:jar (default-jar) @ hive-shims-0.20 ---
[INFO] Building jar: /data/hive-ptest/working/apache-svn-trunk-source/shims/0.20/target/hive-shims-0.20-0.15.0-SNAPSHOT.jar
[INFO] 
[INFO] --- maven-site-plugin:3.3:attach-descriptor (attach-descriptor) @ hive-shims-0.20 ---
[INFO] 
[INFO] --- maven-install-plugin:2.4:install (default-install) @ hive-shims-0.20 ---
[INFO] Installing /data/hive-ptest/working/apache-svn-trunk-source/shims/0.20/target/hive-shims-0.20-0.15.0-SNAPSHOT.jar
to /data/hive-ptest/working/maven/org/apache/hive/shims/hive-shims-0.20/0.15.0-SNAPSHOT/hive-shims-0.20-0.15.0-SNAPSHOT.jar
[INFO] Installing /data/hive-ptest/working/apache-svn-trunk-source/shims/0.20/pom.xml to /data/hive-ptest/working/maven/org/apache/hive/shims/hive-shims-0.20/0.15.0-SNAPSHOT/hive-shims-0.20-0.15.0-SNAPSHOT.pom
[INFO]                                                                         
[INFO] ------------------------------------------------------------------------
[INFO] Building Hive Shims Secure Common 0.15.0-SNAPSHOT
[INFO] ------------------------------------------------------------------------
[INFO] 
[INFO] --- maven-clean-plugin:2.5:clean (default-clean) @ hive-shims-common-secure ---
[INFO] Deleting /data/hive-ptest/working/apache-svn-trunk-source/shims/common-secure (includes
= [datanucleus.log, derby.log], excludes = [])
[INFO] 
[INFO] --- maven-remote-resources-plugin:1.5:process (default) @ hive-shims-common-secure
---
[INFO] 
[INFO] --- maven-resources-plugin:2.6:resources (default-resources) @ hive-shims-common-secure
---
[INFO] Using 'UTF-8' encoding to copy filtered resources.
[INFO] skip non existing resourceDirectory /data/hive-ptest/working/apache-svn-trunk-source/shims/common-secure/src/main/resources
[INFO] Copying 3 resources
[INFO] 
[INFO] --- maven-antrun-plugin:1.7:run (define-classpath) @ hive-shims-common-secure ---
[INFO] Executing tasks

main:
[INFO] Executed tasks
[INFO] 
[INFO] --- maven-compiler-plugin:3.1:compile (default-compile) @ hive-shims-common-secure
---
[INFO] Compiling 12 source files to /data/hive-ptest/working/apache-svn-trunk-source/shims/common-secure/target/classes
[WARNING] /data/hive-ptest/working/apache-svn-trunk-source/shims/common-secure/src/main/java/org/apache/hadoop/hive/shims/HadoopShimsSecure.java:
/data/hive-ptest/working/apache-svn-trunk-source/shims/common-secure/src/main/java/org/apache/hadoop/hive/shims/HadoopShimsSecure.java
uses or overrides a deprecated API.
[WARNING] /data/hive-ptest/working/apache-svn-trunk-source/shims/common-secure/src/main/java/org/apache/hadoop/hive/shims/HadoopShimsSecure.java:
Recompile with -Xlint:deprecation for details.
[WARNING] /data/hive-ptest/working/apache-svn-trunk-source/shims/common-secure/src/main/java/org/apache/hadoop/hive/shims/HadoopShimsSecure.java:
Some input files use unchecked or unsafe operations.
[WARNING] /data/hive-ptest/working/apache-svn-trunk-source/shims/common-secure/src/main/java/org/apache/hadoop/hive/shims/HadoopShimsSecure.java:
Recompile with -Xlint:unchecked for details.
[INFO] 
[INFO] --- maven-resources-plugin:2.6:testResources (default-testResources) @ hive-shims-common-secure
---
[INFO] Using 'UTF-8' encoding to copy filtered resources.
[INFO] skip non existing resourceDirectory /data/hive-ptest/working/apache-svn-trunk-source/shims/common-secure/src/test/resources
[INFO] Copying 3 resources
[INFO] 
[INFO] --- maven-antrun-plugin:1.7:run (setup-test-dirs) @ hive-shims-common-secure ---
[INFO] Executing tasks

main:
    [mkdir] Created dir: /data/hive-ptest/working/apache-svn-trunk-source/shims/common-secure/target/tmp
    [mkdir] Created dir: /data/hive-ptest/working/apache-svn-trunk-source/shims/common-secure/target/warehouse
    [mkdir] Created dir: /data/hive-ptest/working/apache-svn-trunk-source/shims/common-secure/target/tmp/conf
     [copy] Copying 7 files to /data/hive-ptest/working/apache-svn-trunk-source/shims/common-secure/target/tmp/conf
[INFO] Executed tasks
[INFO] 
[INFO] --- maven-compiler-plugin:3.1:testCompile (default-testCompile) @ hive-shims-common-secure
---
[INFO] No sources to compile
[INFO] 
[INFO] --- maven-surefire-plugin:2.16:test (default-test) @ hive-shims-common-secure ---
[INFO] Tests are skipped.
[INFO] 
[INFO] --- maven-jar-plugin:2.2:jar (default-jar) @ hive-shims-common-secure ---
[INFO] Building jar: /data/hive-ptest/working/apache-svn-trunk-source/shims/common-secure/target/hive-shims-common-secure-0.15.0-SNAPSHOT.jar
[INFO] 
[INFO] --- maven-site-plugin:3.3:attach-descriptor (attach-descriptor) @ hive-shims-common-secure
---
[INFO] 
[INFO] --- maven-install-plugin:2.4:install (default-install) @ hive-shims-common-secure ---
[INFO] Installing /data/hive-ptest/working/apache-svn-trunk-source/shims/common-secure/target/hive-shims-common-secure-0.15.0-SNAPSHOT.jar
to /data/hive-ptest/working/maven/org/apache/hive/shims/hive-shims-common-secure/0.15.0-SNAPSHOT/hive-shims-common-secure-0.15.0-SNAPSHOT.jar
[INFO] Installing /data/hive-ptest/working/apache-svn-trunk-source/shims/common-secure/pom.xml
to /data/hive-ptest/working/maven/org/apache/hive/shims/hive-shims-common-secure/0.15.0-SNAPSHOT/hive-shims-common-secure-0.15.0-SNAPSHOT.pom
[INFO]                                                                         
[INFO] ------------------------------------------------------------------------
[INFO] Building Hive Shims 0.20S 0.15.0-SNAPSHOT
[INFO] ------------------------------------------------------------------------
[INFO] 
[INFO] --- maven-clean-plugin:2.5:clean (default-clean) @ hive-shims-0.20S ---
[INFO] Deleting /data/hive-ptest/working/apache-svn-trunk-source/shims/0.20S (includes = [datanucleus.log,
derby.log], excludes = [])
[INFO] 
[INFO] --- maven-remote-resources-plugin:1.5:process (default) @ hive-shims-0.20S ---
[INFO] 
[INFO] --- maven-resources-plugin:2.6:resources (default-resources) @ hive-shims-0.20S ---
[INFO] Using 'UTF-8' encoding to copy filtered resources.
[INFO] skip non existing resourceDirectory /data/hive-ptest/working/apache-svn-trunk-source/shims/0.20S/src/main/resources
[INFO] Copying 3 resources
[INFO] 
[INFO] --- maven-antrun-plugin:1.7:run (define-classpath) @ hive-shims-0.20S ---
[INFO] Executing tasks

main:
[INFO] Executed tasks
[INFO] 
[INFO] --- maven-compiler-plugin:3.1:compile (default-compile) @ hive-shims-0.20S ---
[INFO] Compiling 3 source files to /data/hive-ptest/working/apache-svn-trunk-source/shims/0.20S/target/classes
[WARNING] /data/hive-ptest/working/apache-svn-trunk-source/shims/0.20S/src/main/java/org/apache/hadoop/hive/shims/Hadoop20SShims.java:
/data/hive-ptest/working/apache-svn-trunk-source/shims/0.20S/src/main/java/org/apache/hadoop/hive/shims/Hadoop20SShims.java
uses or overrides a deprecated API.
[WARNING] /data/hive-ptest/working/apache-svn-trunk-source/shims/0.20S/src/main/java/org/apache/hadoop/hive/shims/Hadoop20SShims.java:
Recompile with -Xlint:deprecation for details.
[INFO] 
[INFO] --- maven-resources-plugin:2.6:testResources (default-testResources) @ hive-shims-0.20S
---
[INFO] Using 'UTF-8' encoding to copy filtered resources.
[INFO] skip non existing resourceDirectory /data/hive-ptest/working/apache-svn-trunk-source/shims/0.20S/src/test/resources
[INFO] Copying 3 resources
[INFO] 
[INFO] --- maven-antrun-plugin:1.7:run (setup-test-dirs) @ hive-shims-0.20S ---
[INFO] Executing tasks

main:
    [mkdir] Created dir: /data/hive-ptest/working/apache-svn-trunk-source/shims/0.20S/target/tmp
    [mkdir] Created dir: /data/hive-ptest/working/apache-svn-trunk-source/shims/0.20S/target/warehouse
    [mkdir] Created dir: /data/hive-ptest/working/apache-svn-trunk-source/shims/0.20S/target/tmp/conf
     [copy] Copying 7 files to /data/hive-ptest/working/apache-svn-trunk-source/shims/0.20S/target/tmp/conf
[INFO] Executed tasks
[INFO] 
[INFO] --- maven-compiler-plugin:3.1:testCompile (default-testCompile) @ hive-shims-0.20S
---
[INFO] No sources to compile
[INFO] 
[INFO] --- maven-surefire-plugin:2.16:test (default-test) @ hive-shims-0.20S ---
[INFO] Tests are skipped.
[INFO] 
[INFO] --- maven-jar-plugin:2.2:jar (default-jar) @ hive-shims-0.20S ---
[INFO] Building jar: /data/hive-ptest/working/apache-svn-trunk-source/shims/0.20S/target/hive-shims-0.20S-0.15.0-SNAPSHOT.jar
[INFO] 
[INFO] --- maven-site-plugin:3.3:attach-descriptor (attach-descriptor) @ hive-shims-0.20S
---
[INFO] 
[INFO] --- maven-install-plugin:2.4:install (default-install) @ hive-shims-0.20S ---
[INFO] Installing /data/hive-ptest/working/apache-svn-trunk-source/shims/0.20S/target/hive-shims-0.20S-0.15.0-SNAPSHOT.jar
to /data/hive-ptest/working/maven/org/apache/hive/shims/hive-shims-0.20S/0.15.0-SNAPSHOT/hive-shims-0.20S-0.15.0-SNAPSHOT.jar
[INFO] Installing /data/hive-ptest/working/apache-svn-trunk-source/shims/0.20S/pom.xml to
/data/hive-ptest/working/maven/org/apache/hive/shims/hive-shims-0.20S/0.15.0-SNAPSHOT/hive-shims-0.20S-0.15.0-SNAPSHOT.pom
[INFO]                                                                         
[INFO] ------------------------------------------------------------------------
[INFO] Building Hive Shims 0.23 0.15.0-SNAPSHOT
[INFO] ------------------------------------------------------------------------
Downloading: http://repository.apache.org/snapshots/org/apache/tez/tez-api/0.5.2-SNAPSHOT/maven-metadata.xml
[WARNING] Could not transfer metadata org.apache.tez:tez-api:0.5.2-SNAPSHOT/maven-metadata.xml
from/to apache.snapshots (http://repository.apache.org/snapshots): Failed to transfer file:
http://repository.apache.org/snapshots/org/apache/tez/tez-api/0.5.2-SNAPSHOT/maven-metadata.xml.
Return code is: 503 , ReasonPhrase:Service Temporarily Unavailable.
[WARNING] Failure to transfer org.apache.tez:tez-api:0.5.2-SNAPSHOT/maven-metadata.xml from
http://repository.apache.org/snapshots was cached in the local repository, resolution will
not be reattempted until the update interval of apache.snapshots has elapsed or updates are
forced. Original error: Could not transfer metadata org.apache.tez:tez-api:0.5.2-SNAPSHOT/maven-metadata.xml
from/to apache.snapshots (http://repository.apache.org/snapshots): Failed to transfer file:
http://repository.apache.org/snapshots/org/apache/tez/tez-api/0.5.2-SNAPSHOT/maven-metadata.xml.
Return code is: 503 , ReasonPhrase:Service Temporarily Unavailable.
Downloading: http://repository.apache.org/snapshots/org/apache/tez/tez-api/0.5.2-SNAPSHOT/tez-api-0.5.2-SNAPSHOT.pom
Downloading: http://repository.apache.org/snapshots/org/apache/tez/tez-runtime-library/0.5.2-SNAPSHOT/maven-metadata.xml
[WARNING] Could not transfer metadata org.apache.tez:tez-runtime-library:0.5.2-SNAPSHOT/maven-metadata.xml
from/to apache.snapshots (http://repository.apache.org/snapshots): Failed to transfer file:
http://repository.apache.org/snapshots/org/apache/tez/tez-runtime-library/0.5.2-SNAPSHOT/maven-metadata.xml.
Return code is: 503 , ReasonPhrase:Service Temporarily Unavailable.
[WARNING] Failure to transfer org.apache.tez:tez-runtime-library:0.5.2-SNAPSHOT/maven-metadata.xml
from http://repository.apache.org/snapshots was cached in the local repository, resolution
will not be reattempted until the update interval of apache.snapshots has elapsed or updates
are forced. Original error: Could not transfer metadata org.apache.tez:tez-runtime-library:0.5.2-SNAPSHOT/maven-metadata.xml
from/to apache.snapshots (http://repository.apache.org/snapshots): Failed to transfer file:
http://repository.apache.org/snapshots/org/apache/tez/tez-runtime-library/0.5.2-SNAPSHOT/maven-metadata.xml.
Return code is: 503 , ReasonPhrase:Service Temporarily Unavailable.
Downloading: http://repository.apache.org/snapshots/org/apache/tez/tez-runtime-library/0.5.2-SNAPSHOT/tez-runtime-library-0.5.2-SNAPSHOT.pom
Downloading: http://repository.apache.org/snapshots/org/apache/tez/tez-mapreduce/0.5.2-SNAPSHOT/maven-metadata.xml
[WARNING] Could not transfer metadata org.apache.tez:tez-mapreduce:0.5.2-SNAPSHOT/maven-metadata.xml
from/to apache.snapshots (http://repository.apache.org/snapshots): Failed to transfer file:
http://repository.apache.org/snapshots/org/apache/tez/tez-mapreduce/0.5.2-SNAPSHOT/maven-metadata.xml.
Return code is: 503 , ReasonPhrase:Service Temporarily Unavailable.
[WARNING] Failure to transfer org.apache.tez:tez-mapreduce:0.5.2-SNAPSHOT/maven-metadata.xml
from http://repository.apache.org/snapshots was cached in the local repository, resolution
will not be reattempted until the update interval of apache.snapshots has elapsed or updates
are forced. Original error: Could not transfer metadata org.apache.tez:tez-mapreduce:0.5.2-SNAPSHOT/maven-metadata.xml
from/to apache.snapshots (http://repository.apache.org/snapshots): Failed to transfer file:
http://repository.apache.org/snapshots/org/apache/tez/tez-mapreduce/0.5.2-SNAPSHOT/maven-metadata.xml.
Return code is: 503 , ReasonPhrase:Service Temporarily Unavailable.
Downloading: http://repository.apache.org/snapshots/org/apache/tez/tez-mapreduce/0.5.2-SNAPSHOT/tez-mapreduce-0.5.2-SNAPSHOT.pom
Downloading: http://repository.apache.org/snapshots/org/apache/tez/tez-tests/0.5.2-SNAPSHOT/maven-metadata.xml
[WARNING] Could not transfer metadata org.apache.tez:tez-tests:0.5.2-SNAPSHOT/maven-metadata.xml
from/to apache.snapshots (http://repository.apache.org/snapshots): Failed to transfer file:
http://repository.apache.org/snapshots/org/apache/tez/tez-tests/0.5.2-SNAPSHOT/maven-metadata.xml.
Return code is: 503 , ReasonPhrase:Service Temporarily Unavailable.
[WARNING] Failure to transfer org.apache.tez:tez-tests:0.5.2-SNAPSHOT/maven-metadata.xml from
http://repository.apache.org/snapshots was cached in the local repository, resolution will
not be reattempted until the update interval of apache.snapshots has elapsed or updates are
forced. Original error: Could not transfer metadata org.apache.tez:tez-tests:0.5.2-SNAPSHOT/maven-metadata.xml
from/to apache.snapshots (http://repository.apache.org/snapshots): Failed to transfer file:
http://repository.apache.org/snapshots/org/apache/tez/tez-tests/0.5.2-SNAPSHOT/maven-metadata.xml.
Return code is: 503 , ReasonPhrase:Service Temporarily Unavailable.
Downloading: http://repository.apache.org/snapshots/org/apache/tez/tez-tests/0.5.2-SNAPSHOT/tez-tests-0.5.2-SNAPSHOT.pom
[INFO] ------------------------------------------------------------------------
[INFO] Reactor Summary:
[INFO] 
[INFO] Hive .............................................. SUCCESS [12.293s]
[INFO] Hive Shims Common ................................. SUCCESS [6.667s]
[INFO] Hive Shims 0.20 ................................... SUCCESS [3.860s]
[INFO] Hive Shims Secure Common .......................... SUCCESS [5.007s]
[INFO] Hive Shims 0.20S .................................. SUCCESS [2.431s]
[INFO] Hive Shims 0.23 ................................... FAILURE [8:04.301s]
[INFO] Hive Shims ........................................ SKIPPED
[INFO] Hive Common ....................................... SKIPPED
[INFO] Hive Serde ........................................ SKIPPED
[INFO] Hive Metastore .................................... SKIPPED
[INFO] Hive Ant Utilities ................................ SKIPPED
[INFO] Hive Query Language ............................... SKIPPED
[INFO] Hive Service ...................................... SKIPPED
[INFO] Hive Accumulo Handler ............................. SKIPPED
[INFO] Hive JDBC ......................................... SKIPPED
[INFO] Hive Beeline ...................................... SKIPPED
[INFO] Hive CLI .......................................... SKIPPED
[INFO] Hive Contrib ...................................... SKIPPED
[INFO] Hive HBase Handler ................................ SKIPPED
[INFO] Hive HCatalog ..................................... SKIPPED
[INFO] Hive HCatalog Core ................................ SKIPPED
[INFO] Hive HCatalog Pig Adapter ......................... SKIPPED
[INFO] Hive HCatalog Server Extensions ................... SKIPPED
[INFO] Hive HCatalog Webhcat Java Client ................. SKIPPED
[INFO] Hive HCatalog Webhcat ............................. SKIPPED
[INFO] Hive HCatalog Streaming ........................... SKIPPED
[INFO] Hive HWI .......................................... SKIPPED
[INFO] Hive ODBC ......................................... SKIPPED
[INFO] Hive Shims Aggregator ............................. SKIPPED
[INFO] Hive TestUtils .................................... SKIPPED
[INFO] Hive Packaging .................................... SKIPPED
[INFO] ------------------------------------------------------------------------
[INFO] BUILD FAILURE
[INFO] ------------------------------------------------------------------------
[INFO] Total time: 8:37.220s
[INFO] Finished at: Mon Oct 27 14:58:36 EDT 2014
[INFO] Final Memory: 34M/83M
[INFO] ------------------------------------------------------------------------
[ERROR] Failed to execute goal on project hive-shims-0.23: Could not resolve dependencies
for project org.apache.hive.shims:hive-shims-0.23:jar:0.15.0-SNAPSHOT: Failed to collect dependencies
for [org.apache.hive.shims:hive-shims-common-secure:jar:0.15.0-SNAPSHOT (compile), commons-lang:commons-lang:jar:2.6
(compile), commons-logging:commons-logging:jar:1.1.3 (compile), org.apache.hadoop:hadoop-common:jar:2.5.0
(compile?), org.apache.hadoop:hadoop-hdfs:jar:2.5.0 (compile?), org.apache.hadoop:hadoop-hdfs:jar:tests:2.5.0
(compile?), org.apache.hadoop:hadoop-mapreduce-client-core:jar:2.5.0 (compile?), org.apache.hadoop:hadoop-mapreduce-client-jobclient:jar:tests:2.5.0
(compile?), org.apache.tez:tez-api:jar:0.5.2-SNAPSHOT (compile?), org.apache.tez:tez-runtime-library:jar:0.5.2-SNAPSHOT
(compile?), org.apache.tez:tez-mapreduce:jar:0.5.2-SNAPSHOT (compile?), org.apache.hadoop:hadoop-yarn-api:jar:2.5.0
(compile?), org.apache.hadoop:hadoop-yarn-common:jar:2.5.0 (compile?), org.apache.hadoop:hadoop-yarn-client:jar:2.5.0
(compile?), org.apache.hadoop:hadoop-yarn-server-resourcemanager:jar:2.5.0 (compile), org.apache.tez:tez-tests:jar:tests:0.5.2-SNAPSHOT
(compile?), org.apache.hadoop:hadoop-yarn-server-tests:jar:tests:2.5.0 (compile?), org.slf4j:slf4j-api:jar:1.7.5
(compile), org.slf4j:slf4j-log4j12:jar:1.7.5 (compile)]: Failed to read artifact descriptor
for org.apache.tez:tez-api:jar:0.5.2-SNAPSHOT: Could not transfer artifact org.apache.tez:tez-api:pom:0.5.2-SNAPSHOT
from/to apache.snapshots (http://repository.apache.org/snapshots): Failed to transfer file:
http://repository.apache.org/snapshots/org/apache/tez/tez-api/0.5.2-SNAPSHOT/tez-api-0.5.2-SNAPSHOT.pom.
Return code is: 503 , ReasonPhrase:Service Temporarily Unavailable. -> [Help 1]
[ERROR] 
[ERROR] To see the full stack trace of the errors, re-run Maven with the -e switch.
[ERROR] Re-run Maven using the -X switch to enable full debug logging.
[ERROR] 
[ERROR] For more information about the errors and possible solutions, please read the following
articles:
[ERROR] [Help 1] http://cwiki.apache.org/confluence/display/MAVEN/DependencyResolutionException
[ERROR] 
[ERROR] After correcting the problems, you can resume the build with the command
[ERROR]   mvn <goals> -rf :hive-shims-0.23
+ exit 1
'
{noformat}

This message is automatically generated.

ATTACHMENT ID: 12677363 - PreCommit-HIVE-TRUNK-Build

> Upgrade hive to use tez version 0.5.2-SNAPSHOT
> ----------------------------------------------
>
>                 Key: HIVE-8614
>                 URL: https://issues.apache.org/jira/browse/HIVE-8614
>             Project: Hive
>          Issue Type: Bug
>    Affects Versions: 0.14.0
>            Reporter: Vikram Dixit K
>            Assignee: Vikram Dixit K
>            Priority: Critical
>         Attachments: HIVE-8614.1.patch, HIVE-8614.2.patch
>
>




--
This message was sent by Atlassian JIRA
(v6.3.4#6332)

Mime
View raw message