hive-dev mailing list archives

Site index · List index
Message view « Date » · « Thread »
Top « Date » · « Thread »
From "Hive QA (JIRA)" <j...@apache.org>
Subject [jira] [Commented] (HIVE-8537) Update to use the stable TaskContext API [Spark Branch]
Date Tue, 21 Oct 2014 10:14:34 GMT

    [ https://issues.apache.org/jira/browse/HIVE-8537?page=com.atlassian.jira.plugin.system.issuetabpanels:comment-tabpanel&focusedCommentId=14178228#comment-14178228
] 

Hive QA commented on HIVE-8537:
-------------------------------



{color:red}Overall{color}: -1 no tests executed

Here are the results of testing the latest attachment:
https://issues.apache.org/jira/secure/attachment/12676066/HIVE-8537.2-spark.patch

Test results: http://ec2-174-129-184-35.compute-1.amazonaws.com/jenkins/job/PreCommit-HIVE-SPARK-Build/243/testReport
Console output: http://ec2-174-129-184-35.compute-1.amazonaws.com/jenkins/job/PreCommit-HIVE-SPARK-Build/243/console
Test logs: http://ec2-174-129-184-35.compute-1.amazonaws.com/logs/PreCommit-HIVE-SPARK-Build-243/

Messages:
{noformat}
**** This message was trimmed, see log for full details ****
warning(200): IdentifiersParser.g:68:4: 
Decision can match input such as "LPAREN KW_CASE KW_IF" using multiple alternatives: 1, 2

As a result, alternative(s) 2 were disabled for that input
warning(200): IdentifiersParser.g:68:4: 
Decision can match input such as "LPAREN LPAREN KW_IF" using multiple alternatives: 1, 2

As a result, alternative(s) 2 were disabled for that input
warning(200): IdentifiersParser.g:115:5: 
Decision can match input such as "KW_CLUSTER KW_BY LPAREN" using multiple alternatives: 1,
2

As a result, alternative(s) 2 were disabled for that input
warning(200): IdentifiersParser.g:127:5: 
Decision can match input such as "KW_PARTITION KW_BY LPAREN" using multiple alternatives:
1, 2

As a result, alternative(s) 2 were disabled for that input
warning(200): IdentifiersParser.g:138:5: 
Decision can match input such as "KW_DISTRIBUTE KW_BY LPAREN" using multiple alternatives:
1, 2

As a result, alternative(s) 2 were disabled for that input
warning(200): IdentifiersParser.g:149:5: 
Decision can match input such as "KW_SORT KW_BY LPAREN" using multiple alternatives: 1, 2

As a result, alternative(s) 2 were disabled for that input
warning(200): IdentifiersParser.g:166:7: 
Decision can match input such as "STAR" using multiple alternatives: 1, 2

As a result, alternative(s) 2 were disabled for that input
warning(200): IdentifiersParser.g:179:5: 
Decision can match input such as "KW_STRUCT" using multiple alternatives: 4, 6

As a result, alternative(s) 6 were disabled for that input
warning(200): IdentifiersParser.g:179:5: 
Decision can match input such as "KW_ARRAY" using multiple alternatives: 2, 6

As a result, alternative(s) 6 were disabled for that input
warning(200): IdentifiersParser.g:179:5: 
Decision can match input such as "KW_UNIONTYPE" using multiple alternatives: 5, 6

As a result, alternative(s) 6 were disabled for that input
warning(200): IdentifiersParser.g:261:5: 
Decision can match input such as "KW_TRUE" using multiple alternatives: 3, 8

As a result, alternative(s) 8 were disabled for that input
warning(200): IdentifiersParser.g:261:5: 
Decision can match input such as "KW_NULL" using multiple alternatives: 1, 8

As a result, alternative(s) 8 were disabled for that input
warning(200): IdentifiersParser.g:261:5: 
Decision can match input such as "KW_FALSE" using multiple alternatives: 3, 8

As a result, alternative(s) 8 were disabled for that input
warning(200): IdentifiersParser.g:261:5: 
Decision can match input such as "KW_DATE StringLiteral" using multiple alternatives: 2, 3

As a result, alternative(s) 3 were disabled for that input
warning(200): IdentifiersParser.g:393:5: 
Decision can match input such as "KW_BETWEEN KW_MAP LPAREN" using multiple alternatives: 8,
9

As a result, alternative(s) 9 were disabled for that input
warning(200): IdentifiersParser.g:393:5: 
Decision can match input such as "{KW_LIKE, KW_REGEXP, KW_RLIKE} KW_INSERT KW_INTO" using
multiple alternatives: 2, 9

As a result, alternative(s) 9 were disabled for that input
warning(200): IdentifiersParser.g:393:5: 
Decision can match input such as "{KW_LIKE, KW_REGEXP, KW_RLIKE} KW_UNION KW_ALL" using multiple
alternatives: 2, 9

As a result, alternative(s) 9 were disabled for that input
warning(200): IdentifiersParser.g:393:5: 
Decision can match input such as "{KW_LIKE, KW_REGEXP, KW_RLIKE} KW_SORT KW_BY" using multiple
alternatives: 2, 9

As a result, alternative(s) 9 were disabled for that input
warning(200): IdentifiersParser.g:393:5: 
Decision can match input such as "{KW_LIKE, KW_REGEXP, KW_RLIKE} KW_CLUSTER KW_BY" using multiple
alternatives: 2, 9

As a result, alternative(s) 9 were disabled for that input
warning(200): IdentifiersParser.g:393:5: 
Decision can match input such as "{KW_LIKE, KW_REGEXP, KW_RLIKE} KW_LATERAL KW_VIEW" using
multiple alternatives: 2, 9

As a result, alternative(s) 9 were disabled for that input
warning(200): IdentifiersParser.g:393:5: 
Decision can match input such as "{KW_LIKE, KW_REGEXP, KW_RLIKE} KW_MAP LPAREN" using multiple
alternatives: 2, 9

As a result, alternative(s) 9 were disabled for that input
warning(200): IdentifiersParser.g:393:5: 
Decision can match input such as "{KW_LIKE, KW_REGEXP, KW_RLIKE} KW_DISTRIBUTE KW_BY" using
multiple alternatives: 2, 9

As a result, alternative(s) 9 were disabled for that input
warning(200): IdentifiersParser.g:393:5: 
Decision can match input such as "{KW_LIKE, KW_REGEXP, KW_RLIKE} KW_ORDER KW_BY" using multiple
alternatives: 2, 9

As a result, alternative(s) 9 were disabled for that input
warning(200): IdentifiersParser.g:393:5: 
Decision can match input such as "{KW_LIKE, KW_REGEXP, KW_RLIKE} KW_GROUP KW_BY" using multiple
alternatives: 2, 9

As a result, alternative(s) 9 were disabled for that input
warning(200): IdentifiersParser.g:393:5: 
Decision can match input such as "{KW_LIKE, KW_REGEXP, KW_RLIKE} KW_INSERT KW_OVERWRITE" using
multiple alternatives: 2, 9

As a result, alternative(s) 9 were disabled for that input
warning(200): IdentifiersParser.g:518:5: 
Decision can match input such as "{AMPERSAND..BITWISEXOR, DIV..DIVIDE, EQUAL..EQUAL_NS, GREATERTHAN..GREATERTHANOREQUALTO,
KW_AND, KW_ARRAY, KW_BETWEEN..KW_BOOLEAN, KW_CASE, KW_DOUBLE, KW_FLOAT, KW_IF, KW_IN, KW_INT,
KW_LIKE, KW_MAP, KW_NOT, KW_OR, KW_REGEXP, KW_RLIKE, KW_SMALLINT, KW_STRING..KW_STRUCT, KW_TINYINT,
KW_UNIONTYPE, KW_WHEN, LESSTHAN..LESSTHANOREQUALTO, MINUS..NOTEQUAL, PLUS, STAR, TILDE}" using
multiple alternatives: 1, 3

As a result, alternative(s) 3 were disabled for that input
[INFO] 
[INFO] --- maven-remote-resources-plugin:1.5:process (default) @ hive-exec ---
[INFO] 
[INFO] --- maven-resources-plugin:2.6:resources (default-resources) @ hive-exec ---
[INFO] Using 'UTF-8' encoding to copy filtered resources.
[INFO] Copying 2 resources
[INFO] Copying 3 resources
[INFO] 
[INFO] --- maven-antrun-plugin:1.7:run (define-classpath) @ hive-exec ---
[INFO] Executing tasks

main:
[INFO] Executed tasks
[INFO] 
[INFO] --- maven-compiler-plugin:3.1:compile (default-compile) @ hive-exec ---
[INFO] Compiling 1966 source files to /data/hive-ptest/working/apache-svn-spark-source/ql/target/classes
[INFO] -------------------------------------------------------------
[WARNING] COMPILATION WARNING : 
[INFO] -------------------------------------------------------------
[WARNING] /data/hive-ptest/working/apache-svn-spark-source/ql/src/java/org/apache/hadoop/hive/ql/exec/ReduceSinkOperator.java:
Some input files use or override a deprecated API.
[WARNING] /data/hive-ptest/working/apache-svn-spark-source/ql/src/java/org/apache/hadoop/hive/ql/exec/ReduceSinkOperator.java:
Recompile with -Xlint:deprecation for details.
[WARNING] /data/hive-ptest/working/apache-svn-spark-source/ql/src/java/org/apache/hadoop/hive/ql/exec/Operator.java:
Some input files use unchecked or unsafe operations.
[WARNING] /data/hive-ptest/working/apache-svn-spark-source/ql/src/java/org/apache/hadoop/hive/ql/exec/Operator.java:
Recompile with -Xlint:unchecked for details.
[INFO] 4 warnings 
[INFO] -------------------------------------------------------------
[INFO] -------------------------------------------------------------
[ERROR] COMPILATION ERROR : 
[INFO] -------------------------------------------------------------
[ERROR] /data/hive-ptest/working/apache-svn-spark-source/ql/src/java/org/apache/hadoop/hive/ql/exec/spark/SparkClient.java:[42,33]
cannot find symbol
  symbol:   class JavaFutureAction
  location: package org.apache.spark.api.java
[ERROR] /data/hive-ptest/working/apache-svn-spark-source/ql/src/java/org/apache/hadoop/hive/ql/exec/spark/SparkClient.java:[183,7]
cannot find symbol
  symbol:   class JavaFutureAction
  location: class org.apache.hadoop.hive.ql.exec.spark.SparkClient
[INFO] 2 errors 
[INFO] -------------------------------------------------------------
[INFO] ------------------------------------------------------------------------
[INFO] Reactor Summary:
[INFO] 
[INFO] Hive .............................................. SUCCESS [2.751s]
[INFO] Hive Shims Common ................................. SUCCESS [2.345s]
[INFO] Hive Shims 0.20 ................................... SUCCESS [0.887s]
[INFO] Hive Shims Secure Common .......................... SUCCESS [1.510s]
[INFO] Hive Shims 0.20S .................................. SUCCESS [0.697s]
[INFO] Hive Shims 0.23 ................................... SUCCESS [1.991s]
[INFO] Hive Shims ........................................ SUCCESS [0.306s]
[INFO] Hive Common ....................................... SUCCESS [3.341s]
[INFO] Hive Serde ........................................ SUCCESS [4.142s]
[INFO] Hive Metastore .................................... SUCCESS [11.378s]
[INFO] Hive Ant Utilities ................................ SUCCESS [0.538s]
[INFO] Hive Query Language ............................... FAILURE [17.336s]
[INFO] Hive Service ...................................... SKIPPED
[INFO] Hive Accumulo Handler ............................. SKIPPED
[INFO] Hive JDBC ......................................... SKIPPED
[INFO] Hive Beeline ...................................... SKIPPED
[INFO] Hive CLI .......................................... SKIPPED
[INFO] Hive Contrib ...................................... SKIPPED
[INFO] Hive HBase Handler ................................ SKIPPED
[INFO] Hive HCatalog ..................................... SKIPPED
[INFO] Hive HCatalog Core ................................ SKIPPED
[INFO] Hive HCatalog Pig Adapter ......................... SKIPPED
[INFO] Hive HCatalog Server Extensions ................... SKIPPED
[INFO] Hive HCatalog Webhcat Java Client ................. SKIPPED
[INFO] Hive HCatalog Webhcat ............................. SKIPPED
[INFO] Hive HCatalog Streaming ........................... SKIPPED
[INFO] Hive HWI .......................................... SKIPPED
[INFO] Hive ODBC ......................................... SKIPPED
[INFO] Hive Shims Aggregator ............................. SKIPPED
[INFO] Hive TestUtils .................................... SKIPPED
[INFO] Hive Packaging .................................... SKIPPED
[INFO] ------------------------------------------------------------------------
[INFO] BUILD FAILURE
[INFO] ------------------------------------------------------------------------
[INFO] Total time: 48.131s
[INFO] Finished at: Tue Oct 21 06:15:08 EDT 2014
[INFO] Final Memory: 84M/937M
[INFO] ------------------------------------------------------------------------
[ERROR] Failed to execute goal org.apache.maven.plugins:maven-compiler-plugin:3.1:compile
(default-compile) on project hive-exec: Compilation failure: Compilation failure:
[ERROR] /data/hive-ptest/working/apache-svn-spark-source/ql/src/java/org/apache/hadoop/hive/ql/exec/spark/SparkClient.java:[42,33]
cannot find symbol
[ERROR] symbol:   class JavaFutureAction
[ERROR] location: package org.apache.spark.api.java
[ERROR] /data/hive-ptest/working/apache-svn-spark-source/ql/src/java/org/apache/hadoop/hive/ql/exec/spark/SparkClient.java:[183,7]
cannot find symbol
[ERROR] symbol:   class JavaFutureAction
[ERROR] location: class org.apache.hadoop.hive.ql.exec.spark.SparkClient
[ERROR] -> [Help 1]
[ERROR] 
[ERROR] To see the full stack trace of the errors, re-run Maven with the -e switch.
[ERROR] Re-run Maven using the -X switch to enable full debug logging.
[ERROR] 
[ERROR] For more information about the errors and possible solutions, please read the following
articles:
[ERROR] [Help 1] http://cwiki.apache.org/confluence/display/MAVEN/MojoFailureException
[ERROR] 
[ERROR] After correcting the problems, you can resume the build with the command
[ERROR]   mvn <goals> -rf :hive-exec
+ exit 1
'
{noformat}

This message is automatically generated.

ATTACHMENT ID: 12676066 - PreCommit-HIVE-SPARK-Build

> Update to use the stable TaskContext API [Spark Branch]
> -------------------------------------------------------
>
>                 Key: HIVE-8537
>                 URL: https://issues.apache.org/jira/browse/HIVE-8537
>             Project: Hive
>          Issue Type: Task
>          Components: Spark
>            Reporter: Rui Li
>            Assignee: Chengxiang Li
>         Attachments: HIVE-8537-spark.patch, HIVE-8537.2-spark.patch
>
>
> TaskContext API is stabilized in SPARK-3874. We have to update hive side code, e.g. {{HivePairFlatMapFunction.setupMRLegacyConfigs}}.



--
This message was sent by Atlassian JIRA
(v6.3.4#6332)

Mime
View raw message