hive-dev mailing list archives

Site index · List index
Message view « Date » · « Thread »
Top « Date » · « Thread »
From "Hive QA (JIRA)" <j...@apache.org>
Subject [jira] [Commented] (HIVE-8353) Merge trunk into spark 10/4/2015
Date Sun, 05 Oct 2014 06:34:34 GMT

    [ https://issues.apache.org/jira/browse/HIVE-8353?page=com.atlassian.jira.plugin.system.issuetabpanels:comment-tabpanel&focusedCommentId=14159456#comment-14159456
] 

Hive QA commented on HIVE-8353:
-------------------------------



{color:red}Overall{color}: -1 no tests executed

Here are the results of testing the latest attachment:
https://issues.apache.org/jira/secure/attachment/12672981/HIVE-8353.1-spark.patch

Test results: http://ec2-174-129-184-35.compute-1.amazonaws.com/jenkins/job/PreCommit-HIVE-SPARK-Build/191/testReport
Console output: http://ec2-174-129-184-35.compute-1.amazonaws.com/jenkins/job/PreCommit-HIVE-SPARK-Build/191/console
Test logs: http://ec2-174-129-184-35.compute-1.amazonaws.com/logs/PreCommit-HIVE-SPARK-Build-191/

Messages:
{noformat}
**** This message was trimmed, see log for full details ****
[INFO] Installing /data/hive-ptest/working/apache-svn-spark-source/common/target/hive-common-0.14.0-SNAPSHOT.jar
to /data/hive-ptest/working/maven/org/apache/hive/hive-common/0.14.0-SNAPSHOT/hive-common-0.14.0-SNAPSHOT.jar
[INFO] Installing /data/hive-ptest/working/apache-svn-spark-source/common/pom.xml to /data/hive-ptest/working/maven/org/apache/hive/hive-common/0.14.0-SNAPSHOT/hive-common-0.14.0-SNAPSHOT.pom
[INFO]                                                                         
[INFO] ------------------------------------------------------------------------
[INFO] Building Hive Serde 0.14.0-SNAPSHOT
[INFO] ------------------------------------------------------------------------
Downloading: http://www.datanucleus.org/downloads/maven2/org/apache/hadoop/hadoop-common/2.5.0/hadoop-common-2.5.0-tests.jar
Downloading: http://repo.maven.apache.org/maven2/org/apache/hadoop/hadoop-common/2.5.0/hadoop-common-2.5.0-tests.jar
Downloaded: http://repo.maven.apache.org/maven2/org/apache/hadoop/hadoop-common/2.5.0/hadoop-common-2.5.0-tests.jar
(1575 KB at 26235.1 KB/sec)
[INFO] 
[INFO] --- maven-clean-plugin:2.5:clean (default-clean) @ hive-serde ---
[INFO] Deleting /data/hive-ptest/working/apache-svn-spark-source/serde (includes = [datanucleus.log,
derby.log], excludes = [])
[INFO] 
[INFO] --- build-helper-maven-plugin:1.8:add-source (add-source) @ hive-serde ---
[INFO] Source directory: /data/hive-ptest/working/apache-svn-spark-source/serde/src/gen/protobuf/gen-java
added.
[INFO] Source directory: /data/hive-ptest/working/apache-svn-spark-source/serde/src/gen/thrift/gen-javabean
added.
[INFO] 
[INFO] --- maven-remote-resources-plugin:1.5:process (default) @ hive-serde ---
[INFO] 
[INFO] --- maven-resources-plugin:2.6:resources (default-resources) @ hive-serde ---
[INFO] Using 'UTF-8' encoding to copy filtered resources.
[INFO] skip non existing resourceDirectory /data/hive-ptest/working/apache-svn-spark-source/serde/src/main/resources
[INFO] Copying 3 resources
[INFO] 
[INFO] --- maven-antrun-plugin:1.7:run (define-classpath) @ hive-serde ---
[INFO] Executing tasks

main:
[INFO] Executed tasks
[INFO] 
[INFO] --- maven-compiler-plugin:3.1:compile (default-compile) @ hive-serde ---
[INFO] Compiling 367 source files to /data/hive-ptest/working/apache-svn-spark-source/serde/target/classes
[WARNING] /data/hive-ptest/working/apache-svn-spark-source/serde/src/java/org/apache/hadoop/hive/serde2/SerDe.java:
Some input files use or override a deprecated API.
[WARNING] /data/hive-ptest/working/apache-svn-spark-source/serde/src/java/org/apache/hadoop/hive/serde2/SerDe.java:
Recompile with -Xlint:deprecation for details.
[WARNING] /data/hive-ptest/working/apache-svn-spark-source/serde/src/java/org/apache/hadoop/hive/serde2/objectinspector/StandardUnionObjectInspector.java:
Some input files use unchecked or unsafe operations.
[WARNING] /data/hive-ptest/working/apache-svn-spark-source/serde/src/java/org/apache/hadoop/hive/serde2/objectinspector/StandardUnionObjectInspector.java:
Recompile with -Xlint:unchecked for details.
[INFO] 
[INFO] --- maven-resources-plugin:2.6:testResources (default-testResources) @ hive-serde ---
[INFO] Using 'UTF-8' encoding to copy filtered resources.
[INFO] Copying 2 resources
[INFO] Copying 3 resources
[INFO] 
[INFO] --- maven-antrun-plugin:1.7:run (setup-test-dirs) @ hive-serde ---
[INFO] Executing tasks

main:
    [mkdir] Created dir: /data/hive-ptest/working/apache-svn-spark-source/serde/target/tmp
    [mkdir] Created dir: /data/hive-ptest/working/apache-svn-spark-source/serde/target/warehouse
    [mkdir] Created dir: /data/hive-ptest/working/apache-svn-spark-source/serde/target/tmp/conf
     [copy] Copying 8 files to /data/hive-ptest/working/apache-svn-spark-source/serde/target/tmp/conf
[INFO] Executed tasks
[INFO] 
[INFO] --- maven-compiler-plugin:3.1:testCompile (default-testCompile) @ hive-serde ---
[INFO] Compiling 46 source files to /data/hive-ptest/working/apache-svn-spark-source/serde/target/test-classes
[WARNING] /data/hive-ptest/working/apache-svn-spark-source/serde/src/test/org/apache/hadoop/hive/serde2/binarysortable/TestBinarySortableSerDe.java:
Some input files use or override a deprecated API.
[WARNING] /data/hive-ptest/working/apache-svn-spark-source/serde/src/test/org/apache/hadoop/hive/serde2/binarysortable/TestBinarySortableSerDe.java:
Recompile with -Xlint:deprecation for details.
[WARNING] /data/hive-ptest/working/apache-svn-spark-source/serde/src/test/org/apache/hadoop/hive/serde2/lazy/TestLazyArrayMapStruct.java:
Some input files use unchecked or unsafe operations.
[WARNING] /data/hive-ptest/working/apache-svn-spark-source/serde/src/test/org/apache/hadoop/hive/serde2/lazy/TestLazyArrayMapStruct.java:
Recompile with -Xlint:unchecked for details.
[INFO] 
[INFO] --- maven-surefire-plugin:2.16:test (default-test) @ hive-serde ---
[INFO] Tests are skipped.
[INFO] 
[INFO] --- maven-jar-plugin:2.2:jar (default-jar) @ hive-serde ---
[INFO] Building jar: /data/hive-ptest/working/apache-svn-spark-source/serde/target/hive-serde-0.14.0-SNAPSHOT.jar
[INFO] 
[INFO] --- maven-site-plugin:3.3:attach-descriptor (attach-descriptor) @ hive-serde ---
[INFO] 
[INFO] --- maven-install-plugin:2.4:install (default-install) @ hive-serde ---
[INFO] Installing /data/hive-ptest/working/apache-svn-spark-source/serde/target/hive-serde-0.14.0-SNAPSHOT.jar
to /data/hive-ptest/working/maven/org/apache/hive/hive-serde/0.14.0-SNAPSHOT/hive-serde-0.14.0-SNAPSHOT.jar
[INFO] Installing /data/hive-ptest/working/apache-svn-spark-source/serde/pom.xml to /data/hive-ptest/working/maven/org/apache/hive/hive-serde/0.14.0-SNAPSHOT/hive-serde-0.14.0-SNAPSHOT.pom
[INFO]                                                                         
[INFO] ------------------------------------------------------------------------
[INFO] Building Hive Metastore 0.14.0-SNAPSHOT
[INFO] ------------------------------------------------------------------------
[INFO] 
[INFO] --- maven-clean-plugin:2.5:clean (default-clean) @ hive-metastore ---
[INFO] Deleting /data/hive-ptest/working/apache-svn-spark-source/metastore (includes = [datanucleus.log,
derby.log], excludes = [])
[INFO] 
[INFO] --- build-helper-maven-plugin:1.8:add-source (add-source) @ hive-metastore ---
[INFO] Source directory: /data/hive-ptest/working/apache-svn-spark-source/metastore/src/model
added.
[INFO] Source directory: /data/hive-ptest/working/apache-svn-spark-source/metastore/src/gen/thrift/gen-javabean
added.
[INFO] 
[INFO] --- antlr3-maven-plugin:3.4:antlr (default) @ hive-metastore ---
[INFO] ANTLR: Processing source directory /data/hive-ptest/working/apache-svn-spark-source/metastore/src/java
ANTLR Parser Generator  Version 3.4
org/apache/hadoop/hive/metastore/parser/Filter.g
[INFO] 
[INFO] --- maven-remote-resources-plugin:1.5:process (default) @ hive-metastore ---
[INFO] 
[INFO] --- maven-resources-plugin:2.6:resources (default-resources) @ hive-metastore ---
[INFO] Using 'UTF-8' encoding to copy filtered resources.
[INFO] Copying 1 resource
[INFO] Copying 3 resources
[INFO] 
[INFO] --- maven-antrun-plugin:1.7:run (define-classpath) @ hive-metastore ---
[INFO] Executing tasks

main:
[INFO] Executed tasks
[INFO] 
[INFO] --- maven-compiler-plugin:3.1:compile (default-compile) @ hive-metastore ---
[INFO] Compiling 214 source files to /data/hive-ptest/working/apache-svn-spark-source/metastore/target/classes
[INFO] -------------------------------------------------------------
[WARNING] COMPILATION WARNING : 
[INFO] -------------------------------------------------------------
[WARNING] /data/hive-ptest/working/apache-svn-spark-source/metastore/src/java/org/apache/hadoop/hive/metastore/HiveMetaStore.java:
Some input files use or override a deprecated API.
[WARNING] /data/hive-ptest/working/apache-svn-spark-source/metastore/src/java/org/apache/hadoop/hive/metastore/HiveMetaStore.java:
Recompile with -Xlint:deprecation for details.
[WARNING] /data/hive-ptest/working/apache-svn-spark-source/metastore/src/gen/thrift/gen-javabean/org/apache/hadoop/hive/metastore/api/OpenTxnsResponse.java:
Some input files use unchecked or unsafe operations.
[WARNING] /data/hive-ptest/working/apache-svn-spark-source/metastore/src/gen/thrift/gen-javabean/org/apache/hadoop/hive/metastore/api/OpenTxnsResponse.java:
Recompile with -Xlint:unchecked for details.
[INFO] 4 warnings 
[INFO] -------------------------------------------------------------
[INFO] -------------------------------------------------------------
[ERROR] COMPILATION ERROR : 
[INFO] -------------------------------------------------------------
[ERROR] /data/hive-ptest/working/apache-svn-spark-source/metastore/src/java/org/apache/hadoop/hive/metastore/HiveMetaStore.java:[171,47]
cannot find symbol
  symbol:   class PreReadDatabaseEvent
  location: package org.apache.hadoop.hive.metastore.events
[ERROR] /data/hive-ptest/working/apache-svn-spark-source/metastore/src/java/org/apache/hadoop/hive/metastore/HiveMetaStore.java:[172,47]
cannot find symbol
  symbol:   class PreReadTableEvent
  location: package org.apache.hadoop.hive.metastore.events
[ERROR] /data/hive-ptest/working/apache-svn-spark-source/metastore/src/java/org/apache/hadoop/hive/metastore/HiveMetaStore.java:[840,26]
cannot find symbol
  symbol:   class PreReadDatabaseEvent
  location: class org.apache.hadoop.hive.metastore.HiveMetaStore.HMSHandler
[ERROR] /data/hive-ptest/working/apache-svn-spark-source/metastore/src/java/org/apache/hadoop/hive/metastore/HiveMetaStore.java:[1651,26]
cannot find symbol
  symbol:   class PreReadTableEvent
  location: class org.apache.hadoop.hive.metastore.HiveMetaStore.HMSHandler
[ERROR] /data/hive-ptest/working/apache-svn-spark-source/metastore/src/java/org/apache/hadoop/hive/metastore/HiveMetaStore.java:[2756,26]
cannot find symbol
  symbol:   class PreReadTableEvent
  location: class org.apache.hadoop.hive.metastore.HiveMetaStore.HMSHandler
[INFO] 5 errors 
[INFO] -------------------------------------------------------------
[INFO] ------------------------------------------------------------------------
[INFO] Reactor Summary:
[INFO] 
[INFO] Hive .............................................. SUCCESS [2.474s]
[INFO] Hive Shims Common ................................. SUCCESS [2.360s]
[INFO] Hive Shims 0.20 ................................... SUCCESS [0.892s]
[INFO] Hive Shims Secure Common .......................... SUCCESS [1.269s]
[INFO] Hive Shims 0.20S .................................. SUCCESS [0.608s]
[INFO] Hive Shims 0.23 ................................... SUCCESS [15.860s]
[INFO] Hive Shims ........................................ SUCCESS [0.408s]
[INFO] Hive Common ....................................... SUCCESS [3.864s]
[INFO] Hive Serde ........................................ SUCCESS [4.860s]
[INFO] Hive Metastore .................................... FAILURE [6.462s]
[INFO] Hive Ant Utilities ................................ SKIPPED
[INFO] Hive Query Language ............................... SKIPPED
[INFO] Hive Service ...................................... SKIPPED
[INFO] Hive Accumulo Handler ............................. SKIPPED
[INFO] Hive JDBC ......................................... SKIPPED
[INFO] Hive Beeline ...................................... SKIPPED
[INFO] Hive CLI .......................................... SKIPPED
[INFO] Hive Contrib ...................................... SKIPPED
[INFO] Hive HBase Handler ................................ SKIPPED
[INFO] Hive HCatalog ..................................... SKIPPED
[INFO] Hive HCatalog Core ................................ SKIPPED
[INFO] Hive HCatalog Pig Adapter ......................... SKIPPED
[INFO] Hive HCatalog Server Extensions ................... SKIPPED
[INFO] Hive HCatalog Webhcat Java Client ................. SKIPPED
[INFO] Hive HCatalog Webhcat ............................. SKIPPED
[INFO] Hive HCatalog Streaming ........................... SKIPPED
[INFO] Hive HWI .......................................... SKIPPED
[INFO] Hive ODBC ......................................... SKIPPED
[INFO] Hive Shims Aggregator ............................. SKIPPED
[INFO] Hive TestUtils .................................... SKIPPED
[INFO] Hive Packaging .................................... SKIPPED
[INFO] ------------------------------------------------------------------------
[INFO] BUILD FAILURE
[INFO] ------------------------------------------------------------------------
[INFO] Total time: 39.979s
[INFO] Finished at: Sun Oct 05 02:34:33 EDT 2014
[INFO] Final Memory: 61M/855M
[INFO] ------------------------------------------------------------------------
[ERROR] Failed to execute goal org.apache.maven.plugins:maven-compiler-plugin:3.1:compile
(default-compile) on project hive-metastore: Compilation failure: Compilation failure:
[ERROR] /data/hive-ptest/working/apache-svn-spark-source/metastore/src/java/org/apache/hadoop/hive/metastore/HiveMetaStore.java:[171,47]
cannot find symbol
[ERROR] symbol:   class PreReadDatabaseEvent
[ERROR] location: package org.apache.hadoop.hive.metastore.events
[ERROR] /data/hive-ptest/working/apache-svn-spark-source/metastore/src/java/org/apache/hadoop/hive/metastore/HiveMetaStore.java:[172,47]
cannot find symbol
[ERROR] symbol:   class PreReadTableEvent
[ERROR] location: package org.apache.hadoop.hive.metastore.events
[ERROR] /data/hive-ptest/working/apache-svn-spark-source/metastore/src/java/org/apache/hadoop/hive/metastore/HiveMetaStore.java:[840,26]
cannot find symbol
[ERROR] symbol:   class PreReadDatabaseEvent
[ERROR] location: class org.apache.hadoop.hive.metastore.HiveMetaStore.HMSHandler
[ERROR] /data/hive-ptest/working/apache-svn-spark-source/metastore/src/java/org/apache/hadoop/hive/metastore/HiveMetaStore.java:[1651,26]
cannot find symbol
[ERROR] symbol:   class PreReadTableEvent
[ERROR] location: class org.apache.hadoop.hive.metastore.HiveMetaStore.HMSHandler
[ERROR] /data/hive-ptest/working/apache-svn-spark-source/metastore/src/java/org/apache/hadoop/hive/metastore/HiveMetaStore.java:[2756,26]
cannot find symbol
[ERROR] symbol:   class PreReadTableEvent
[ERROR] location: class org.apache.hadoop.hive.metastore.HiveMetaStore.HMSHandler
[ERROR] -> [Help 1]
[ERROR] 
[ERROR] To see the full stack trace of the errors, re-run Maven with the -e switch.
[ERROR] Re-run Maven using the -X switch to enable full debug logging.
[ERROR] 
[ERROR] For more information about the errors and possible solutions, please read the following
articles:
[ERROR] [Help 1] http://cwiki.apache.org/confluence/display/MAVEN/MojoFailureException
[ERROR] 
[ERROR] After correcting the problems, you can resume the build with the command
[ERROR]   mvn <goals> -rf :hive-metastore
+ exit 1
'
{noformat}

This message is automatically generated.

ATTACHMENT ID: 12672981

> Merge trunk into spark 10/4/2015
> --------------------------------
>
>                 Key: HIVE-8353
>                 URL: https://issues.apache.org/jira/browse/HIVE-8353
>             Project: Hive
>          Issue Type: Sub-task
>          Components: Spark
>            Reporter: Brock Noland
>            Assignee: Brock Noland
>         Attachments: HIVE-8353.1-spark.patch
>
>




--
This message was sent by Atlassian JIRA
(v6.3.4#6332)

Mime
View raw message