hive-dev mailing list archives

Site index · List index
Message view « Date » · « Thread »
Top « Date » · « Thread »
From "Hive QA (JIRA)" <j...@apache.org>
Subject [jira] [Commented] (HIVE-8095) Tez and Vectorized GROUP BY: ClassCastException: ...HiveDecimal cannot be cast to ...HiveDecimalWritable
Date Sun, 14 Sep 2014 09:00:40 GMT

    [ https://issues.apache.org/jira/browse/HIVE-8095?page=com.atlassian.jira.plugin.system.issuetabpanels:comment-tabpanel&focusedCommentId=14133138#comment-14133138
] 

Hive QA commented on HIVE-8095:
-------------------------------



{color:red}Overall{color}: -1 at least one tests failed

Here are the results of testing the latest attachment:
https://issues.apache.org/jira/secure/attachment/12668644/HIVE-8095.01.patch

{color:red}ERROR:{color} -1 due to 10 failed/errored test(s), 6275 tests executed
*Failed tests:*
{noformat}
org.apache.hadoop.hive.cli.TestCliDriver.testCliDriver_vector_decimal_aggregate
org.apache.hadoop.hive.cli.TestMiniTezCliDriver.testCliDriver_metadataonly1
org.apache.hadoop.hive.cli.TestMiniTezCliDriver.testCliDriver_optimize_nullscan
org.apache.hadoop.hive.cli.TestMiniTezCliDriver.testCliDriver_orc_merge1
org.apache.hadoop.hive.cli.TestMiniTezCliDriver.testCliDriver_orc_merge5
org.apache.hadoop.hive.cli.TestMiniTezCliDriver.testCliDriver_orc_merge6
org.apache.hadoop.hive.cli.TestMiniTezCliDriver.testCliDriver_orc_merge7
org.apache.hadoop.hive.cli.TestMiniTezCliDriver.testCliDriver_select_dummy_source
org.apache.hadoop.hive.cli.TestMiniTezCliDriver.testCliDriver_vector_decimal_aggregate
org.apache.hadoop.hive.cli.TestMinimrCliDriver.testCliDriver_schemeAuthority
{noformat}

Test results: http://ec2-174-129-184-35.compute-1.amazonaws.com/jenkins/job/PreCommit-HIVE-TRUNK-Build/788/testReport
Console output: http://ec2-174-129-184-35.compute-1.amazonaws.com/jenkins/job/PreCommit-HIVE-TRUNK-Build/788/console
Test logs: http://ec2-174-129-184-35.compute-1.amazonaws.com/logs/PreCommit-HIVE-TRUNK-Build-788/

Messages:
{noformat}
Executing org.apache.hive.ptest.execution.PrepPhase
Executing org.apache.hive.ptest.execution.ExecutionPhase
Executing org.apache.hive.ptest.execution.ReportingPhase
Tests exited with: TestsFailedException: 10 tests failed
{noformat}

This message is automatically generated.

ATTACHMENT ID: 12668644

> Tez and Vectorized GROUP BY: ClassCastException: ...HiveDecimal cannot be cast to ...HiveDecimalWritable
> --------------------------------------------------------------------------------------------------------
>
>                 Key: HIVE-8095
>                 URL: https://issues.apache.org/jira/browse/HIVE-8095
>             Project: Hive
>          Issue Type: Bug
>            Reporter: Matt McCline
>            Assignee: Matt McCline
>            Priority: Critical
>         Attachments: HIVE-8095.01.patch
>
>
> {code}
> Caused by: java.lang.ClassCastException: org.apache.hadoop.hive.common.type.HiveDecimal
cannot be cast to org.apache.hadoop.hive.serde2.io.HiveDecimalWritable
> 	at org.apache.hadoop.hive.ql.exec.vector.VectorColumnAssignFactory$17.assignObjectValue(VectorColumnAssignFactory.java:431)
> 	at org.apache.hadoop.hive.ql.exec.vector.VectorGroupByOperator.writeSingleRow(VectorGroupByOperator.java:886)
> 	at org.apache.hadoop.hive.ql.exec.vector.VectorGroupByOperator.access$400(VectorGroupByOperator.java:63)
> 	at org.apache.hadoop.hive.ql.exec.vector.VectorGroupByOperator$ProcessingModeHashAggregate.flush(VectorGroupByOperator.java:463)
> 	at org.apache.hadoop.hive.ql.exec.vector.VectorGroupByOperator$ProcessingModeHashAggregate.close(VectorGroupByOperator.java:369)
> 	at org.apache.hadoop.hive.ql.exec.vector.VectorGroupByOperator.closeOp(VectorGroupByOperator.java:924)
> 	at org.apache.hadoop.hive.ql.exec.Operator.close(Operator.java:583)
> 	at org.apache.hadoop.hive.ql.exec.Operator.close(Operator.java:595)
> 	at org.apache.hadoop.hive.ql.exec.Operator.close(Operator.java:595)
> 	at org.apache.hadoop.hive.ql.exec.Operator.close(Operator.java:595)
> 	at org.apache.hadoop.hive.ql.exec.tez.MapRecordProcessor.close(MapRecordProcessor.java:224)
> 	... 13 more
> {code}



--
This message was sent by Atlassian JIRA
(v6.3.4#6332)

Mime
View raw message