hive-dev mailing list archives

Site index · List index
Message view « Date » · « Thread »
Top « Date » · « Thread »
From "Hive QA (JIRA)" <j...@apache.org>
Subject [jira] [Commented] (HIVE-5799) session/operation timeout for hiveserver2
Date Mon, 18 Aug 2014 09:29:19 GMT

    [ https://issues.apache.org/jira/browse/HIVE-5799?page=com.atlassian.jira.plugin.system.issuetabpanels:comment-tabpanel&focusedCommentId=14100470#comment-14100470
] 

Hive QA commented on HIVE-5799:
-------------------------------



{color:red}Overall{color}: -1 no tests executed

Here are the results of testing the latest attachment:
https://issues.apache.org/jira/secure/attachment/12662446/HIVE-5799.10.patch.txt

Test results: http://ec2-174-129-184-35.compute-1.amazonaws.com/jenkins/job/PreCommit-HIVE-TRUNK-Build/374/testReport
Console output: http://ec2-174-129-184-35.compute-1.amazonaws.com/jenkins/job/PreCommit-HIVE-TRUNK-Build/374/console
Test logs: http://ec2-174-129-184-35.compute-1.amazonaws.com/logs/PreCommit-HIVE-TRUNK-Build-374/

Messages:
{noformat}
**** This message was trimmed, see log for full details ****
[INFO] 
[INFO] --- maven-resources-plugin:2.6:testResources (default-testResources) @ hive-shims-0.23
---
[INFO] Using 'UTF-8' encoding to copy filtered resources.
[INFO] skip non existing resourceDirectory /data/hive-ptest/working/apache-svn-trunk-source/shims/0.23/src/test/resources
[INFO] Copying 3 resources
[INFO] 
[INFO] --- maven-antrun-plugin:1.7:run (setup-test-dirs) @ hive-shims-0.23 ---
[INFO] Executing tasks

main:
    [mkdir] Created dir: /data/hive-ptest/working/apache-svn-trunk-source/shims/0.23/target/tmp
    [mkdir] Created dir: /data/hive-ptest/working/apache-svn-trunk-source/shims/0.23/target/warehouse
    [mkdir] Created dir: /data/hive-ptest/working/apache-svn-trunk-source/shims/0.23/target/tmp/conf
     [copy] Copying 7 files to /data/hive-ptest/working/apache-svn-trunk-source/shims/0.23/target/tmp/conf
[INFO] Executed tasks
[INFO] 
[INFO] --- maven-compiler-plugin:3.1:testCompile (default-testCompile) @ hive-shims-0.23 ---
[INFO] No sources to compile
[INFO] 
[INFO] --- maven-surefire-plugin:2.16:test (default-test) @ hive-shims-0.23 ---
[INFO] Tests are skipped.
[INFO] 
[INFO] --- maven-jar-plugin:2.2:jar (default-jar) @ hive-shims-0.23 ---
[INFO] Building jar: /data/hive-ptest/working/apache-svn-trunk-source/shims/0.23/target/hive-shims-0.23-0.14.0-SNAPSHOT.jar
[INFO] 
[INFO] --- maven-site-plugin:3.3:attach-descriptor (attach-descriptor) @ hive-shims-0.23 ---
[INFO] 
[INFO] --- maven-install-plugin:2.4:install (default-install) @ hive-shims-0.23 ---
[INFO] Installing /data/hive-ptest/working/apache-svn-trunk-source/shims/0.23/target/hive-shims-0.23-0.14.0-SNAPSHOT.jar
to /data/hive-ptest/working/maven/org/apache/hive/shims/hive-shims-0.23/0.14.0-SNAPSHOT/hive-shims-0.23-0.14.0-SNAPSHOT.jar
[INFO] Installing /data/hive-ptest/working/apache-svn-trunk-source/shims/0.23/pom.xml to /data/hive-ptest/working/maven/org/apache/hive/shims/hive-shims-0.23/0.14.0-SNAPSHOT/hive-shims-0.23-0.14.0-SNAPSHOT.pom
[INFO]                                                                         
[INFO] ------------------------------------------------------------------------
[INFO] Building Hive Shims 0.14.0-SNAPSHOT
[INFO] ------------------------------------------------------------------------
[INFO] 
[INFO] --- maven-clean-plugin:2.5:clean (default-clean) @ hive-shims ---
[INFO] Deleting /data/hive-ptest/working/apache-svn-trunk-source/shims/aggregator (includes
= [datanucleus.log, derby.log], excludes = [])
[INFO] 
[INFO] --- maven-remote-resources-plugin:1.5:process (default) @ hive-shims ---
[INFO] 
[INFO] --- maven-resources-plugin:2.6:resources (default-resources) @ hive-shims ---
[INFO] Using 'UTF-8' encoding to copy filtered resources.
[INFO] skip non existing resourceDirectory /data/hive-ptest/working/apache-svn-trunk-source/shims/aggregator/src/main/resources
[INFO] Copying 3 resources
[INFO] 
[INFO] --- maven-antrun-plugin:1.7:run (define-classpath) @ hive-shims ---
[INFO] Executing tasks

main:
[INFO] Executed tasks
[INFO] 
[INFO] --- maven-compiler-plugin:3.1:compile (default-compile) @ hive-shims ---
[INFO] No sources to compile
[INFO] 
[INFO] --- maven-resources-plugin:2.6:testResources (default-testResources) @ hive-shims ---
[INFO] Using 'UTF-8' encoding to copy filtered resources.
[INFO] skip non existing resourceDirectory /data/hive-ptest/working/apache-svn-trunk-source/shims/aggregator/src/test/resources
[INFO] Copying 3 resources
[INFO] 
[INFO] --- maven-antrun-plugin:1.7:run (setup-test-dirs) @ hive-shims ---
[INFO] Executing tasks

main:
    [mkdir] Created dir: /data/hive-ptest/working/apache-svn-trunk-source/shims/aggregator/target/tmp
    [mkdir] Created dir: /data/hive-ptest/working/apache-svn-trunk-source/shims/aggregator/target/warehouse
    [mkdir] Created dir: /data/hive-ptest/working/apache-svn-trunk-source/shims/aggregator/target/tmp/conf
     [copy] Copying 7 files to /data/hive-ptest/working/apache-svn-trunk-source/shims/aggregator/target/tmp/conf
[INFO] Executed tasks
[INFO] 
[INFO] --- maven-compiler-plugin:3.1:testCompile (default-testCompile) @ hive-shims ---
[INFO] No sources to compile
[INFO] 
[INFO] --- maven-surefire-plugin:2.16:test (default-test) @ hive-shims ---
[INFO] Tests are skipped.
[INFO] 
[INFO] --- maven-jar-plugin:2.2:jar (default-jar) @ hive-shims ---
[INFO] Building jar: /data/hive-ptest/working/apache-svn-trunk-source/shims/aggregator/target/hive-shims-0.14.0-SNAPSHOT.jar
[INFO] 
[INFO] --- maven-site-plugin:3.3:attach-descriptor (attach-descriptor) @ hive-shims ---
[INFO] 
[INFO] --- maven-install-plugin:2.4:install (default-install) @ hive-shims ---
[INFO] Installing /data/hive-ptest/working/apache-svn-trunk-source/shims/aggregator/target/hive-shims-0.14.0-SNAPSHOT.jar
to /data/hive-ptest/working/maven/org/apache/hive/hive-shims/0.14.0-SNAPSHOT/hive-shims-0.14.0-SNAPSHOT.jar
[INFO] Installing /data/hive-ptest/working/apache-svn-trunk-source/shims/aggregator/pom.xml
to /data/hive-ptest/working/maven/org/apache/hive/hive-shims/0.14.0-SNAPSHOT/hive-shims-0.14.0-SNAPSHOT.pom
[INFO]                                                                         
[INFO] ------------------------------------------------------------------------
[INFO] Building Hive Common 0.14.0-SNAPSHOT
[INFO] ------------------------------------------------------------------------
[INFO] 
[INFO] --- maven-clean-plugin:2.5:clean (default-clean) @ hive-common ---
[INFO] Deleting /data/hive-ptest/working/apache-svn-trunk-source/common (includes = [datanucleus.log,
derby.log], excludes = [])
[INFO] 
[INFO] --- maven-antrun-plugin:1.7:run (generate-version-annotation) @ hive-common ---
[INFO] Executing tasks

main:
[INFO] Executed tasks
[INFO] 
[INFO] --- build-helper-maven-plugin:1.8:add-source (add-source) @ hive-common ---
[INFO] Source directory: /data/hive-ptest/working/apache-svn-trunk-source/common/src/gen added.
[INFO] 
[INFO] --- maven-remote-resources-plugin:1.5:process (default) @ hive-common ---
[INFO] 
[INFO] --- maven-resources-plugin:2.6:resources (default-resources) @ hive-common ---
[INFO] Using 'UTF-8' encoding to copy filtered resources.
[INFO] Copying 1 resource
[INFO] Copying 3 resources
[INFO] 
[INFO] --- maven-antrun-plugin:1.7:run (define-classpath) @ hive-common ---
[INFO] Executing tasks

main:
[INFO] Executed tasks
[INFO] 
[INFO] --- maven-compiler-plugin:3.1:compile (default-compile) @ hive-common ---
[INFO] Compiling 52 source files to /data/hive-ptest/working/apache-svn-trunk-source/common/target/classes
[INFO] -------------------------------------------------------------
[WARNING] COMPILATION WARNING : 
[INFO] -------------------------------------------------------------
[WARNING] /data/hive-ptest/working/apache-svn-trunk-source/common/src/java/org/apache/hadoop/hive/common/FileUtils.java:
/data/hive-ptest/working/apache-svn-trunk-source/common/src/java/org/apache/hadoop/hive/common/FileUtils.java
uses or overrides a deprecated API.
[WARNING] /data/hive-ptest/working/apache-svn-trunk-source/common/src/java/org/apache/hadoop/hive/common/FileUtils.java:
Recompile with -Xlint:deprecation for details.
[WARNING] /data/hive-ptest/working/apache-svn-trunk-source/common/src/java/org/apache/hadoop/hive/common/ObjectPair.java:
/data/hive-ptest/working/apache-svn-trunk-source/common/src/java/org/apache/hadoop/hive/common/ObjectPair.java
uses unchecked or unsafe operations.
[WARNING] /data/hive-ptest/working/apache-svn-trunk-source/common/src/java/org/apache/hadoop/hive/common/ObjectPair.java:
Recompile with -Xlint:unchecked for details.
[INFO] 4 warnings 
[INFO] -------------------------------------------------------------
[INFO] -------------------------------------------------------------
[ERROR] COMPILATION ERROR : 
[INFO] -------------------------------------------------------------
[ERROR] /data/hive-ptest/working/apache-svn-trunk-source/common/src/java/org/apache/hadoop/hive/conf/HiveConf.java:[1583,90]
cannot find symbol
  symbol:   class TimeValidator
  location: class org.apache.hadoop.hive.conf.HiveConf.ConfVars
[ERROR] /data/hive-ptest/working/apache-svn-trunk-source/common/src/java/org/apache/hadoop/hive/conf/HiveConf.java:[1585,86]
cannot find symbol
  symbol:   class TimeValidator
  location: class org.apache.hadoop.hive.conf.HiveConf.ConfVars
[ERROR] /data/hive-ptest/working/apache-svn-trunk-source/common/src/java/org/apache/hadoop/hive/conf/HiveConf.java:[1587,90]
cannot find symbol
  symbol:   class TimeValidator
  location: class org.apache.hadoop.hive.conf.HiveConf.ConfVars
[INFO] 3 errors 
[INFO] -------------------------------------------------------------
[INFO] ------------------------------------------------------------------------
[INFO] Reactor Summary:
[INFO] 
[INFO] Hive .............................................. SUCCESS [10.766s]
[INFO] Hive Ant Utilities ................................ SUCCESS [6.842s]
[INFO] Hive Shims Common ................................. SUCCESS [4.496s]
[INFO] Hive Shims 0.20 ................................... SUCCESS [2.697s]
[INFO] Hive Shims Secure Common .......................... SUCCESS [5.051s]
[INFO] Hive Shims 0.20S .................................. SUCCESS [2.994s]
[INFO] Hive Shims 0.23 ................................... SUCCESS [7.690s]
[INFO] Hive Shims ........................................ SUCCESS [1.162s]
[INFO] Hive Common ....................................... FAILURE [39.262s]
[INFO] Hive Serde ........................................ SKIPPED
[INFO] Hive Metastore .................................... SKIPPED
[INFO] Hive Query Language ............................... SKIPPED
[INFO] Hive Service ...................................... SKIPPED
[INFO] Hive JDBC ......................................... SKIPPED
[INFO] Hive Beeline ...................................... SKIPPED
[INFO] Hive CLI .......................................... SKIPPED
[INFO] Hive Contrib ...................................... SKIPPED
[INFO] Hive HBase Handler ................................ SKIPPED
[INFO] Hive HCatalog ..................................... SKIPPED
[INFO] Hive HCatalog Core ................................ SKIPPED
[INFO] Hive HCatalog Pig Adapter ......................... SKIPPED
[INFO] Hive HCatalog Server Extensions ................... SKIPPED
[INFO] Hive HCatalog Webhcat Java Client ................. SKIPPED
[INFO] Hive HCatalog Webhcat ............................. SKIPPED
[INFO] Hive HCatalog Streaming ........................... SKIPPED
[INFO] Hive HWI .......................................... SKIPPED
[INFO] Hive ODBC ......................................... SKIPPED
[INFO] Hive Shims Aggregator ............................. SKIPPED
[INFO] Hive TestUtils .................................... SKIPPED
[INFO] Hive Packaging .................................... SKIPPED
[INFO] ------------------------------------------------------------------------
[INFO] BUILD FAILURE
[INFO] ------------------------------------------------------------------------
[INFO] Total time: 1:23.901s
[INFO] Finished at: Mon Aug 18 05:27:06 EDT 2014
[INFO] Final Memory: 43M/104M
[INFO] ------------------------------------------------------------------------
[ERROR] Failed to execute goal org.apache.maven.plugins:maven-compiler-plugin:3.1:compile
(default-compile) on project hive-common: Compilation failure: Compilation failure:
[ERROR] /data/hive-ptest/working/apache-svn-trunk-source/common/src/java/org/apache/hadoop/hive/conf/HiveConf.java:[1583,90]
cannot find symbol
[ERROR] symbol:   class TimeValidator
[ERROR] location: class org.apache.hadoop.hive.conf.HiveConf.ConfVars
[ERROR] /data/hive-ptest/working/apache-svn-trunk-source/common/src/java/org/apache/hadoop/hive/conf/HiveConf.java:[1585,86]
cannot find symbol
[ERROR] symbol:   class TimeValidator
[ERROR] location: class org.apache.hadoop.hive.conf.HiveConf.ConfVars
[ERROR] /data/hive-ptest/working/apache-svn-trunk-source/common/src/java/org/apache/hadoop/hive/conf/HiveConf.java:[1587,90]
cannot find symbol
[ERROR] symbol:   class TimeValidator
[ERROR] location: class org.apache.hadoop.hive.conf.HiveConf.ConfVars
[ERROR] -> [Help 1]
[ERROR] 
[ERROR] To see the full stack trace of the errors, re-run Maven with the -e switch.
[ERROR] Re-run Maven using the -X switch to enable full debug logging.
[ERROR] 
[ERROR] For more information about the errors and possible solutions, please read the following
articles:
[ERROR] [Help 1] http://cwiki.apache.org/confluence/display/MAVEN/MojoFailureException
[ERROR] 
[ERROR] After correcting the problems, you can resume the build with the command
[ERROR]   mvn <goals> -rf :hive-common
+ exit 1
'
{noformat}

This message is automatically generated.

ATTACHMENT ID: 12662446

> session/operation timeout for hiveserver2
> -----------------------------------------
>
>                 Key: HIVE-5799
>                 URL: https://issues.apache.org/jira/browse/HIVE-5799
>             Project: Hive
>          Issue Type: Improvement
>          Components: HiveServer2
>            Reporter: Navis
>            Assignee: Navis
>            Priority: Minor
>         Attachments: HIVE-5799.1.patch.txt, HIVE-5799.10.patch.txt, HIVE-5799.2.patch.txt,
HIVE-5799.3.patch.txt, HIVE-5799.4.patch.txt, HIVE-5799.5.patch.txt, HIVE-5799.6.patch.txt,
HIVE-5799.7.patch.txt, HIVE-5799.8.patch.txt, HIVE-5799.9.patch.txt
>
>
> Need some timeout facility for preventing resource leakages from instable  or bad clients.



--
This message was sent by Atlassian JIRA
(v6.2#6252)

Mime
View raw message