hive-dev mailing list archives

Site index · List index
Message view « Date » · « Thread »
Top « Date » · « Thread »
From "Hive QA (JIRA)" <j...@apache.org>
Subject [jira] [Commented] (HIVE-7456) HIVE-7361 missed updating authorization_fail_8
Date Mon, 21 Jul 2014 08:54:38 GMT

    [ https://issues.apache.org/jira/browse/HIVE-7456?page=com.atlassian.jira.plugin.system.issuetabpanels:comment-tabpanel&focusedCommentId=14068326#comment-14068326
] 

Hive QA commented on HIVE-7456:
-------------------------------



{color:red}Overall{color}: -1 at least one tests failed

Here are the results of testing the latest attachment:
https://issues.apache.org/jira/secure/attachment/12656815/HIVE-7456.1.patch.txt

{color:red}ERROR:{color} -1 due to 2 failed/errored test(s), 5734 tests executed
*Failed tests:*
{noformat}
org.apache.hadoop.hive.cli.TestCliDriver.testCliDriver_groupby8_map
org.apache.hadoop.hive.cli.TestMinimrCliDriver.testCliDriver_ql_rewrite_gbtoidx
{noformat}

Test results: http://ec2-174-129-184-35.compute-1.amazonaws.com/jenkins/job/PreCommit-HIVE-Build/869/testReport
Console output: http://ec2-174-129-184-35.compute-1.amazonaws.com/jenkins/job/PreCommit-HIVE-Build/869/console
Test logs: http://ec2-174-129-184-35.compute-1.amazonaws.com/logs/PreCommit-HIVE-Build-869/

Messages:
{noformat}
Executing org.apache.hive.ptest.execution.PrepPhase
Executing org.apache.hive.ptest.execution.ExecutionPhase
Executing org.apache.hive.ptest.execution.ReportingPhase
Tests exited with: TestsFailedException: 2 tests failed
{noformat}

This message is automatically generated.

ATTACHMENT ID: 12656815

> HIVE-7361 missed updating authorization_fail_8
> ----------------------------------------------
>
>                 Key: HIVE-7456
>                 URL: https://issues.apache.org/jira/browse/HIVE-7456
>             Project: Hive
>          Issue Type: Task
>          Components: Tests
>            Reporter: Navis
>            Assignee: Navis
>            Priority: Trivial
>         Attachments: HIVE-7456.1.patch.txt
>
>
> {noformat}
> Running: diff -a /home/hiveptest/54.91.198.254-hiveptest-1/apache-svn-trunk-source/itests/qtest/../../itests/qtest/target/qfile-results/clientnegative/authorization_fail_8.q.out
/home/hiveptest/54.91.198.254-hiveptest-1/apache-svn-trunk-source/itests/qtest/../../ql/src/test/results/clientnegative/authorization_fail_8.q.out
> 48c48
> < FAILED: Execution Error, return code 1 from org.apache.hadoop.hive.ql.exec.DDLTask.
Permission denied. Principal [name=user2, type=USER] does not have following privileges on
Object [type=TABLE_OR_VIEW, name=default.authorization_fail] for operation GRANT_PRIVILEGE
: [SELECT with grant]
> ---
> > FAILED: Execution Error, return code 1 from org.apache.hadoop.hive.ql.exec.DDLTask.
Permission denied. Principal [name=user2, type=USER] does not have following privileges on
Object [type=TABLE_OR_VIEW, name=default.authorization_fail] : [SELECT with grant]
> {noformat}
> and template update for HIVE-7385



--
This message was sent by Atlassian JIRA
(v6.2#6252)

Mime
View raw message