hive-dev mailing list archives

Site index · List index
Message view « Date » · « Thread »
Top « Date » · « Thread »
From "Hive QA (JIRA)" <j...@apache.org>
Subject [jira] [Commented] (HIVE-7110) TestHCatPartitionPublish test failure: No FileSystem or scheme: pfile
Date Tue, 03 Jun 2014 01:52:01 GMT

    [ https://issues.apache.org/jira/browse/HIVE-7110?page=com.atlassian.jira.plugin.system.issuetabpanels:comment-tabpanel&focusedCommentId=14016138#comment-14016138
] 

Hive QA commented on HIVE-7110:
-------------------------------



{color:red}Overall{color}: -1 at least one tests failed

Here are the results of testing the latest attachment:
https://issues.apache.org/jira/secure/attachment/12648026/HIVE-7110.4.patch

{color:red}ERROR:{color} -1 due to 18 failed/errored test(s), 5585 tests executed
*Failed tests:*
{noformat}
org.apache.hadoop.hive.cli.TestCliDriver.testCliDriver_display_colstats_tbllvl
org.apache.hadoop.hive.cli.TestCliDriver.testCliDriver_windowing_udaf
org.apache.hadoop.hive.cli.TestMiniTezCliDriver.testCliDriver_dynpart_sort_optimization
org.apache.hadoop.hive.cli.TestMiniTezCliDriver.testCliDriver_insert1
org.apache.hadoop.hive.cli.TestMiniTezCliDriver.testCliDriver_load_dyn_part1
org.apache.hadoop.hive.cli.TestMiniTezCliDriver.testCliDriver_metadata_only_queries
org.apache.hadoop.hive.cli.TestMiniTezCliDriver.testCliDriver_ptf
org.apache.hadoop.hive.cli.TestMiniTezCliDriver.testCliDriver_scriptfile1
org.apache.hadoop.hive.cli.TestMiniTezCliDriver.testCliDriver_tez_dml
org.apache.hadoop.hive.cli.TestMiniTezCliDriver.testCliDriver_tez_schema_evolution
org.apache.hadoop.hive.cli.TestMinimrCliDriver.testCliDriver_bucketmapjoin6
org.apache.hadoop.hive.cli.TestMinimrCliDriver.testCliDriver_root_dir_external_table
org.apache.hadoop.hive.cli.TestMinimrCliDriver.testCliDriver_schemeAuthority
org.apache.hadoop.hive.cli.TestNegativeCliDriver.testNegativeCliDriver_authorization_ctas
org.apache.hadoop.hive.ql.exec.tez.TestTezTask.testSubmit
org.apache.hive.hcatalog.pig.TestOrcHCatPigStorer.testWriteDecimal
org.apache.hive.hcatalog.pig.TestOrcHCatPigStorer.testWriteDecimalX
org.apache.hive.hcatalog.pig.TestOrcHCatPigStorer.testWriteDecimalXY
{noformat}

Test results: http://ec2-174-129-184-35.compute-1.amazonaws.com/jenkins/job/PreCommit-HIVE-Build/374/testReport
Console output: http://ec2-174-129-184-35.compute-1.amazonaws.com/jenkins/job/PreCommit-HIVE-Build/374/console
Test logs: http://ec2-174-129-184-35.compute-1.amazonaws.com/logs/PreCommit-HIVE-Build-374/

Messages:
{noformat}
Executing org.apache.hive.ptest.execution.PrepPhase
Executing org.apache.hive.ptest.execution.ExecutionPhase
Executing org.apache.hive.ptest.execution.ReportingPhase
Tests exited with: TestsFailedException: 18 tests failed
{noformat}

This message is automatically generated.

ATTACHMENT ID: 12648026

> TestHCatPartitionPublish test failure: No FileSystem or scheme: pfile
> ---------------------------------------------------------------------
>
>                 Key: HIVE-7110
>                 URL: https://issues.apache.org/jira/browse/HIVE-7110
>             Project: Hive
>          Issue Type: Bug
>          Components: HCatalog
>            Reporter: David Chen
>            Assignee: David Chen
>         Attachments: HIVE-7110.1.patch, HIVE-7110.2.patch, HIVE-7110.3.patch, HIVE-7110.4.patch
>
>
> I got the following TestHCatPartitionPublish test failure when running all unit tests
against Hadoop 1. This also appears when testing against Hadoop 2.
> {code}
>  Tests run: 1, Failures: 0, Errors: 1, Skipped: 0, Time elapsed: 26.06 sec <<<
FAILURE! - in org.apache.hive.hcatalog.mapreduce.TestHCatPartitionPublish
> testPartitionPublish(org.apache.hive.hcatalog.mapreduce.TestHCatPartitionPublish)  Time
elapsed: 1.361 sec  <<< ERROR!
> org.apache.hive.hcatalog.common.HCatException: org.apache.hive.hcatalog.common.HCatException
: 2001 : Error setting output information. Cause : java.io.IOException: No FileSystem for
scheme: pfile
>         at org.apache.hadoop.fs.FileSystem.createFileSystem(FileSystem.java:1443)
>         at org.apache.hadoop.fs.FileSystem.access$200(FileSystem.java:67)
>         at org.apache.hadoop.fs.FileSystem$Cache.get(FileSystem.java:1464)
>         at org.apache.hadoop.fs.FileSystem.get(FileSystem.java:263)
>         at org.apache.hadoop.fs.Path.getFileSystem(Path.java:187)
>         at org.apache.hive.hcatalog.mapreduce.HCatOutputFormat.setOutput(HCatOutputFormat.java:212)
>         at org.apache.hive.hcatalog.mapreduce.HCatOutputFormat.setOutput(HCatOutputFormat.java:70)
>         at org.apache.hive.hcatalog.mapreduce.TestHCatPartitionPublish.runMRCreateFail(TestHCatPartitionPublish.java:191)
>         at org.apache.hive.hcatalog.mapreduce.TestHCatPartitionPublish.testPartitionPublish(TestHCatPartitionPublish.java:155)
> {code}



--
This message was sent by Atlassian JIRA
(v6.2#6252)

Mime
View raw message