hive-dev mailing list archives

Site index · List index
Message view « Date » · « Thread »
Top « Date » · « Thread »
From "Hive QA (JIRA)" <j...@apache.org>
Subject [jira] [Commented] (HIVE-6989) Error with arithmetic operators with javaXML serialization
Date Wed, 30 Apr 2014 07:37:16 GMT

    [ https://issues.apache.org/jira/browse/HIVE-6989?page=com.atlassian.jira.plugin.system.issuetabpanels:comment-tabpanel&focusedCommentId=13985247#comment-13985247
] 

Hive QA commented on HIVE-6989:
-------------------------------



{color:red}Overall{color}: -1 at least one tests failed

Here are the results of testing the latest attachment:
https://issues.apache.org/jira/secure/attachment/12642562/HIVE-6989.1.patch

{color:red}ERROR:{color} -1 due to 18 failed/errored test(s), 5424 tests executed
*Failed tests:*
{noformat}
org.apache.hadoop.hive.cli.TestCliDriver.testCliDriver_groupby2_map_skew
org.apache.hadoop.hive.cli.TestCliDriver.testCliDriver_stats_list_bucket
org.apache.hadoop.hive.cli.TestCliDriver.testCliDriver_stats_partscan_1_23
org.apache.hadoop.hive.cli.TestMinimrCliDriver.testCliDriver_root_dir_external_table
org.apache.hadoop.hive.cli.TestNegativeCliDriver.testNegativeCliDriver_dynamic_partitions_with_whitelist
org.apache.hadoop.hive.cli.TestNegativeCliDriver.testNegativeCliDriver_stats_partialscan_autogether
org.apache.hadoop.hive.ql.parse.TestParse.testParse_cast1
org.apache.hadoop.hive.ql.parse.TestParse.testParse_input20
org.apache.hadoop.hive.ql.parse.TestParse.testParse_input8
org.apache.hadoop.hive.ql.parse.TestParse.testParse_join2
org.apache.hadoop.hive.ql.parse.TestParse.testParse_sample1
org.apache.hadoop.hive.ql.parse.TestParse.testParse_sample2
org.apache.hadoop.hive.ql.parse.TestParse.testParse_sample3
org.apache.hadoop.hive.ql.parse.TestParse.testParse_sample4
org.apache.hadoop.hive.ql.parse.TestParse.testParse_sample5
org.apache.hadoop.hive.ql.parse.TestParse.testParse_sample6
org.apache.hadoop.hive.ql.parse.TestParse.testParse_sample7
org.apache.hadoop.hive.ql.parse.TestParse.testParse_udf4
{noformat}

Test results: http://ec2-174-129-184-35.compute-1.amazonaws.com/jenkins/job/PreCommit-HIVE-Build/83/testReport
Console output: http://ec2-174-129-184-35.compute-1.amazonaws.com/jenkins/job/PreCommit-HIVE-Build/83/console

Messages:
{noformat}
Executing org.apache.hive.ptest.execution.PrepPhase
Executing org.apache.hive.ptest.execution.ExecutionPhase
Executing org.apache.hive.ptest.execution.ReportingPhase
Tests exited with: TestsFailedException: 18 tests failed
{noformat}

This message is automatically generated.

ATTACHMENT ID: 12642562

> Error with arithmetic operators with javaXML serialization
> ----------------------------------------------------------
>
>                 Key: HIVE-6989
>                 URL: https://issues.apache.org/jira/browse/HIVE-6989
>             Project: Hive
>          Issue Type: Bug
>    Affects Versions: 0.13.0
>            Reporter: Jason Dere
>            Assignee: Jason Dere
>         Attachments: HIVE-6989.1.patch
>
>
> A couple of members in GenericUDFBaseNumeric do not have getters/setters, which prevents
them from being serialized as part of the query plan when using javaXML serialization. As
a result, the following query:
> {noformat}
> select key + key from src limit 5;
> {noformat}
> fails with the following error:
> {noformat}
> java.lang.Exception: java.lang.RuntimeException: Error in configuring object
>         at org.apache.hadoop.mapred.LocalJobRunner$Job.run(LocalJobRunner.java:401)
> Caused by: java.lang.RuntimeException: Error in configuring object
>         at org.apache.hadoop.util.ReflectionUtils.setJobConf(ReflectionUtils.java:109)
>         at org.apache.hadoop.util.ReflectionUtils.setConf(ReflectionUtils.java:75)
>         at org.apache.hadoop.util.ReflectionUtils.newInstance(ReflectionUtils.java:133)
>         at org.apache.hadoop.mapred.MapTask.runOldMapper(MapTask.java:425)
>         at org.apache.hadoop.mapred.MapTask.run(MapTask.java:341)
>         at org.apache.hadoop.mapred.LocalJobRunner$Job$MapTaskRunnable.run(LocalJobRunner.java:233)
>         at java.util.concurrent.Executors$RunnableAdapter.call(Executors.java:439)
>         at java.util.concurrent.FutureTask$Sync.innerRun(FutureTask.java:303)       
at java.util.concurrent.FutureTask.run(FutureTask.java:138)
>         at java.util.concurrent.ThreadPoolExecutor$Worker.runTask(ThreadPoolExecutor.java:895)
>         at java.util.concurrent.ThreadPoolExecutor$Worker.run(ThreadPoolExecutor.java:918)
>         at java.lang.Thread.run(Thread.java:680)
> Caused by: java.lang.reflect.InvocationTargetException
>         at sun.reflect.NativeMethodAccessorImpl.invoke0(Native Method)
>         at sun.reflect.NativeMethodAccessorImpl.invoke(NativeMethodAccessorImpl.java:39)
>         at sun.reflect.DelegatingMethodAccessorImpl.invoke(DelegatingMethodAccessorImpl.java:25)
>         at java.lang.reflect.Method.invoke(Method.java:597)
>         at org.apache.hadoop.util.ReflectionUtils.setJobConf(ReflectionUtils.java:106)
>         ... 11 more
> Caused by: java.lang.RuntimeException: Error in configuring object
>         at org.apache.hadoop.util.ReflectionUtils.setJobConf(ReflectionUtils.java:109)
>         at org.apache.hadoop.util.ReflectionUtils.setConf(ReflectionUtils.java:75)
>         at org.apache.hadoop.util.ReflectionUtils.newInstance(ReflectionUtils.java:133)
>         at org.apache.hadoop.mapred.MapRunner.configure(MapRunner.java:38)
>         ... 16 more
> Caused by: java.lang.reflect.InvocationTargetException
>         at sun.reflect.NativeMethodAccessorImpl.invoke0(Native Method)
>         at sun.reflect.NativeMethodAccessorImpl.invoke(NativeMethodAccessorImpl.java:39)
>         at sun.reflect.DelegatingMethodAccessorImpl.invoke(DelegatingMethodAccessorImpl.java:25)
>         at java.lang.reflect.Method.invoke(Method.java:597)
>         at org.apache.hadoop.util.ReflectionUtils.setJobConf(ReflectionUtils.java:106)
>         ... 19 more
> Caused by: java.lang.RuntimeException: Map operator initialization failed
>         at org.apache.hadoop.hive.ql.exec.mr.ExecMapper.configure(ExecMapper.java:154)
>         ... 24 more
> Caused by: java.lang.NullPointerException
>         at org.apache.hadoop.hive.ql.udf.generic.GenericUDFBaseNumeric.initialize(GenericUDFBaseNumeric.java:109)
>         at org.apache.hadoop.hive.ql.udf.generic.GenericUDF.initializeAndFoldConstants(GenericUDF.java:116)
>         at org.apache.hadoop.hive.ql.exec.ExprNodeGenericFuncEvaluator.initialize(ExprNodeGenericFuncEvaluator.java:127)
>         at org.apache.hadoop.hive.ql.exec.ExprNodeEvaluatorHead.initialize(ExprNodeEvaluatorHead.java:39)
>         at org.apache.hadoop.hive.ql.exec.Operator.initEvaluators(Operator.java:931)
>         at org.apache.hadoop.hive.ql.exec.Operator.initEvaluatorsAndReturnStruct(Operator.java:957)
>         at org.apache.hadoop.hive.ql.exec.SelectOperator.initializeOp(SelectOperator.java:65)
>         at org.apache.hadoop.hive.ql.exec.Operator.initialize(Operator.java:376)
>         at org.apache.hadoop.hive.ql.exec.Operator.initialize(Operator.java:460)
>         at org.apache.hadoop.hive.ql.exec.Operator.initializeChildren(Operator.java:416)
>         at org.apache.hadoop.hive.ql.exec.TableScanOperator.initializeOp(TableScanOperator.java:189)
>         at org.apache.hadoop.hive.ql.exec.Operator.initialize(Operator.java:376)
>         at org.apache.hadoop.hive.ql.exec.MapOperator.initializeOp(MapOperator.java:425)
>         at org.apache.hadoop.hive.ql.exec.Operator.initialize(Operator.java:376)
>         at org.apache.hadoop.hive.ql.exec.mr.ExecMapper.configure(ExecMapper.java:133)
>         ... 24 more
> {noformat}



--
This message was sent by Atlassian JIRA
(v6.2#6252)

Mime
View raw message