hive-dev mailing list archives

Site index · List index
Message view « Date » · « Thread »
Top « Date » · « Thread »
From "Hive QA (JIRA)" <j...@apache.org>
Subject [jira] [Commented] (HIVE-6845) TestJdbcDriver.testShowRoleGrant can fail if TestJdbcDriver/TestJdbcDriver2 run together
Date Sun, 06 Apr 2014 03:39:14 GMT

    [ https://issues.apache.org/jira/browse/HIVE-6845?page=com.atlassian.jira.plugin.system.issuetabpanels:comment-tabpanel&focusedCommentId=13961322#comment-13961322
] 

Hive QA commented on HIVE-6845:
-------------------------------



{color:red}Overall{color}: -1 at least one tests failed

Here are the results of testing the latest attachment:
https://issues.apache.org/jira/secure/attachment/12638787/HIVE-6845.1.patch

{color:red}ERROR:{color} -1 due to 1 failed/errored test(s), 5547 tests executed
*Failed tests:*
{noformat}
org.apache.hadoop.hive.cli.TestMinimrCliDriver.testCliDriver_bucket_num_reducers
{noformat}

Test results: http://bigtop01.cloudera.org:8080/job/PreCommit-HIVE-Build/2140/testReport
Console output: http://bigtop01.cloudera.org:8080/job/PreCommit-HIVE-Build/2140/console

Messages:
{noformat}
Executing org.apache.hive.ptest.execution.PrepPhase
Executing org.apache.hive.ptest.execution.ExecutionPhase
Executing org.apache.hive.ptest.execution.ReportingPhase
Tests exited with: TestsFailedException: 1 tests failed
{noformat}

This message is automatically generated.

ATTACHMENT ID: 12638787

> TestJdbcDriver.testShowRoleGrant can fail if TestJdbcDriver/TestJdbcDriver2 run together
> ----------------------------------------------------------------------------------------
>
>                 Key: HIVE-6845
>                 URL: https://issues.apache.org/jira/browse/HIVE-6845
>             Project: Hive
>          Issue Type: Bug
>          Components: Tests
>            Reporter: Jason Dere
>            Assignee: Jason Dere
>         Attachments: HIVE-6845.1.patch
>
>
> Running both TestJdbcDriver/TestJdbcDriver2 together in the same run gives an error in
testShowRoleGrant() because both tests create the role "role1".  When the 2nd test tries to
create the role it fails:
> {noformat}
> testShowRoleGrant(org.apache.hive.jdbc.TestJdbcDriver2)  Time elapsed: 1.801 sec  <<<
ERROR!
> java.sql.SQLException: Error while processing statement: FAILED: Execution Error, return
code 1 from org.apache.hadoop.hive.ql.exec.DDLTask
> 	at org.apache.hive.jdbc.HiveStatement.execute(HiveStatement.java:275)
> 	at org.apache.hive.jdbc.TestJdbcDriver2.testShowRoleGrant(TestJdbcDriver2.java:2000)
> {noformat}



--
This message was sent by Atlassian JIRA
(v6.2#6252)

Mime
View raw message