hive-dev mailing list archives

Site index · List index
Message view « Date » · « Thread »
Top « Date » · « Thread »
From "zhuyu (JIRA)" <j...@apache.org>
Subject [jira] [Commented] (HIVE-3746) Fix HS2 ResultSet Serialization Performance Regression
Date Sun, 16 Mar 2014 16:09:48 GMT

    [ https://issues.apache.org/jira/browse/HIVE-3746?page=com.atlassian.jira.plugin.system.issuetabpanels:comment-tabpanel&focusedCommentId=13937195#comment-13937195
] 

zhuyu commented on HIVE-3746:
-----------------------------

how to solve it?
main:
[INFO] Executed tasks
[INFO] 
[INFO] --- maven-compiler-plugin:3.1:compile (default-compile) @ hive-exec ---
[INFO] Compiling 7 source files to /mnt/public/workspace/linux/hive-0.13/ql/target/classes
[INFO]                                                                         
[INFO] ------------------------------------------------------------------------
[INFO] Building Hive Service 0.13.0
[INFO] ------------------------------------------------------------------------
Downloading: http://www.datanucleus.org/downloads/maven2/org/apache/hive/hive-exec/0.13.0/hive-exec-0.13.0-tests.jar
Downloading: http://repo.maven.apache.org/maven2/org/apache/hive/hive-exec/0.13.0/hive-exec-0.13.0-tests.jar
[INFO] ------------------------------------------------------------------------
[INFO] Reactor Summary:
[INFO] 
[INFO] Hive .............................................. SUCCESS [2.648s]
[INFO] Hive Ant Utilities ................................ SUCCESS [1.184s]
[INFO] Hive Shims Common ................................. SUCCESS [1.419s]
[INFO] Hive Shims 0.20 ................................... SUCCESS [0.739s]
[INFO] Hive Shims Secure Common .......................... SUCCESS [1.021s]
[INFO] Hive Shims 0.20S .................................. SUCCESS [0.796s]
[INFO] Hive Shims 0.23 ................................... SUCCESS [2.539s]
[INFO] Hive Shims ........................................ SUCCESS [0.415s]
[INFO] Hive Common ....................................... SUCCESS [4.014s]
[INFO] Hive Serde ........................................ SUCCESS [1.722s]
[INFO] Hive Metastore .................................... SUCCESS [2.513s]
[INFO] Hive Query Language ............................... SUCCESS [7.495s]
[INFO] Hive Service ...................................... FAILURE [2.921s]
[INFO] Hive JDBC ......................................... SKIPPED
[INFO] Hive Beeline ...................................... SKIPPED
[INFO] Hive CLI .......................................... SKIPPED
[INFO] Hive Contrib ...................................... SKIPPED
[INFO] Hive HBase Handler ................................ SKIPPED
[INFO] Hive HCatalog ..................................... SKIPPED
[INFO] Hive HCatalog Core ................................ SKIPPED
[INFO] Hive HCatalog Pig Adapter ......................... SKIPPED
[INFO] Hive HCatalog Server Extensions ................... SKIPPED
[INFO] Hive HCatalog Webhcat Java Client ................. SKIPPED
[INFO] Hive HCatalog Webhcat ............................. SKIPPED
[INFO] Hive HCatalog HBase Storage Handler ............... SKIPPED
[INFO] Hive HWI .......................................... SKIPPED
[INFO] Hive ODBC ......................................... SKIPPED
[INFO] Hive Shims Aggregator ............................. SKIPPED
[INFO] Hive TestUtils .................................... SKIPPED
[INFO] Hive Packaging .................................... SKIPPED
[INFO] ------------------------------------------------------------------------
[INFO] BUILD FAILURE
[INFO] ------------------------------------------------------------------------
[INFO] Total time: 31.330s
[INFO] Finished at: Mon Mar 17 00:05:57 HKT 2014
[INFO] Final Memory: 41M/236M
[INFO] ------------------------------------------------------------------------
[ERROR] Failed to execute goal on project hive-service: Could not resolve dependencies for
project org.apache.hive:hive-service:jar:0.13.0: Could not find artifact org.apache.hive:hive-exec:jar:tests:0.13.0
in datanucleus (http://www.datanucleus.org/downloads/maven2) -> [Help 1]
[ERROR] 
[ERROR] To see the full stack trace of the errors, re-run Maven with the -e switch.
[ERROR] Re-run Maven using the -X switch to enable full debug logging.
[ERROR] 
[ERROR] For more information about the errors and possible solutions, please read the following
articles:
[ERROR] [Help 1] http://cwiki.apache.org/confluence/display/MAVEN/DependencyResolutionException
[ERROR] 
[ERROR] After correcting the problems, you can resume the build with the command
[ERROR]   mvn <goals> -rf :hive-service


> Fix HS2 ResultSet Serialization Performance Regression
> ------------------------------------------------------
>
>                 Key: HIVE-3746
>                 URL: https://issues.apache.org/jira/browse/HIVE-3746
>             Project: Hive
>          Issue Type: Sub-task
>          Components: HiveServer2, Server Infrastructure
>            Reporter: Carl Steinbach
>            Assignee: Navis
>              Labels: HiveServer2, jdbc, thrift
>             Fix For: 0.13.0
>
>         Attachments: HIVE-3746.1.patch.txt, HIVE-3746.2.patch.txt, HIVE-3746.3.patch.txt,
HIVE-3746.4.patch.txt, HIVE-3746.5.patch.txt, HIVE-3746.6.patch.txt, HIVE-3746.7.patch.txt
>
>




--
This message was sent by Atlassian JIRA
(v6.2#6252)

Mime
View raw message