hive-dev mailing list archives

Site index · List index
Message view « Date » · « Thread »
Top « Date » · « Thread »
From "Hive QA (JIRA)" <j...@apache.org>
Subject [jira] [Commented] (HIVE-6339) Implement new JDK7 schema management APIs in java.sql.Connection
Date Thu, 13 Feb 2014 22:34:20 GMT

    [ https://issues.apache.org/jira/browse/HIVE-6339?page=com.atlassian.jira.plugin.system.issuetabpanels:comment-tabpanel&focusedCommentId=13900815#comment-13900815
] 

Hive QA commented on HIVE-6339:
-------------------------------



{color:red}Overall{color}: -1 no tests executed

Here are the results of testing the latest attachment:
https://issues.apache.org/jira/secure/attachment/12628843/HIVE-6339.1.patch

Test results: http://bigtop01.cloudera.org:8080/job/PreCommit-HIVE-Build/1316/testReport
Console output: http://bigtop01.cloudera.org:8080/job/PreCommit-HIVE-Build/1316/console

Messages:
{noformat}
**** This message was trimmed, see log for full details ****
[WARNING] JAR will be empty - no content was marked for inclusion!
[INFO] Building jar: /data/hive-ptest/working/apache-svn-trunk-source/itests/hcatalog-unit/target/hive-hcatalog-it-unit-0.13.0-SNAPSHOT.jar
[INFO] 
[INFO] --- maven-jar-plugin:2.2:test-jar (default) @ hive-hcatalog-it-unit ---
[INFO] Building jar: /data/hive-ptest/working/apache-svn-trunk-source/itests/hcatalog-unit/target/hive-hcatalog-it-unit-0.13.0-SNAPSHOT-tests.jar
[INFO] 
[INFO] --- maven-install-plugin:2.4:install (default-install) @ hive-hcatalog-it-unit ---
[INFO] Installing /data/hive-ptest/working/apache-svn-trunk-source/itests/hcatalog-unit/target/hive-hcatalog-it-unit-0.13.0-SNAPSHOT.jar
to /data/hive-ptest/working/maven/org/apache/hive/hive-hcatalog-it-unit/0.13.0-SNAPSHOT/hive-hcatalog-it-unit-0.13.0-SNAPSHOT.jar
[INFO] Installing /data/hive-ptest/working/apache-svn-trunk-source/itests/hcatalog-unit/pom.xml
to /data/hive-ptest/working/maven/org/apache/hive/hive-hcatalog-it-unit/0.13.0-SNAPSHOT/hive-hcatalog-it-unit-0.13.0-SNAPSHOT.pom
[INFO] Installing /data/hive-ptest/working/apache-svn-trunk-source/itests/hcatalog-unit/target/hive-hcatalog-it-unit-0.13.0-SNAPSHOT-tests.jar
to /data/hive-ptest/working/maven/org/apache/hive/hive-hcatalog-it-unit/0.13.0-SNAPSHOT/hive-hcatalog-it-unit-0.13.0-SNAPSHOT-tests.jar
[INFO]                                                                         
[INFO] ------------------------------------------------------------------------
[INFO] Building Hive Integration - Testing Utilities 0.13.0-SNAPSHOT
[INFO] ------------------------------------------------------------------------
[INFO] 
[INFO] --- maven-clean-plugin:2.5:clean (default-clean) @ hive-it-util ---
[INFO] Deleting /data/hive-ptest/working/apache-svn-trunk-source/itests/util (includes = [datanucleus.log,
derby.log], excludes = [])
[INFO] 
[INFO] --- maven-resources-plugin:2.5:resources (default-resources) @ hive-it-util ---
[debug] execute contextualize
[INFO] Using 'UTF-8' encoding to copy filtered resources.
[INFO] skip non existing resourceDirectory /data/hive-ptest/working/apache-svn-trunk-source/itests/util/src/main/resources
[INFO] 
[INFO] --- maven-antrun-plugin:1.7:run (define-classpath) @ hive-it-util ---
[INFO] Executing tasks

main:
[INFO] Executed tasks
[INFO] 
[INFO] --- maven-compiler-plugin:3.1:compile (default-compile) @ hive-it-util ---
[INFO] Compiling 41 source files to /data/hive-ptest/working/apache-svn-trunk-source/itests/util/target/classes
[WARNING] Note: Some input files use or override a deprecated API.
[WARNING] Note: Recompile with -Xlint:deprecation for details.
[INFO] 
[INFO] --- maven-resources-plugin:2.5:testResources (default-testResources) @ hive-it-util
---
[debug] execute contextualize
[INFO] Using 'UTF-8' encoding to copy filtered resources.
[INFO] skip non existing resourceDirectory /data/hive-ptest/working/apache-svn-trunk-source/itests/util/src/test/resources
[INFO] 
[INFO] --- maven-antrun-plugin:1.7:run (setup-test-dirs) @ hive-it-util ---
[INFO] Executing tasks

main:
    [mkdir] Created dir: /data/hive-ptest/working/apache-svn-trunk-source/itests/util/target/tmp
    [mkdir] Created dir: /data/hive-ptest/working/apache-svn-trunk-source/itests/util/target/warehouse
    [mkdir] Created dir: /data/hive-ptest/working/apache-svn-trunk-source/itests/util/target/tmp/conf
     [copy] Copying 5 files to /data/hive-ptest/working/apache-svn-trunk-source/itests/util/target/tmp/conf
[INFO] Executed tasks
[INFO] 
[INFO] --- maven-compiler-plugin:3.1:testCompile (default-testCompile) @ hive-it-util ---
[INFO] No sources to compile
[INFO] 
[INFO] --- maven-surefire-plugin:2.16:test (default-test) @ hive-it-util ---
[INFO] Tests are skipped.
[INFO] 
[INFO] --- maven-jar-plugin:2.2:jar (default-jar) @ hive-it-util ---
[INFO] Building jar: /data/hive-ptest/working/apache-svn-trunk-source/itests/util/target/hive-it-util-0.13.0-SNAPSHOT.jar
[INFO] 
[INFO] --- maven-install-plugin:2.4:install (default-install) @ hive-it-util ---
[INFO] Installing /data/hive-ptest/working/apache-svn-trunk-source/itests/util/target/hive-it-util-0.13.0-SNAPSHOT.jar
to /data/hive-ptest/working/maven/org/apache/hive/hive-it-util/0.13.0-SNAPSHOT/hive-it-util-0.13.0-SNAPSHOT.jar
[INFO] Installing /data/hive-ptest/working/apache-svn-trunk-source/itests/util/pom.xml to
/data/hive-ptest/working/maven/org/apache/hive/hive-it-util/0.13.0-SNAPSHOT/hive-it-util-0.13.0-SNAPSHOT.pom
[INFO]                                                                         
[INFO] ------------------------------------------------------------------------
[INFO] Building Hive Integration - Unit Tests 0.13.0-SNAPSHOT
[INFO] ------------------------------------------------------------------------
[INFO] 
[INFO] --- maven-clean-plugin:2.5:clean (default-clean) @ hive-it-unit ---
[INFO] Deleting /data/hive-ptest/working/apache-svn-trunk-source/itests/hive-unit (includes
= [datanucleus.log, derby.log], excludes = [])
[INFO] 
[INFO] --- maven-resources-plugin:2.5:resources (default-resources) @ hive-it-unit ---
[debug] execute contextualize
[INFO] Using 'UTF-8' encoding to copy filtered resources.
[INFO] skip non existing resourceDirectory /data/hive-ptest/working/apache-svn-trunk-source/itests/hive-unit/src/main/resources
[INFO] 
[INFO] --- maven-antrun-plugin:1.7:run (define-classpath) @ hive-it-unit ---
[INFO] Executing tasks

main:
[INFO] Executed tasks
[INFO] 
[INFO] --- maven-compiler-plugin:3.1:compile (default-compile) @ hive-it-unit ---
[INFO] No sources to compile
[INFO] 
[INFO] --- maven-resources-plugin:2.5:testResources (default-testResources) @ hive-it-unit
---
[debug] execute contextualize
[INFO] Using 'UTF-8' encoding to copy filtered resources.
[INFO] skip non existing resourceDirectory /data/hive-ptest/working/apache-svn-trunk-source/itests/hive-unit/src/test/resources
[INFO] 
[INFO] --- maven-antrun-plugin:1.7:run (setup-test-dirs) @ hive-it-unit ---
[INFO] Executing tasks

main:
    [mkdir] Created dir: /data/hive-ptest/working/apache-svn-trunk-source/itests/hive-unit/target/tmp
    [mkdir] Created dir: /data/hive-ptest/working/apache-svn-trunk-source/itests/hive-unit/target/warehouse
    [mkdir] Created dir: /data/hive-ptest/working/apache-svn-trunk-source/itests/hive-unit/target/tmp/conf
     [copy] Copying 5 files to /data/hive-ptest/working/apache-svn-trunk-source/itests/hive-unit/target/tmp/conf
[INFO] Executed tasks
[INFO] 
[INFO] --- maven-antrun-plugin:1.7:run (setup-metastore-scripts) @ hive-it-unit ---
[INFO] Executing tasks

main:
    [mkdir] Created dir: /data/hive-ptest/working/apache-svn-trunk-source/itests/hive-unit/target/tmp/scripts/metastore
     [copy] Copying 132 files to /data/hive-ptest/working/apache-svn-trunk-source/itests/hive-unit/target/tmp/scripts/metastore
[INFO] Executed tasks
[INFO] 
[INFO] --- maven-compiler-plugin:3.1:testCompile (default-testCompile) @ hive-it-unit ---
[INFO] Compiling 52 source files to /data/hive-ptest/working/apache-svn-trunk-source/itests/hive-unit/target/test-classes
[INFO] -------------------------------------------------------------
[WARNING] COMPILATION WARNING : 
[INFO] -------------------------------------------------------------
[WARNING] Note: Some input files use or override a deprecated API.
[WARNING] Note: Recompile with -Xlint:deprecation for details.
[WARNING] Note: Some input files use unchecked or unsafe operations.
[WARNING] Note: Recompile with -Xlint:unchecked for details.
[INFO] 4 warnings 
[INFO] -------------------------------------------------------------
[INFO] -------------------------------------------------------------
[ERROR] COMPILATION ERROR : 
[INFO] -------------------------------------------------------------
[ERROR] /data/hive-ptest/working/apache-svn-trunk-source/itests/hive-unit/src/test/java/org/apache/hive/jdbc/TestJdbcWithMiniHS2.java:[199,39]
cannot find symbol
symbol  : method getSchema()
location: interface java.sql.Connection
[ERROR] /data/hive-ptest/working/apache-svn-trunk-source/itests/hive-unit/src/test/java/org/apache/hive/jdbc/TestJdbcWithMiniHS2.java:[203,39]
cannot find symbol
symbol  : method getSchema()
location: interface java.sql.Connection
[ERROR] /data/hive-ptest/working/apache-svn-trunk-source/itests/hive-unit/src/test/java/org/apache/hive/jdbc/TestJdbcWithMiniHS2.java:[206,33]
cannot find symbol
symbol  : method getSchema()
location: interface java.sql.Connection
[ERROR] /data/hive-ptest/working/apache-svn-trunk-source/itests/hive-unit/src/test/java/org/apache/hive/jdbc/TestJdbcWithMiniHS2.java:[209,39]
cannot find symbol
symbol  : method getSchema()
location: interface java.sql.Connection
[ERROR] /data/hive-ptest/working/apache-svn-trunk-source/itests/hive-unit/src/test/java/org/apache/hive/jdbc/TestJdbcWithMiniHS2.java:[211,15]
cannot find symbol
symbol  : method setSchema(java.lang.String)
location: interface java.sql.Connection
[ERROR] /data/hive-ptest/working/apache-svn-trunk-source/itests/hive-unit/src/test/java/org/apache/hive/jdbc/TestJdbcWithMiniHS2.java:[212,33]
cannot find symbol
symbol  : method getSchema()
location: interface java.sql.Connection
[ERROR] /data/hive-ptest/working/apache-svn-trunk-source/itests/hive-unit/src/test/java/org/apache/hive/jdbc/TestJdbcWithMiniHS2.java:[213,15]
cannot find symbol
symbol  : method setSchema(java.lang.String)
location: interface java.sql.Connection
[ERROR] /data/hive-ptest/working/apache-svn-trunk-source/itests/hive-unit/src/test/java/org/apache/hive/jdbc/TestJdbcWithMiniHS2.java:[214,39]
cannot find symbol
symbol  : method getSchema()
location: interface java.sql.Connection
[INFO] 8 errors 
[INFO] -------------------------------------------------------------
[INFO] ------------------------------------------------------------------------
[INFO] Reactor Summary:
[INFO] 
[INFO] Hive Integration - Parent ......................... SUCCESS [3.737s]
[INFO] Hive Integration - Custom Serde ................... SUCCESS [8.719s]
[INFO] Hive Integration - HCatalog Unit Tests ............ SUCCESS [5.001s]
[INFO] Hive Integration - Testing Utilities .............. SUCCESS [4.647s]
[INFO] Hive Integration - Unit Tests ..................... FAILURE [7.001s]
[INFO] Hive Integration - Test Serde ..................... SKIPPED
[INFO] Hive Integration - QFile Tests .................... SKIPPED
[INFO] ------------------------------------------------------------------------
[INFO] BUILD FAILURE
[INFO] ------------------------------------------------------------------------
[INFO] Total time: 30.699s
[INFO] Finished at: Thu Feb 13 17:32:37 EST 2014
[INFO] Final Memory: 31M/85M
[INFO] ------------------------------------------------------------------------
[ERROR] Failed to execute goal org.apache.maven.plugins:maven-compiler-plugin:3.1:testCompile
(default-testCompile) on project hive-it-unit: Compilation failure: Compilation failure:
[ERROR] /data/hive-ptest/working/apache-svn-trunk-source/itests/hive-unit/src/test/java/org/apache/hive/jdbc/TestJdbcWithMiniHS2.java:[199,39]
cannot find symbol
[ERROR] symbol  : method getSchema()
[ERROR] location: interface java.sql.Connection
[ERROR] /data/hive-ptest/working/apache-svn-trunk-source/itests/hive-unit/src/test/java/org/apache/hive/jdbc/TestJdbcWithMiniHS2.java:[203,39]
cannot find symbol
[ERROR] symbol  : method getSchema()
[ERROR] location: interface java.sql.Connection
[ERROR] /data/hive-ptest/working/apache-svn-trunk-source/itests/hive-unit/src/test/java/org/apache/hive/jdbc/TestJdbcWithMiniHS2.java:[206,33]
cannot find symbol
[ERROR] symbol  : method getSchema()
[ERROR] location: interface java.sql.Connection
[ERROR] /data/hive-ptest/working/apache-svn-trunk-source/itests/hive-unit/src/test/java/org/apache/hive/jdbc/TestJdbcWithMiniHS2.java:[209,39]
cannot find symbol
[ERROR] symbol  : method getSchema()
[ERROR] location: interface java.sql.Connection
[ERROR] /data/hive-ptest/working/apache-svn-trunk-source/itests/hive-unit/src/test/java/org/apache/hive/jdbc/TestJdbcWithMiniHS2.java:[211,15]
cannot find symbol
[ERROR] symbol  : method setSchema(java.lang.String)
[ERROR] location: interface java.sql.Connection
[ERROR] /data/hive-ptest/working/apache-svn-trunk-source/itests/hive-unit/src/test/java/org/apache/hive/jdbc/TestJdbcWithMiniHS2.java:[212,33]
cannot find symbol
[ERROR] symbol  : method getSchema()
[ERROR] location: interface java.sql.Connection
[ERROR] /data/hive-ptest/working/apache-svn-trunk-source/itests/hive-unit/src/test/java/org/apache/hive/jdbc/TestJdbcWithMiniHS2.java:[213,15]
cannot find symbol
[ERROR] symbol  : method setSchema(java.lang.String)
[ERROR] location: interface java.sql.Connection
[ERROR] /data/hive-ptest/working/apache-svn-trunk-source/itests/hive-unit/src/test/java/org/apache/hive/jdbc/TestJdbcWithMiniHS2.java:[214,39]
cannot find symbol
[ERROR] symbol  : method getSchema()
[ERROR] location: interface java.sql.Connection
[ERROR] -> [Help 1]
[ERROR] 
[ERROR] To see the full stack trace of the errors, re-run Maven with the -e switch.
[ERROR] Re-run Maven using the -X switch to enable full debug logging.
[ERROR] 
[ERROR] For more information about the errors and possible solutions, please read the following
articles:
[ERROR] [Help 1] http://cwiki.apache.org/confluence/display/MAVEN/MojoFailureException
[ERROR] 
[ERROR] After correcting the problems, you can resume the build with the command
[ERROR]   mvn <goals> -rf :hive-it-unit
+ exit 1
'
{noformat}

This message is automatically generated.

ATTACHMENT ID: 12628843

> Implement new JDK7 schema management APIs in java.sql.Connection 
> -----------------------------------------------------------------
>
>                 Key: HIVE-6339
>                 URL: https://issues.apache.org/jira/browse/HIVE-6339
>             Project: Hive
>          Issue Type: Improvement
>          Components: JDBC
>    Affects Versions: 0.13.0
>            Reporter: Prasad Mujumdar
>            Assignee: Prasad Mujumdar
>         Attachments: HIVE-6339.1.patch
>
>
> JDK7 has added a few metadata methods in [java.sql.Conntion|http://docs.oracle.com/javase/7/docs/api/java/sql/Connection.html]

> {noformat}
> getSchema()
> setSchema()
> getCatalog()
> setCatalog()
> {noformat}
> Currently Hive JDBC just has stub implementation for all these methods throws unsupported
exception. This needs to be fixed.



--
This message was sent by Atlassian JIRA
(v6.1.5#6160)

Mime
View raw message