hive-dev mailing list archives

Site index · List index
Message view « Date » · « Thread »
Top « Date » · « Thread »
From "Hive QA (JIRA)" <j...@apache.org>
Subject [jira] [Commented] (HIVE-6037) Synchronize HiveConf with hive-default.xml.template and support show conf
Date Fri, 07 Feb 2014 11:43:19 GMT

    [ https://issues.apache.org/jira/browse/HIVE-6037?page=com.atlassian.jira.plugin.system.issuetabpanels:comment-tabpanel&focusedCommentId=13894433#comment-13894433
] 

Hive QA commented on HIVE-6037:
-------------------------------



{color:red}Overall{color}: -1 no tests executed

Here are the results of testing the latest attachment:
https://issues.apache.org/jira/secure/attachment/12627527/HIVE-6037.4.patch.txt

Test results: http://bigtop01.cloudera.org:8080/job/PreCommit-HIVE-Build/1233/testReport
Console output: http://bigtop01.cloudera.org:8080/job/PreCommit-HIVE-Build/1233/console

Messages:
{noformat}
**** This message was trimmed, see log for full details ****
[INFO] 
[INFO] --- maven-antrun-plugin:1.7:run (setup-test-dirs) @ hive-contrib ---
[INFO] Executing tasks

main:
    [mkdir] Created dir: /data/hive-ptest/working/apache-svn-trunk-source/contrib/target/tmp
    [mkdir] Created dir: /data/hive-ptest/working/apache-svn-trunk-source/contrib/target/warehouse
    [mkdir] Created dir: /data/hive-ptest/working/apache-svn-trunk-source/contrib/target/tmp/conf
     [copy] Copying 5 files to /data/hive-ptest/working/apache-svn-trunk-source/contrib/target/tmp/conf
[INFO] Executed tasks
[INFO] 
[INFO] --- maven-compiler-plugin:3.1:testCompile (default-testCompile) @ hive-contrib ---
[INFO] Compiling 2 source files to /data/hive-ptest/working/apache-svn-trunk-source/contrib/target/test-classes
[WARNING] Note: /data/hive-ptest/working/apache-svn-trunk-source/contrib/src/test/org/apache/hadoop/hive/contrib/serde2/TestRegexSerDe.java
uses or overrides a deprecated API.
[WARNING] Note: Recompile with -Xlint:deprecation for details.
[INFO] 
[INFO] --- maven-surefire-plugin:2.16:test (default-test) @ hive-contrib ---
[INFO] Tests are skipped.
[INFO] 
[INFO] --- maven-jar-plugin:2.2:jar (default-jar) @ hive-contrib ---
[INFO] Building jar: /data/hive-ptest/working/apache-svn-trunk-source/contrib/target/hive-contrib-0.13.0-SNAPSHOT.jar
[INFO] 
[INFO] --- maven-install-plugin:2.4:install (default-install) @ hive-contrib ---
[INFO] Installing /data/hive-ptest/working/apache-svn-trunk-source/contrib/target/hive-contrib-0.13.0-SNAPSHOT.jar
to /data/hive-ptest/working/maven/org/apache/hive/hive-contrib/0.13.0-SNAPSHOT/hive-contrib-0.13.0-SNAPSHOT.jar
[INFO] Installing /data/hive-ptest/working/apache-svn-trunk-source/contrib/pom.xml to /data/hive-ptest/working/maven/org/apache/hive/hive-contrib/0.13.0-SNAPSHOT/hive-contrib-0.13.0-SNAPSHOT.pom
[INFO]                                                                         
[INFO] ------------------------------------------------------------------------
[INFO] Building Hive HBase Handler 0.13.0-SNAPSHOT
[INFO] ------------------------------------------------------------------------
[INFO] 
[INFO] --- maven-clean-plugin:2.5:clean (default-clean) @ hive-hbase-handler ---
[INFO] Deleting /data/hive-ptest/working/apache-svn-trunk-source/hbase-handler (includes =
[datanucleus.log, derby.log], excludes = [])
[INFO] 
[INFO] --- maven-resources-plugin:2.5:resources (default-resources) @ hive-hbase-handler ---
[debug] execute contextualize
[INFO] Using 'UTF-8' encoding to copy filtered resources.
[INFO] skip non existing resourceDirectory /data/hive-ptest/working/apache-svn-trunk-source/hbase-handler/src/main/resources
[INFO] 
[INFO] --- maven-antrun-plugin:1.7:run (define-classpath) @ hive-hbase-handler ---
[INFO] Executing tasks

main:
[INFO] Executed tasks
[INFO] 
[INFO] --- maven-compiler-plugin:3.1:compile (default-compile) @ hive-hbase-handler ---
[INFO] Compiling 18 source files to /data/hive-ptest/working/apache-svn-trunk-source/hbase-handler/target/classes
[WARNING] Note: Some input files use or override a deprecated API.
[WARNING] Note: Recompile with -Xlint:deprecation for details.
[INFO] 
[INFO] --- maven-resources-plugin:2.5:testResources (default-testResources) @ hive-hbase-handler
---
[debug] execute contextualize
[INFO] Using 'UTF-8' encoding to copy filtered resources.
[INFO] skip non existing resourceDirectory /data/hive-ptest/working/apache-svn-trunk-source/hbase-handler/src/test/resources
[INFO] 
[INFO] --- maven-antrun-plugin:1.7:run (setup-test-dirs) @ hive-hbase-handler ---
[INFO] Executing tasks

main:
    [mkdir] Created dir: /data/hive-ptest/working/apache-svn-trunk-source/hbase-handler/target/tmp
    [mkdir] Created dir: /data/hive-ptest/working/apache-svn-trunk-source/hbase-handler/target/warehouse
    [mkdir] Created dir: /data/hive-ptest/working/apache-svn-trunk-source/hbase-handler/target/tmp/conf
     [copy] Copying 5 files to /data/hive-ptest/working/apache-svn-trunk-source/hbase-handler/target/tmp/conf
[INFO] Executed tasks
[INFO] 
[INFO] --- maven-compiler-plugin:3.1:testCompile (default-testCompile) @ hive-hbase-handler
---
[INFO] Compiling 4 source files to /data/hive-ptest/working/apache-svn-trunk-source/hbase-handler/target/test-classes
[WARNING] Note: Some input files use or override a deprecated API.
[WARNING] Note: Recompile with -Xlint:deprecation for details.
[INFO] 
[INFO] --- maven-surefire-plugin:2.16:test (default-test) @ hive-hbase-handler ---
[INFO] Tests are skipped.
[INFO] 
[INFO] --- maven-jar-plugin:2.2:jar (default-jar) @ hive-hbase-handler ---
[INFO] Building jar: /data/hive-ptest/working/apache-svn-trunk-source/hbase-handler/target/hive-hbase-handler-0.13.0-SNAPSHOT.jar
[INFO] 
[INFO] --- maven-install-plugin:2.4:install (default-install) @ hive-hbase-handler ---
[INFO] Installing /data/hive-ptest/working/apache-svn-trunk-source/hbase-handler/target/hive-hbase-handler-0.13.0-SNAPSHOT.jar
to /data/hive-ptest/working/maven/org/apache/hive/hive-hbase-handler/0.13.0-SNAPSHOT/hive-hbase-handler-0.13.0-SNAPSHOT.jar
[INFO] Installing /data/hive-ptest/working/apache-svn-trunk-source/hbase-handler/pom.xml to
/data/hive-ptest/working/maven/org/apache/hive/hive-hbase-handler/0.13.0-SNAPSHOT/hive-hbase-handler-0.13.0-SNAPSHOT.pom
[INFO]                                                                         
[INFO] ------------------------------------------------------------------------
[INFO] Building Hive HCatalog 0.13.0-SNAPSHOT
[INFO] ------------------------------------------------------------------------
[INFO] 
[INFO] --- maven-clean-plugin:2.5:clean (default-clean) @ hive-hcatalog ---
[INFO] Deleting /data/hive-ptest/working/apache-svn-trunk-source/hcatalog (includes = [datanucleus.log,
derby.log], excludes = [])
[INFO] 
[INFO] --- maven-antrun-plugin:1.7:run (define-classpath) @ hive-hcatalog ---
[INFO] Executing tasks

main:
[INFO] Executed tasks
[INFO] 
[INFO] --- maven-antrun-plugin:1.7:run (setup-test-dirs) @ hive-hcatalog ---
[INFO] Executing tasks

main:
    [mkdir] Created dir: /data/hive-ptest/working/apache-svn-trunk-source/hcatalog/target/tmp
    [mkdir] Created dir: /data/hive-ptest/working/apache-svn-trunk-source/hcatalog/target/warehouse
    [mkdir] Created dir: /data/hive-ptest/working/apache-svn-trunk-source/hcatalog/target/tmp/conf
     [copy] Copying 5 files to /data/hive-ptest/working/apache-svn-trunk-source/hcatalog/target/tmp/conf
[INFO] Executed tasks
[INFO] 
[INFO] --- maven-install-plugin:2.4:install (default-install) @ hive-hcatalog ---
[INFO] Installing /data/hive-ptest/working/apache-svn-trunk-source/hcatalog/pom.xml to /data/hive-ptest/working/maven/org/apache/hive/hcatalog/hive-hcatalog/0.13.0-SNAPSHOT/hive-hcatalog-0.13.0-SNAPSHOT.pom
[INFO]                                                                         
[INFO] ------------------------------------------------------------------------
[INFO] Building Hive HCatalog Core 0.13.0-SNAPSHOT
[INFO] ------------------------------------------------------------------------
[INFO] 
[INFO] --- maven-clean-plugin:2.5:clean (default-clean) @ hive-hcatalog-core ---
[INFO] Deleting /data/hive-ptest/working/apache-svn-trunk-source/hcatalog/core (includes =
[datanucleus.log, derby.log], excludes = [])
[INFO] 
[INFO] --- maven-resources-plugin:2.5:resources (default-resources) @ hive-hcatalog-core ---
[debug] execute contextualize
[INFO] Using 'UTF-8' encoding to copy filtered resources.
[INFO] skip non existing resourceDirectory /data/hive-ptest/working/apache-svn-trunk-source/hcatalog/core/src/main/resources
[INFO] 
[INFO] --- maven-antrun-plugin:1.7:run (define-classpath) @ hive-hcatalog-core ---
[INFO] Executing tasks

main:
[INFO] Executed tasks
[INFO] 
[INFO] --- maven-compiler-plugin:3.1:compile (default-compile) @ hive-hcatalog-core ---
[INFO] Compiling 146 source files to /data/hive-ptest/working/apache-svn-trunk-source/hcatalog/core/target/classes
[INFO] -------------------------------------------------------------
[WARNING] COMPILATION WARNING : 
[INFO] -------------------------------------------------------------
[WARNING] Note: Some input files use or override a deprecated API.
[WARNING] Note: Recompile with -Xlint:deprecation for details.
[WARNING] Note: Some input files use unchecked or unsafe operations.
[WARNING] Note: Recompile with -Xlint:unchecked for details.
[INFO] 4 warnings 
[INFO] -------------------------------------------------------------
[INFO] -------------------------------------------------------------
[ERROR] COMPILATION ERROR : 
[INFO] -------------------------------------------------------------
[ERROR] /data/hive-ptest/working/apache-svn-trunk-source/hcatalog/core/src/main/java/org/apache/hcatalog/mapreduce/FileOutputCommitterContainer.java:[569,59]
varname has private access in org.apache.hadoop.hive.conf.HiveConf.ConfVars
[ERROR] /data/hive-ptest/working/apache-svn-trunk-source/hcatalog/core/src/main/java/org/apache/hcatalog/mapreduce/FileRecordWriterContainer.java:[179,59]
varname has private access in org.apache.hadoop.hive.conf.HiveConf.ConfVars
[ERROR] /data/hive-ptest/working/apache-svn-trunk-source/hcatalog/core/src/main/java/org/apache/hive/hcatalog/mapreduce/FileRecordWriterContainer.java:[178,59]
varname has private access in org.apache.hadoop.hive.conf.HiveConf.ConfVars
[ERROR] /data/hive-ptest/working/apache-svn-trunk-source/hcatalog/core/src/main/java/org/apache/hive/hcatalog/mapreduce/FileOutputCommitterContainer.java:[573,59]
varname has private access in org.apache.hadoop.hive.conf.HiveConf.ConfVars
[INFO] 4 errors 
[INFO] -------------------------------------------------------------
[INFO] ------------------------------------------------------------------------
[INFO] Reactor Summary:
[INFO] 
[INFO] Hive .............................................. SUCCESS [4.707s]
[INFO] Hive Ant Utilities ................................ SUCCESS [6.981s]
[INFO] Hive Shims Common ................................. SUCCESS [3.314s]
[INFO] Hive Shims 0.20 ................................... SUCCESS [2.104s]
[INFO] Hive Shims Secure Common .......................... SUCCESS [2.572s]
[INFO] Hive Shims 0.20S .................................. SUCCESS [1.444s]
[INFO] Hive Shims 0.23 ................................... SUCCESS [3.331s]
[INFO] Hive Shims ........................................ SUCCESS [0.590s]
[INFO] Hive Common ....................................... SUCCESS [9.665s]
[INFO] Hive Serde ........................................ SUCCESS [8.200s]
[INFO] Hive Metastore .................................... SUCCESS [26.271s]
[INFO] Hive Query Language ............................... SUCCESS [1:03.893s]
[INFO] Hive Service ...................................... SUCCESS [7.514s]
[INFO] Hive JDBC ......................................... SUCCESS [2.003s]
[INFO] Hive Beeline ...................................... SUCCESS [0.797s]
[INFO] Hive CLI .......................................... SUCCESS [1.855s]
[INFO] Hive Contrib ...................................... SUCCESS [0.766s]
[INFO] Hive HBase Handler ................................ SUCCESS [1.979s]
[INFO] Hive HCatalog ..................................... SUCCESS [0.263s]
[INFO] Hive HCatalog Core ................................ FAILURE [2.107s]
[INFO] Hive HCatalog Pig Adapter ......................... SKIPPED
[INFO] Hive HCatalog Server Extensions ................... SKIPPED
[INFO] Hive HCatalog Webhcat Java Client ................. SKIPPED
[INFO] Hive HCatalog Webhcat ............................. SKIPPED
[INFO] Hive HCatalog HBase Storage Handler ............... SKIPPED
[INFO] Hive HWI .......................................... SKIPPED
[INFO] Hive ODBC ......................................... SKIPPED
[INFO] Hive Shims Aggregator ............................. SKIPPED
[INFO] Hive TestUtils .................................... SKIPPED
[INFO] Hive Packaging .................................... SKIPPED
[INFO] ------------------------------------------------------------------------
[INFO] BUILD FAILURE
[INFO] ------------------------------------------------------------------------
[INFO] Total time: 2:33.256s
[INFO] Finished at: Fri Feb 07 06:42:28 EST 2014
[INFO] Final Memory: 72M/473M
[INFO] ------------------------------------------------------------------------
[ERROR] Failed to execute goal org.apache.maven.plugins:maven-compiler-plugin:3.1:compile
(default-compile) on project hive-hcatalog-core: Compilation failure: Compilation failure:
[ERROR] /data/hive-ptest/working/apache-svn-trunk-source/hcatalog/core/src/main/java/org/apache/hcatalog/mapreduce/FileOutputCommitterContainer.java:[569,59]
varname has private access in org.apache.hadoop.hive.conf.HiveConf.ConfVars
[ERROR] /data/hive-ptest/working/apache-svn-trunk-source/hcatalog/core/src/main/java/org/apache/hcatalog/mapreduce/FileRecordWriterContainer.java:[179,59]
varname has private access in org.apache.hadoop.hive.conf.HiveConf.ConfVars
[ERROR] /data/hive-ptest/working/apache-svn-trunk-source/hcatalog/core/src/main/java/org/apache/hive/hcatalog/mapreduce/FileRecordWriterContainer.java:[178,59]
varname has private access in org.apache.hadoop.hive.conf.HiveConf.ConfVars
[ERROR] /data/hive-ptest/working/apache-svn-trunk-source/hcatalog/core/src/main/java/org/apache/hive/hcatalog/mapreduce/FileOutputCommitterContainer.java:[573,59]
varname has private access in org.apache.hadoop.hive.conf.HiveConf.ConfVars
[ERROR] -> [Help 1]
[ERROR] 
[ERROR] To see the full stack trace of the errors, re-run Maven with the -e switch.
[ERROR] Re-run Maven using the -X switch to enable full debug logging.
[ERROR] 
[ERROR] For more information about the errors and possible solutions, please read the following
articles:
[ERROR] [Help 1] http://cwiki.apache.org/confluence/display/MAVEN/MojoFailureException
[ERROR] 
[ERROR] After correcting the problems, you can resume the build with the command
[ERROR]   mvn <goals> -rf :hive-hcatalog-core
+ exit 1
'
{noformat}

This message is automatically generated.

ATTACHMENT ID: 12627527

> Synchronize HiveConf with hive-default.xml.template and support show conf
> -------------------------------------------------------------------------
>
>                 Key: HIVE-6037
>                 URL: https://issues.apache.org/jira/browse/HIVE-6037
>             Project: Hive
>          Issue Type: Improvement
>          Components: Configuration
>            Reporter: Navis
>            Assignee: Navis
>            Priority: Minor
>         Attachments: CHIVE-6037.3.patch.txt, HIVE-6037.1.patch.txt, HIVE-6037.2.patch.txt,
HIVE-6037.4.patch.txt
>
>
> see HIVE-5879



--
This message was sent by Atlassian JIRA
(v6.1.5#6160)

Mime
View raw message