hive-dev mailing list archives

Site index · List index
Message view « Date » · « Thread »
Top « Date » · « Thread »
From "Hive QA (JIRA)" <j...@apache.org>
Subject [jira] [Commented] (HIVE-6037) Synchronize HiveConf with hive-default.xml.template and support show conf
Date Sun, 09 Feb 2014 06:18:19 GMT

    [ https://issues.apache.org/jira/browse/HIVE-6037?page=com.atlassian.jira.plugin.system.issuetabpanels:comment-tabpanel&focusedCommentId=13895842#comment-13895842
] 

Hive QA commented on HIVE-6037:
-------------------------------



{color:red}Overall{color}: -1 no tests executed

Here are the results of testing the latest attachment:
https://issues.apache.org/jira/secure/attachment/12627850/HIVE-6037.5.patch.txt

Test results: http://bigtop01.cloudera.org:8080/job/PreCommit-HIVE-Build/1261/testReport
Console output: http://bigtop01.cloudera.org:8080/job/PreCommit-HIVE-Build/1261/console

Messages:
{noformat}
**** This message was trimmed, see log for full details ****
[INFO] ------------------------------------------------------------------------
[INFO] BUILD SUCCESS
[INFO] ------------------------------------------------------------------------
[INFO] Total time: 1:10.608s
[INFO] Finished at: Sun Feb 09 01:16:31 EST 2014
[INFO] Final Memory: 39M/93M
[INFO] ------------------------------------------------------------------------
+ cd itests
+ mvn -B clean install -DskipTests -Dmaven.repo.local=/data/hive-ptest/working/maven -Phadoop-1
[INFO] Scanning for projects...
[INFO] ------------------------------------------------------------------------
[INFO] Reactor Build Order:
[INFO] 
[INFO] Hive Integration - Parent
[INFO] Hive Integration - Custom Serde
[INFO] Hive Integration - HCatalog Unit Tests
[INFO] Hive Integration - Testing Utilities
[INFO] Hive Integration - Unit Tests
[INFO] Hive Integration - Test Serde
[INFO] Hive Integration - QFile Tests
[INFO]                                                                         
[INFO] ------------------------------------------------------------------------
[INFO] Building Hive Integration - Parent 0.13.0-SNAPSHOT
[INFO] ------------------------------------------------------------------------
[INFO] 
[INFO] --- maven-clean-plugin:2.5:clean (default-clean) @ hive-it ---
[INFO] Deleting /data/hive-ptest/working/apache-svn-trunk-source/itests (includes = [datanucleus.log,
derby.log], excludes = [])
[INFO] 
[INFO] --- maven-antrun-plugin:1.7:run (define-classpath) @ hive-it ---
[INFO] Executing tasks

main:
[INFO] Executed tasks
[INFO] 
[INFO] --- maven-antrun-plugin:1.7:run (setup-test-dirs) @ hive-it ---
[INFO] Executing tasks

main:
    [mkdir] Created dir: /data/hive-ptest/working/apache-svn-trunk-source/itests/target/tmp
    [mkdir] Created dir: /data/hive-ptest/working/apache-svn-trunk-source/itests/target/warehouse
    [mkdir] Created dir: /data/hive-ptest/working/apache-svn-trunk-source/itests/target/tmp/conf
     [copy] Copying 5 files to /data/hive-ptest/working/apache-svn-trunk-source/itests/target/tmp/conf
[INFO] Executed tasks
[INFO] 
[INFO] --- maven-install-plugin:2.4:install (default-install) @ hive-it ---
[INFO] Installing /data/hive-ptest/working/apache-svn-trunk-source/itests/pom.xml to /data/hive-ptest/working/maven/org/apache/hive/hive-it/0.13.0-SNAPSHOT/hive-it-0.13.0-SNAPSHOT.pom
[INFO]                                                                         
[INFO] ------------------------------------------------------------------------
[INFO] Building Hive Integration - Custom Serde 0.13.0-SNAPSHOT
[INFO] ------------------------------------------------------------------------
[INFO] 
[INFO] --- maven-clean-plugin:2.5:clean (default-clean) @ hive-it-custom-serde ---
[INFO] Deleting /data/hive-ptest/working/apache-svn-trunk-source/itests/custom-serde (includes
= [datanucleus.log, derby.log], excludes = [])
[INFO] 
[INFO] --- maven-resources-plugin:2.5:resources (default-resources) @ hive-it-custom-serde
---
[debug] execute contextualize
[INFO] Using 'UTF-8' encoding to copy filtered resources.
[INFO] skip non existing resourceDirectory /data/hive-ptest/working/apache-svn-trunk-source/itests/custom-serde/src/main/resources
[INFO] 
[INFO] --- maven-antrun-plugin:1.7:run (define-classpath) @ hive-it-custom-serde ---
[INFO] Executing tasks

main:
[INFO] Executed tasks
[INFO] 
[INFO] --- maven-compiler-plugin:3.1:compile (default-compile) @ hive-it-custom-serde ---
[INFO] Compiling 8 source files to /data/hive-ptest/working/apache-svn-trunk-source/itests/custom-serde/target/classes
[INFO] 
[INFO] --- maven-resources-plugin:2.5:testResources (default-testResources) @ hive-it-custom-serde
---
[debug] execute contextualize
[INFO] Using 'UTF-8' encoding to copy filtered resources.
[INFO] skip non existing resourceDirectory /data/hive-ptest/working/apache-svn-trunk-source/itests/custom-serde/src/test/resources
[INFO] 
[INFO] --- maven-antrun-plugin:1.7:run (setup-test-dirs) @ hive-it-custom-serde ---
[INFO] Executing tasks

main:
    [mkdir] Created dir: /data/hive-ptest/working/apache-svn-trunk-source/itests/custom-serde/target/tmp
    [mkdir] Created dir: /data/hive-ptest/working/apache-svn-trunk-source/itests/custom-serde/target/warehouse
    [mkdir] Created dir: /data/hive-ptest/working/apache-svn-trunk-source/itests/custom-serde/target/tmp/conf
     [copy] Copying 5 files to /data/hive-ptest/working/apache-svn-trunk-source/itests/custom-serde/target/tmp/conf
[INFO] Executed tasks
[INFO] 
[INFO] --- maven-compiler-plugin:3.1:testCompile (default-testCompile) @ hive-it-custom-serde
---
[INFO] No sources to compile
[INFO] 
[INFO] --- maven-surefire-plugin:2.16:test (default-test) @ hive-it-custom-serde ---
[INFO] Tests are skipped.
[INFO] 
[INFO] --- maven-jar-plugin:2.2:jar (default-jar) @ hive-it-custom-serde ---
[INFO] Building jar: /data/hive-ptest/working/apache-svn-trunk-source/itests/custom-serde/target/hive-it-custom-serde-0.13.0-SNAPSHOT.jar
[INFO] 
[INFO] --- maven-install-plugin:2.4:install (default-install) @ hive-it-custom-serde ---
[INFO] Installing /data/hive-ptest/working/apache-svn-trunk-source/itests/custom-serde/target/hive-it-custom-serde-0.13.0-SNAPSHOT.jar
to /data/hive-ptest/working/maven/org/apache/hive/hive-it-custom-serde/0.13.0-SNAPSHOT/hive-it-custom-serde-0.13.0-SNAPSHOT.jar
[INFO] Installing /data/hive-ptest/working/apache-svn-trunk-source/itests/custom-serde/pom.xml
to /data/hive-ptest/working/maven/org/apache/hive/hive-it-custom-serde/0.13.0-SNAPSHOT/hive-it-custom-serde-0.13.0-SNAPSHOT.pom
[INFO]                                                                         
[INFO] ------------------------------------------------------------------------
[INFO] Building Hive Integration - HCatalog Unit Tests 0.13.0-SNAPSHOT
[INFO] ------------------------------------------------------------------------
[INFO] 
[INFO] --- maven-clean-plugin:2.5:clean (default-clean) @ hive-hcatalog-it-unit ---
[INFO] Deleting /data/hive-ptest/working/apache-svn-trunk-source/itests/hcatalog-unit (includes
= [datanucleus.log, derby.log], excludes = [])
[INFO] 
[INFO] --- maven-resources-plugin:2.5:resources (default-resources) @ hive-hcatalog-it-unit
---
[debug] execute contextualize
[INFO] Using 'UTF-8' encoding to copy filtered resources.
[INFO] skip non existing resourceDirectory /data/hive-ptest/working/apache-svn-trunk-source/itests/hcatalog-unit/src/main/resources
[INFO] 
[INFO] --- maven-antrun-plugin:1.7:run (define-classpath) @ hive-hcatalog-it-unit ---
[INFO] Executing tasks

main:
[INFO] Executed tasks
[INFO] 
[INFO] --- maven-compiler-plugin:3.1:compile (default-compile) @ hive-hcatalog-it-unit ---
[INFO] No sources to compile
[INFO] 
[INFO] --- maven-resources-plugin:2.5:testResources (default-testResources) @ hive-hcatalog-it-unit
---
[debug] execute contextualize
[INFO] Using 'UTF-8' encoding to copy filtered resources.
[INFO] skip non existing resourceDirectory /data/hive-ptest/working/apache-svn-trunk-source/itests/hcatalog-unit/src/test/resources
[INFO] 
[INFO] --- maven-antrun-plugin:1.7:run (setup-test-dirs) @ hive-hcatalog-it-unit ---
[INFO] Executing tasks

main:
    [mkdir] Created dir: /data/hive-ptest/working/apache-svn-trunk-source/itests/hcatalog-unit/target/tmp
    [mkdir] Created dir: /data/hive-ptest/working/apache-svn-trunk-source/itests/hcatalog-unit/target/warehouse
    [mkdir] Created dir: /data/hive-ptest/working/apache-svn-trunk-source/itests/hcatalog-unit/target/tmp/conf
     [copy] Copying 5 files to /data/hive-ptest/working/apache-svn-trunk-source/itests/hcatalog-unit/target/tmp/conf
[INFO] Executed tasks
[INFO] 
[INFO] --- maven-compiler-plugin:3.1:testCompile (default-testCompile) @ hive-hcatalog-it-unit
---
[INFO] Compiling 7 source files to /data/hive-ptest/working/apache-svn-trunk-source/itests/hcatalog-unit/target/test-classes
[INFO] -------------------------------------------------------------
[WARNING] COMPILATION WARNING : 
[INFO] -------------------------------------------------------------
[WARNING] Note: Some input files use or override a deprecated API.
[WARNING] Note: Recompile with -Xlint:deprecation for details.
[INFO] 2 warnings 
[INFO] -------------------------------------------------------------
[INFO] -------------------------------------------------------------
[ERROR] COMPILATION ERROR : 
[INFO] -------------------------------------------------------------
[ERROR] /data/hive-ptest/working/apache-svn-trunk-source/itests/hcatalog-unit/src/test/java/org/apache/hive/hcatalog/hbase/TestPigHBaseStorageHandler.java:[77,60]
varname has private access in org.apache.hadoop.hive.conf.HiveConf.ConfVars
[ERROR] /data/hive-ptest/working/apache-svn-trunk-source/itests/hcatalog-unit/src/test/java/org/apache/hive/hcatalog/hbase/TestPigHBaseStorageHandler.java:[78,48]
varname has private access in org.apache.hadoop.hive.conf.HiveConf.ConfVars
[ERROR] /data/hive-ptest/working/apache-svn-trunk-source/itests/hcatalog-unit/src/test/java/org/apache/hive/hcatalog/hbase/TestPigHBaseStorageHandler.java:[79,49]
varname has private access in org.apache.hadoop.hive.conf.HiveConf.ConfVars
[ERROR] /data/hive-ptest/working/apache-svn-trunk-source/itests/hcatalog-unit/src/test/java/org/apache/hive/hcatalog/hbase/TestPigHBaseStorageHandler.java:[80,45]
varname has private access in org.apache.hadoop.hive.conf.HiveConf.ConfVars
[ERROR] /data/hive-ptest/working/apache-svn-trunk-source/itests/hcatalog-unit/src/test/java/org/apache/hive/hcatalog/mapreduce/TestSequenceFileReadWrite.java:[75,48]
varname has private access in org.apache.hadoop.hive.conf.HiveConf.ConfVars
[ERROR] /data/hive-ptest/working/apache-svn-trunk-source/itests/hcatalog-unit/src/test/java/org/apache/hive/hcatalog/mapreduce/TestSequenceFileReadWrite.java:[76,49]
varname has private access in org.apache.hadoop.hive.conf.HiveConf.ConfVars
[ERROR] /data/hive-ptest/working/apache-svn-trunk-source/itests/hcatalog-unit/src/test/java/org/apache/hive/hcatalog/mapreduce/TestSequenceFileReadWrite.java:[77,60]
varname has private access in org.apache.hadoop.hive.conf.HiveConf.ConfVars
[ERROR] /data/hive-ptest/working/apache-svn-trunk-source/itests/hcatalog-unit/src/test/java/org/apache/hive/hcatalog/mapreduce/TestSequenceFileReadWrite.java:[78,54]
varname has private access in org.apache.hadoop.hive.conf.HiveConf.ConfVars
[ERROR] /data/hive-ptest/working/apache-svn-trunk-source/itests/hcatalog-unit/src/test/java/org/apache/hcatalog/mapreduce/TestSequenceFileReadWrite.java:[77,48]
varname has private access in org.apache.hadoop.hive.conf.HiveConf.ConfVars
[ERROR] /data/hive-ptest/working/apache-svn-trunk-source/itests/hcatalog-unit/src/test/java/org/apache/hcatalog/mapreduce/TestSequenceFileReadWrite.java:[78,49]
varname has private access in org.apache.hadoop.hive.conf.HiveConf.ConfVars
[ERROR] /data/hive-ptest/working/apache-svn-trunk-source/itests/hcatalog-unit/src/test/java/org/apache/hcatalog/mapreduce/TestSequenceFileReadWrite.java:[79,60]
varname has private access in org.apache.hadoop.hive.conf.HiveConf.ConfVars
[ERROR] /data/hive-ptest/working/apache-svn-trunk-source/itests/hcatalog-unit/src/test/java/org/apache/hcatalog/mapreduce/TestSequenceFileReadWrite.java:[80,54]
varname has private access in org.apache.hadoop.hive.conf.HiveConf.ConfVars
[INFO] 12 errors 
[INFO] -------------------------------------------------------------
[INFO] ------------------------------------------------------------------------
[INFO] Reactor Summary:
[INFO] 
[INFO] Hive Integration - Parent ......................... SUCCESS [3.734s]
[INFO] Hive Integration - Custom Serde ................... SUCCESS [8.791s]
[INFO] Hive Integration - HCatalog Unit Tests ............ FAILURE [4.622s]
[INFO] Hive Integration - Testing Utilities .............. SKIPPED
[INFO] Hive Integration - Unit Tests ..................... SKIPPED
[INFO] Hive Integration - Test Serde ..................... SKIPPED
[INFO] Hive Integration - QFile Tests .................... SKIPPED
[INFO] ------------------------------------------------------------------------
[INFO] BUILD FAILURE
[INFO] ------------------------------------------------------------------------
[INFO] Total time: 18.754s
[INFO] Finished at: Sun Feb 09 01:16:53 EST 2014
[INFO] Final Memory: 27M/66M
[INFO] ------------------------------------------------------------------------
[ERROR] Failed to execute goal org.apache.maven.plugins:maven-compiler-plugin:3.1:testCompile
(default-testCompile) on project hive-hcatalog-it-unit: Compilation failure: Compilation failure:
[ERROR] /data/hive-ptest/working/apache-svn-trunk-source/itests/hcatalog-unit/src/test/java/org/apache/hive/hcatalog/hbase/TestPigHBaseStorageHandler.java:[77,60]
varname has private access in org.apache.hadoop.hive.conf.HiveConf.ConfVars
[ERROR] /data/hive-ptest/working/apache-svn-trunk-source/itests/hcatalog-unit/src/test/java/org/apache/hive/hcatalog/hbase/TestPigHBaseStorageHandler.java:[78,48]
varname has private access in org.apache.hadoop.hive.conf.HiveConf.ConfVars
[ERROR] /data/hive-ptest/working/apache-svn-trunk-source/itests/hcatalog-unit/src/test/java/org/apache/hive/hcatalog/hbase/TestPigHBaseStorageHandler.java:[79,49]
varname has private access in org.apache.hadoop.hive.conf.HiveConf.ConfVars
[ERROR] /data/hive-ptest/working/apache-svn-trunk-source/itests/hcatalog-unit/src/test/java/org/apache/hive/hcatalog/hbase/TestPigHBaseStorageHandler.java:[80,45]
varname has private access in org.apache.hadoop.hive.conf.HiveConf.ConfVars
[ERROR] /data/hive-ptest/working/apache-svn-trunk-source/itests/hcatalog-unit/src/test/java/org/apache/hive/hcatalog/mapreduce/TestSequenceFileReadWrite.java:[75,48]
varname has private access in org.apache.hadoop.hive.conf.HiveConf.ConfVars
[ERROR] /data/hive-ptest/working/apache-svn-trunk-source/itests/hcatalog-unit/src/test/java/org/apache/hive/hcatalog/mapreduce/TestSequenceFileReadWrite.java:[76,49]
varname has private access in org.apache.hadoop.hive.conf.HiveConf.ConfVars
[ERROR] /data/hive-ptest/working/apache-svn-trunk-source/itests/hcatalog-unit/src/test/java/org/apache/hive/hcatalog/mapreduce/TestSequenceFileReadWrite.java:[77,60]
varname has private access in org.apache.hadoop.hive.conf.HiveConf.ConfVars
[ERROR] /data/hive-ptest/working/apache-svn-trunk-source/itests/hcatalog-unit/src/test/java/org/apache/hive/hcatalog/mapreduce/TestSequenceFileReadWrite.java:[78,54]
varname has private access in org.apache.hadoop.hive.conf.HiveConf.ConfVars
[ERROR] /data/hive-ptest/working/apache-svn-trunk-source/itests/hcatalog-unit/src/test/java/org/apache/hcatalog/mapreduce/TestSequenceFileReadWrite.java:[77,48]
varname has private access in org.apache.hadoop.hive.conf.HiveConf.ConfVars
[ERROR] /data/hive-ptest/working/apache-svn-trunk-source/itests/hcatalog-unit/src/test/java/org/apache/hcatalog/mapreduce/TestSequenceFileReadWrite.java:[78,49]
varname has private access in org.apache.hadoop.hive.conf.HiveConf.ConfVars
[ERROR] /data/hive-ptest/working/apache-svn-trunk-source/itests/hcatalog-unit/src/test/java/org/apache/hcatalog/mapreduce/TestSequenceFileReadWrite.java:[79,60]
varname has private access in org.apache.hadoop.hive.conf.HiveConf.ConfVars
[ERROR] /data/hive-ptest/working/apache-svn-trunk-source/itests/hcatalog-unit/src/test/java/org/apache/hcatalog/mapreduce/TestSequenceFileReadWrite.java:[80,54]
varname has private access in org.apache.hadoop.hive.conf.HiveConf.ConfVars
[ERROR] -> [Help 1]
[ERROR] 
[ERROR] To see the full stack trace of the errors, re-run Maven with the -e switch.
[ERROR] Re-run Maven using the -X switch to enable full debug logging.
[ERROR] 
[ERROR] For more information about the errors and possible solutions, please read the following
articles:
[ERROR] [Help 1] http://cwiki.apache.org/confluence/display/MAVEN/MojoFailureException
[ERROR] 
[ERROR] After correcting the problems, you can resume the build with the command
[ERROR]   mvn <goals> -rf :hive-hcatalog-it-unit
+ exit 1
'
{noformat}

This message is automatically generated.

ATTACHMENT ID: 12627850

> Synchronize HiveConf with hive-default.xml.template and support show conf
> -------------------------------------------------------------------------
>
>                 Key: HIVE-6037
>                 URL: https://issues.apache.org/jira/browse/HIVE-6037
>             Project: Hive
>          Issue Type: Improvement
>          Components: Configuration
>            Reporter: Navis
>            Assignee: Navis
>            Priority: Minor
>         Attachments: CHIVE-6037.3.patch.txt, HIVE-6037.1.patch.txt, HIVE-6037.2.patch.txt,
HIVE-6037.4.patch.txt, HIVE-6037.5.patch.txt
>
>
> see HIVE-5879



--
This message was sent by Atlassian JIRA
(v6.1.5#6160)

Mime
View raw message