hive-dev mailing list archives

Site index · List index
Message view « Date » · « Thread »
Top « Date » · « Thread »
From "Hive QA (JIRA)" <j...@apache.org>
Subject [jira] [Commented] (HIVE-6297) [Refactor] Move new Auth Interface to common/
Date Mon, 27 Jan 2014 21:23:39 GMT

    [ https://issues.apache.org/jira/browse/HIVE-6297?page=com.atlassian.jira.plugin.system.issuetabpanels:comment-tabpanel&focusedCommentId=13883327#comment-13883327
] 

Hive QA commented on HIVE-6297:
-------------------------------



{color:red}Overall{color}: -1 no tests executed

Here are the results of testing the latest attachment:
https://issues.apache.org/jira/secure/attachment/12624945/HIVE-6297.patch

Test results: http://bigtop01.cloudera.org:8080/job/PreCommit-HIVE-Build/1048/testReport
Console output: http://bigtop01.cloudera.org:8080/job/PreCommit-HIVE-Build/1048/console

Messages:
{noformat}
**** This message was trimmed, see log for full details ****
As a result, alternative(s) 2 were disabled for that input
warning(200): IdentifiersParser.g:108:5: 
Decision can match input such as "KW_ORDER KW_BY LPAREN" using multiple alternatives: 1, 2

As a result, alternative(s) 2 were disabled for that input
warning(200): IdentifiersParser.g:121:5: 
Decision can match input such as "KW_CLUSTER KW_BY LPAREN" using multiple alternatives: 1,
2

As a result, alternative(s) 2 were disabled for that input
warning(200): IdentifiersParser.g:133:5: 
Decision can match input such as "KW_PARTITION KW_BY LPAREN" using multiple alternatives:
1, 2

As a result, alternative(s) 2 were disabled for that input
warning(200): IdentifiersParser.g:144:5: 
Decision can match input such as "KW_DISTRIBUTE KW_BY LPAREN" using multiple alternatives:
1, 2

As a result, alternative(s) 2 were disabled for that input
warning(200): IdentifiersParser.g:155:5: 
Decision can match input such as "KW_SORT KW_BY LPAREN" using multiple alternatives: 1, 2

As a result, alternative(s) 2 were disabled for that input
warning(200): IdentifiersParser.g:172:7: 
Decision can match input such as "STAR" using multiple alternatives: 1, 2

As a result, alternative(s) 2 were disabled for that input
warning(200): IdentifiersParser.g:185:5: 
Decision can match input such as "KW_STRUCT" using multiple alternatives: 4, 6

As a result, alternative(s) 6 were disabled for that input
warning(200): IdentifiersParser.g:185:5: 
Decision can match input such as "KW_ARRAY" using multiple alternatives: 2, 6

As a result, alternative(s) 6 were disabled for that input
warning(200): IdentifiersParser.g:185:5: 
Decision can match input such as "KW_UNIONTYPE" using multiple alternatives: 5, 6

As a result, alternative(s) 6 were disabled for that input
warning(200): IdentifiersParser.g:267:5: 
Decision can match input such as "KW_NULL" using multiple alternatives: 1, 8

As a result, alternative(s) 8 were disabled for that input
warning(200): IdentifiersParser.g:267:5: 
Decision can match input such as "KW_FALSE" using multiple alternatives: 3, 8

As a result, alternative(s) 8 were disabled for that input
warning(200): IdentifiersParser.g:267:5: 
Decision can match input such as "KW_TRUE" using multiple alternatives: 3, 8

As a result, alternative(s) 8 were disabled for that input
warning(200): IdentifiersParser.g:267:5: 
Decision can match input such as "KW_DATE StringLiteral" using multiple alternatives: 2, 3

As a result, alternative(s) 3 were disabled for that input
warning(200): IdentifiersParser.g:399:5: 
Decision can match input such as "{KW_LIKE, KW_REGEXP, KW_RLIKE} KW_ORDER KW_BY" using multiple
alternatives: 2, 9

As a result, alternative(s) 9 were disabled for that input
warning(200): IdentifiersParser.g:399:5: 
Decision can match input such as "KW_BETWEEN KW_MAP LPAREN" using multiple alternatives: 8,
9

As a result, alternative(s) 9 were disabled for that input
warning(200): IdentifiersParser.g:399:5: 
Decision can match input such as "{KW_LIKE, KW_REGEXP, KW_RLIKE} KW_INSERT KW_INTO" using
multiple alternatives: 2, 9

As a result, alternative(s) 9 were disabled for that input
warning(200): IdentifiersParser.g:399:5: 
Decision can match input such as "{KW_LIKE, KW_REGEXP, KW_RLIKE} KW_SORT KW_BY" using multiple
alternatives: 2, 9

As a result, alternative(s) 9 were disabled for that input
warning(200): IdentifiersParser.g:399:5: 
Decision can match input such as "{KW_LIKE, KW_REGEXP, KW_RLIKE} KW_LATERAL KW_VIEW" using
multiple alternatives: 2, 9

As a result, alternative(s) 9 were disabled for that input
warning(200): IdentifiersParser.g:399:5: 
Decision can match input such as "{KW_LIKE, KW_REGEXP, KW_RLIKE} KW_CLUSTER KW_BY" using multiple
alternatives: 2, 9

As a result, alternative(s) 9 were disabled for that input
warning(200): IdentifiersParser.g:399:5: 
Decision can match input such as "{KW_LIKE, KW_REGEXP, KW_RLIKE} KW_DISTRIBUTE KW_BY" using
multiple alternatives: 2, 9

As a result, alternative(s) 9 were disabled for that input
warning(200): IdentifiersParser.g:399:5: 
Decision can match input such as "{KW_LIKE, KW_REGEXP, KW_RLIKE} KW_GROUP KW_BY" using multiple
alternatives: 2, 9

As a result, alternative(s) 9 were disabled for that input
warning(200): IdentifiersParser.g:399:5: 
Decision can match input such as "{KW_LIKE, KW_REGEXP, KW_RLIKE} KW_MAP LPAREN" using multiple
alternatives: 2, 9

As a result, alternative(s) 9 were disabled for that input
warning(200): IdentifiersParser.g:399:5: 
Decision can match input such as "{KW_LIKE, KW_REGEXP, KW_RLIKE} KW_INSERT KW_OVERWRITE" using
multiple alternatives: 2, 9

As a result, alternative(s) 9 were disabled for that input
warning(200): IdentifiersParser.g:524:5: 
Decision can match input such as "{AMPERSAND..BITWISEXOR, DIV..DIVIDE, EQUAL..EQUAL_NS, GREATERTHAN..GREATERTHANOREQUALTO,
KW_AND, KW_ARRAY, KW_BETWEEN..KW_BOOLEAN, KW_CASE, KW_DOUBLE, KW_FLOAT, KW_IF, KW_IN, KW_INT,
KW_LIKE, KW_MAP, KW_NOT, KW_OR, KW_REGEXP, KW_RLIKE, KW_SMALLINT, KW_STRING..KW_STRUCT, KW_TINYINT,
KW_UNIONTYPE, KW_WHEN, LESSTHAN..LESSTHANOREQUALTO, MINUS..NOTEQUAL, PLUS, STAR, TILDE}" using
multiple alternatives: 1, 3

As a result, alternative(s) 3 were disabled for that input
[INFO] 
[INFO] --- maven-resources-plugin:2.5:resources (default-resources) @ hive-exec ---
[debug] execute contextualize
[INFO] Using 'UTF-8' encoding to copy filtered resources.
[INFO] Copying 1 resource
[INFO] 
[INFO] --- maven-antrun-plugin:1.7:run (define-classpath) @ hive-exec ---
[INFO] Executing tasks

main:
[INFO] Executed tasks
[INFO] 
[INFO] --- maven-compiler-plugin:3.1:compile (default-compile) @ hive-exec ---
[INFO] Compiling 1522 source files to /data/hive-ptest/working/apache-svn-trunk-source/ql/target/classes
[INFO] -------------------------------------------------------------
[WARNING] COMPILATION WARNING : 
[INFO] -------------------------------------------------------------
[WARNING] Note: Some input files use or override a deprecated API.
[WARNING] Note: Recompile with -Xlint:deprecation for details.
[WARNING] Note: Some input files use unchecked or unsafe operations.
[WARNING] Note: Recompile with -Xlint:unchecked for details.
[INFO] 4 warnings 
[INFO] -------------------------------------------------------------
[INFO] -------------------------------------------------------------
[ERROR] COMPILATION ERROR : 
[INFO] -------------------------------------------------------------
[ERROR] /data/hive-ptest/working/apache-svn-trunk-source/ql/src/java/org/apache/hadoop/hive/ql/ErrorMsg.java:[611,26]
cannot find symbol
symbol  : variable LINE_SEP
location: class org.apache.hadoop.hive.ql.metadata.HiveUtils
[ERROR] /data/hive-ptest/working/apache-svn-trunk-source/ql/src/java/org/apache/hadoop/hive/ql/ErrorMsg.java:[613,26]
cannot find symbol
symbol  : variable LINE_SEP
location: class org.apache.hadoop.hive.ql.metadata.HiveUtils
[ERROR] /data/hive-ptest/working/apache-svn-trunk-source/ql/src/java/org/apache/hadoop/hive/ql/security/authorization/plugin/DefaultHiveAuthorizerFactory.java:[24,8]
org.apache.hadoop.hive.ql.security.authorization.plugin.DefaultHiveAuthorizerFactory is not
abstract and does not override abstract method createHiveAuthorizer(org.apache.hadoop.hive.ql.security.authorization.plugin.HiveMetastoreClientFactory,org.apache.hadoop.hive.conf.HiveConf,java.lang.String)
in org.apache.hadoop.hive.ql.security.authorization.plugin.HiveAuthorizerFactory
[ERROR] /data/hive-ptest/working/apache-svn-trunk-source/ql/src/java/org/apache/hadoop/hive/ql/security/authorization/plugin/DefaultHiveAuthorizerFactory.java:[26,25]
createHiveAuthorizer(org.apache.hadoop.hive.ql.security.authorization.plugin.HiveMetastoreClientFactory,org.apache.hadoop.hive.conf.HiveConf,java.lang.String)
in org.apache.hadoop.hive.ql.security.authorization.plugin.DefaultHiveAuthorizerFactory cannot
implement createHiveAuthorizer(org.apache.hadoop.hive.ql.security.authorization.plugin.HiveMetastoreClientFactory,org.apache.hadoop.hive.conf.HiveConf,java.lang.String)
in org.apache.hadoop.hive.ql.security.authorization.plugin.HiveAuthorizerFactory; attempting
to use incompatible return type
found   : org.apache.hadoop.hive.ql.security.authorization.plugin.HiveAuthorizer
required: org.apache.hive.security.HiveAuthorizer
[ERROR] /data/hive-ptest/working/apache-svn-trunk-source/ql/src/java/org/apache/hadoop/hive/ql/security/authorization/plugin/DefaultHiveAuthorizerFactory.java:[25,3]
method does not override or implement a method from a supertype
[INFO] 5 errors 
[INFO] -------------------------------------------------------------
[INFO] ------------------------------------------------------------------------
[INFO] Reactor Summary:
[INFO] 
[INFO] Hive .............................................. SUCCESS [4.468s]
[INFO] Hive Ant Utilities ................................ SUCCESS [13.125s]
[INFO] Hive Shims Common ................................. SUCCESS [4.385s]
[INFO] Hive Shims 0.20 ................................... SUCCESS [3.425s]
[INFO] Hive Shims Secure Common .......................... SUCCESS [4.019s]
[INFO] Hive Shims 0.20S .................................. SUCCESS [1.931s]
[INFO] Hive Shims 0.23 ................................... SUCCESS [5.180s]
[INFO] Hive Shims ........................................ SUCCESS [0.653s]
[INFO] Hive Common ....................................... SUCCESS [23.234s]
[INFO] Hive Serde ........................................ SUCCESS [10.418s]
[INFO] Hive Metastore .................................... SUCCESS [26.454s]
[INFO] Hive Query Language ............................... FAILURE [39.583s]
[INFO] Hive Service ...................................... SKIPPED
[INFO] Hive JDBC ......................................... SKIPPED
[INFO] Hive Beeline ...................................... SKIPPED
[INFO] Hive CLI .......................................... SKIPPED
[INFO] Hive Contrib ...................................... SKIPPED
[INFO] Hive HBase Handler ................................ SKIPPED
[INFO] Hive HCatalog ..................................... SKIPPED
[INFO] Hive HCatalog Core ................................ SKIPPED
[INFO] Hive HCatalog Pig Adapter ......................... SKIPPED
[INFO] Hive HCatalog Server Extensions ................... SKIPPED
[INFO] Hive HCatalog Webhcat Java Client ................. SKIPPED
[INFO] Hive HCatalog Webhcat ............................. SKIPPED
[INFO] Hive HCatalog HBase Storage Handler ............... SKIPPED
[INFO] Hive HWI .......................................... SKIPPED
[INFO] Hive ODBC ......................................... SKIPPED
[INFO] Hive Shims Aggregator ............................. SKIPPED
[INFO] Hive TestUtils .................................... SKIPPED
[INFO] Hive Packaging .................................... SKIPPED
[INFO] ------------------------------------------------------------------------
[INFO] BUILD FAILURE
[INFO] ------------------------------------------------------------------------
[INFO] Total time: 2:20.130s
[INFO] Finished at: Mon Jan 27 16:22:36 EST 2014
[INFO] Final Memory: 46M/455M
[INFO] ------------------------------------------------------------------------
[ERROR] Failed to execute goal org.apache.maven.plugins:maven-compiler-plugin:3.1:compile
(default-compile) on project hive-exec: Compilation failure: Compilation failure:
[ERROR] /data/hive-ptest/working/apache-svn-trunk-source/ql/src/java/org/apache/hadoop/hive/ql/ErrorMsg.java:[611,26]
cannot find symbol
[ERROR] symbol  : variable LINE_SEP
[ERROR] location: class org.apache.hadoop.hive.ql.metadata.HiveUtils
[ERROR] /data/hive-ptest/working/apache-svn-trunk-source/ql/src/java/org/apache/hadoop/hive/ql/ErrorMsg.java:[613,26]
cannot find symbol
[ERROR] symbol  : variable LINE_SEP
[ERROR] location: class org.apache.hadoop.hive.ql.metadata.HiveUtils
[ERROR] /data/hive-ptest/working/apache-svn-trunk-source/ql/src/java/org/apache/hadoop/hive/ql/security/authorization/plugin/DefaultHiveAuthorizerFactory.java:[24,8]
org.apache.hadoop.hive.ql.security.authorization.plugin.DefaultHiveAuthorizerFactory is not
abstract and does not override abstract method createHiveAuthorizer(org.apache.hadoop.hive.ql.security.authorization.plugin.HiveMetastoreClientFactory,org.apache.hadoop.hive.conf.HiveConf,java.lang.String)
in org.apache.hadoop.hive.ql.security.authorization.plugin.HiveAuthorizerFactory
[ERROR] /data/hive-ptest/working/apache-svn-trunk-source/ql/src/java/org/apache/hadoop/hive/ql/security/authorization/plugin/DefaultHiveAuthorizerFactory.java:[26,25]
createHiveAuthorizer(org.apache.hadoop.hive.ql.security.authorization.plugin.HiveMetastoreClientFactory,org.apache.hadoop.hive.conf.HiveConf,java.lang.String)
in org.apache.hadoop.hive.ql.security.authorization.plugin.DefaultHiveAuthorizerFactory cannot
implement createHiveAuthorizer(org.apache.hadoop.hive.ql.security.authorization.plugin.HiveMetastoreClientFactory,org.apache.hadoop.hive.conf.HiveConf,java.lang.String)
in org.apache.hadoop.hive.ql.security.authorization.plugin.HiveAuthorizerFactory; attempting
to use incompatible return type
[ERROR] found   : org.apache.hadoop.hive.ql.security.authorization.plugin.HiveAuthorizer
[ERROR] required: org.apache.hive.security.HiveAuthorizer
[ERROR] /data/hive-ptest/working/apache-svn-trunk-source/ql/src/java/org/apache/hadoop/hive/ql/security/authorization/plugin/DefaultHiveAuthorizerFactory.java:[25,3]
method does not override or implement a method from a supertype
[ERROR] -> [Help 1]
[ERROR] 
[ERROR] To see the full stack trace of the errors, re-run Maven with the -e switch.
[ERROR] Re-run Maven using the -X switch to enable full debug logging.
[ERROR] 
[ERROR] For more information about the errors and possible solutions, please read the following
articles:
[ERROR] [Help 1] http://cwiki.apache.org/confluence/display/MAVEN/MojoFailureException
[ERROR] 
[ERROR] After correcting the problems, you can resume the build with the command
[ERROR]   mvn <goals> -rf :hive-exec
+ exit 1
'
{noformat}

This message is automatically generated.

ATTACHMENT ID: 12624945

> [Refactor] Move new Auth Interface to common/ 
> ----------------------------------------------
>
>                 Key: HIVE-6297
>                 URL: https://issues.apache.org/jira/browse/HIVE-6297
>             Project: Hive
>          Issue Type: Task
>          Components: Security
>            Reporter: Ashutosh Chauhan
>            Assignee: Ashutosh Chauhan
>         Attachments: HIVE-6297.patch
>
>




--
This message was sent by Atlassian JIRA
(v6.1.5#6160)

Mime
View raw message