hive-dev mailing list archives

Site index · List index
Message view « Date » · « Thread »
Top « Date » · « Thread »
From "Hive QA (JIRA)" <j...@apache.org>
Subject [jira] [Commented] (HIVE-6246) Sign(a) UDF is not supported for decimal type
Date Tue, 28 Jan 2014 05:30:39 GMT

    [ https://issues.apache.org/jira/browse/HIVE-6246?page=com.atlassian.jira.plugin.system.issuetabpanels:comment-tabpanel&focusedCommentId=13883778#comment-13883778
] 

Hive QA commented on HIVE-6246:
-------------------------------



{color:red}Overall{color}: -1 at least one tests failed

Here are the results of testing the latest attachment:
https://issues.apache.org/jira/secure/attachment/12625450/HIVE-6246.1.patch

{color:red}ERROR:{color} -1 due to 3 failed/errored test(s), 4962 tests executed
*Failed tests:*
{noformat}
org.apache.hadoop.hive.cli.TestMinimrCliDriver.testCliDriver_import_exported_table
org.apache.hadoop.hive.cli.TestMinimrCliDriver.testCliDriver_load_hdfs_file_with_space_in_the_name
org.apache.hadoop.hive.cli.TestNegativeMinimrCliDriver.testNegativeCliDriver_file_with_header_footer_negative
{noformat}

Test results: http://bigtop01.cloudera.org:8080/job/PreCommit-HIVE-Build/1052/testReport
Console output: http://bigtop01.cloudera.org:8080/job/PreCommit-HIVE-Build/1052/console

Messages:
{noformat}
Executing org.apache.hive.ptest.execution.PrepPhase
Executing org.apache.hive.ptest.execution.ExecutionPhase
Executing org.apache.hive.ptest.execution.ReportingPhase
Tests exited with: TestsFailedException: 3 tests failed
{noformat}

This message is automatically generated.

ATTACHMENT ID: 12625450

> Sign(a) UDF is not supported for decimal type
> ---------------------------------------------
>
>                 Key: HIVE-6246
>                 URL: https://issues.apache.org/jira/browse/HIVE-6246
>             Project: Hive
>          Issue Type: Bug
>          Components: UDF
>    Affects Versions: 0.12.0
>            Reporter: Xuefu Zhang
>            Assignee: Xuefu Zhang
>         Attachments: HIVE-6246.1.patch, HIVE-6246.1.patch, HIVE-6246.patch
>
>
> java.sql.SQLException: Error while compiling statement: FAILED: SemanticException [Error
10014]: Line 1:86 Wrong arguments 'a': No matching method for class org.apache.hadoop.hive.ql.udf.UDFSign
with (decimal(38,10)). Possible choices: _FUNC_(double)



--
This message was sent by Atlassian JIRA
(v6.1.5#6160)

Mime
View raw message