hive-dev mailing list archives

Site index · List index
Message view « Date » · « Thread »
Top « Date » · « Thread »
From "Hive QA (JIRA)" <j...@apache.org>
Subject [jira] [Commented] (HIVE-5722) Skip generating vectorization code if possible
Date Thu, 07 Nov 2013 17:25:18 GMT

    [ https://issues.apache.org/jira/browse/HIVE-5722?page=com.atlassian.jira.plugin.system.issuetabpanels:comment-tabpanel&focusedCommentId=13816150#comment-13816150 ] 

Hive QA commented on HIVE-5722:
-------------------------------



{color:red}Overall{color}: -1 no tests executed

Here are the results of testing the latest attachment:
https://issues.apache.org/jira/secure/attachment/12612535/D13941.1.patch

Test results: http://bigtop01.cloudera.org:8080/job/PreCommit-HIVE-Build/178/testReport
Console output: http://bigtop01.cloudera.org:8080/job/PreCommit-HIVE-Build/178/console

Messages:
{noformat}
Executing org.apache.hive.ptest.execution.PrepPhase
Tests failed with: NonZeroExitCodeException: Command 'bash /data/hive-ptest/working/scratch/source-prep.sh' failed with exit status 1 and output '+ [[ -n '' ]]
+ export 'ANT_OPTS=-Xmx1g -XX:MaxPermSize=256m -Dhttp.proxyHost=localhost -Dhttp.proxyPort=3128'
+ ANT_OPTS='-Xmx1g -XX:MaxPermSize=256m -Dhttp.proxyHost=localhost -Dhttp.proxyPort=3128'
+ export 'M2_OPTS=-Xmx1g -XX:MaxPermSize=256m -Dhttp.proxyHost=localhost -Dhttp.proxyPort=3128'
+ M2_OPTS='-Xmx1g -XX:MaxPermSize=256m -Dhttp.proxyHost=localhost -Dhttp.proxyPort=3128'
+ cd /data/hive-ptest/working/
+ tee /data/hive-ptest/logs/PreCommit-HIVE-Build-178/source-prep.txt
+ [[ false == \t\r\u\e ]]
+ mkdir -p maven ivy
+ [[ svn = \s\v\n ]]
+ [[ -n '' ]]
+ [[ -d apache-svn-trunk-source ]]
+ [[ ! -d apache-svn-trunk-source/.svn ]]
+ [[ ! -d apache-svn-trunk-source ]]
+ cd apache-svn-trunk-source
+ svn revert -R .
Reverted 'beeline/src/java/org/apache/hive/beeline/BeeLine.java'
Reverted 'beeline/src/java/org/apache/hive/beeline/Commands.java'
Reverted 'beeline/src/main/resources/BeeLine.properties'
++ awk '{print $2}'
++ egrep -v '^X|^Performing status on external'
++ svn status --no-ignore
+ rm -rf target datanucleus.log ant/target shims/0.20/target shims/assembly/target shims/0.20S/target shims/0.23/target shims/common/target shims/common-secure/target metastore/target common/target common/src/gen serde/target beeline/src/java/org/apache/hive/beeline/Commands.java.orig
+ svn update

Fetching external item into 'hcatalog/src/test/e2e/harness'
External at revision 1539724.

At revision 1539724.
+ patchCommandPath=/data/hive-ptest/working/scratch/smart-apply-patch.sh
+ patchFilePath=/data/hive-ptest/working/scratch/build.patch
+ [[ -f /data/hive-ptest/working/scratch/build.patch ]]
+ chmod +x /data/hive-ptest/working/scratch/smart-apply-patch.sh
+ /data/hive-ptest/working/scratch/smart-apply-patch.sh /data/hive-ptest/working/scratch/build.patch
Going to apply patch with: patch -p0
patching file ant/src/org/apache/hadoop/hive/ant/GenVectorCode.java
patching file ant/src/org/apache/hadoop/hive/ant/GenVectorTestCode.java
+ [[ maven == \m\a\v\e\n ]]
+ rm -rf /data/hive-ptest/working/maven/org/apache/hive
+ mvn -B clean install -DskipTests -Dmaven.repo.local=/data/hive-ptest/working/maven
[INFO] Scanning for projects...
[INFO] ------------------------------------------------------------------------
[INFO] Reactor Build Order:
[INFO] 
[INFO] Hive
[INFO] Hive Ant Utilities
[INFO] Hive Shims Common
[INFO] Hive Shims 0.20
[INFO] Hive Shims Secure Common
[INFO] Hive Shims 0.20S
[INFO] Hive Shims 0.23
[INFO] Hive Shims
[INFO] Hive Common
[INFO] Hive Serde
[INFO] Hive Metastore
[INFO] Hive Query Language
[INFO] Hive Service
[INFO] Hive JDBC
[INFO] Hive Beeline
[INFO] Hive CLI
[INFO] Hive Contrib
[INFO] Hive HBase Handler
[INFO] Hive HCatalog
[INFO] Hive HCatalog Core
[INFO] Hive HCatalog Pig Adapter
[INFO] Hive HCatalog Server Extensions
[INFO] Hive HCatalog Webhcat Java Client
[INFO] Hive HCatalog Webhcat
[INFO] Hive HCatalog HBase Storage Handler
[INFO] Hive HWI
[INFO] Hive ODBC
[INFO] Hive Shims Aggregator
[INFO] Hive TestUtils
[INFO] Hive Packaging
[INFO]                                                                         
[INFO] ------------------------------------------------------------------------
[INFO] Building Hive 0.13.0-SNAPSHOT
[INFO] ------------------------------------------------------------------------
[INFO] 
[INFO] --- maven-clean-plugin:2.5:clean (default-clean) @ hive ---
[INFO] Deleting /data/hive-ptest/working/apache-svn-trunk-source (includes = [datanucleus.log, derby.log], excludes = [])
[INFO] 
[INFO] --- maven-antrun-plugin:1.7:run (define-classpath) @ hive ---
[INFO] Executing tasks

main:
[INFO] Executed tasks
[INFO] 
[INFO] --- maven-antrun-plugin:1.7:run (setup-test-dirs) @ hive ---
[INFO] Executing tasks

main:
    [mkdir] Created dir: /data/hive-ptest/working/apache-svn-trunk-source/target/tmp
    [mkdir] Created dir: /data/hive-ptest/working/apache-svn-trunk-source/target/warehouse
    [mkdir] Created dir: /data/hive-ptest/working/apache-svn-trunk-source/target/tmp/conf
     [copy] Copying 4 files to /data/hive-ptest/working/apache-svn-trunk-source/target/tmp/conf
[INFO] Executed tasks
[INFO] 
[INFO] --- maven-install-plugin:2.4:install (default-install) @ hive ---
[INFO] Installing /data/hive-ptest/working/apache-svn-trunk-source/pom.xml to /data/hive-ptest/working/maven/org/apache/hive/hive/0.13.0-SNAPSHOT/hive-0.13.0-SNAPSHOT.pom
[INFO]                                                                         
[INFO] ------------------------------------------------------------------------
[INFO] Building Hive Ant Utilities 0.13.0-SNAPSHOT
[INFO] ------------------------------------------------------------------------
[INFO] 
[INFO] --- maven-clean-plugin:2.5:clean (default-clean) @ hive-ant ---
[INFO] Deleting /data/hive-ptest/working/apache-svn-trunk-source/ant (includes = [datanucleus.log, derby.log], excludes = [])
[INFO] 
[INFO] --- maven-resources-plugin:2.5:resources (default-resources) @ hive-ant ---
[debug] execute contextualize
[INFO] Using 'UTF-8' encoding to copy filtered resources.
[INFO] skip non existing resourceDirectory /data/hive-ptest/working/apache-svn-trunk-source/ant/src/main/resources
[INFO] 
[INFO] --- maven-antrun-plugin:1.7:run (define-classpath) @ hive-ant ---
[INFO] Executing tasks

main:
[INFO] Executed tasks
[INFO] 
[INFO] --- maven-compiler-plugin:3.1:compile (default-compile) @ hive-ant ---
[INFO] Compiling 5 source files to /data/hive-ptest/working/apache-svn-trunk-source/ant/target/classes
[WARNING] Note: /data/hive-ptest/working/apache-svn-trunk-source/ant/src/org/apache/hadoop/hive/ant/QTestGenTask.java uses or overrides a deprecated API.
[WARNING] Note: Recompile with -Xlint:deprecation for details.
[WARNING] Note: /data/hive-ptest/working/apache-svn-trunk-source/ant/src/org/apache/hadoop/hive/ant/DistinctElementsClassPath.java uses unchecked or unsafe operations.
[WARNING] Note: Recompile with -Xlint:unchecked for details.
[INFO] 
[INFO] --- maven-resources-plugin:2.5:testResources (default-testResources) @ hive-ant ---
[debug] execute contextualize
[INFO] Using 'UTF-8' encoding to copy filtered resources.
[INFO] skip non existing resourceDirectory /data/hive-ptest/working/apache-svn-trunk-source/ant/src/test/resources
[INFO] 
[INFO] --- maven-antrun-plugin:1.7:run (setup-test-dirs) @ hive-ant ---
[INFO] Executing tasks

main:
    [mkdir] Created dir: /data/hive-ptest/working/apache-svn-trunk-source/ant/target/tmp
    [mkdir] Created dir: /data/hive-ptest/working/apache-svn-trunk-source/ant/target/warehouse
    [mkdir] Created dir: /data/hive-ptest/working/apache-svn-trunk-source/ant/target/tmp/conf
     [copy] Copying 4 files to /data/hive-ptest/working/apache-svn-trunk-source/ant/target/tmp/conf
[INFO] Executed tasks
[INFO] 
[INFO] --- maven-compiler-plugin:3.1:testCompile (default-testCompile) @ hive-ant ---
[INFO] No sources to compile
[INFO] 
[INFO] --- maven-surefire-plugin:2.16:test (default-test) @ hive-ant ---
[INFO] Tests are skipped.
[INFO] 
[INFO] --- maven-jar-plugin:2.2:jar (default-jar) @ hive-ant ---
[INFO] Building jar: /data/hive-ptest/working/apache-svn-trunk-source/ant/target/hive-ant-0.13.0-SNAPSHOT.jar
[INFO] 
[INFO] --- maven-install-plugin:2.4:install (default-install) @ hive-ant ---
[INFO] Installing /data/hive-ptest/working/apache-svn-trunk-source/ant/target/hive-ant-0.13.0-SNAPSHOT.jar to /data/hive-ptest/working/maven/org/apache/hive/hive-ant/0.13.0-SNAPSHOT/hive-ant-0.13.0-SNAPSHOT.jar
[INFO] Installing /data/hive-ptest/working/apache-svn-trunk-source/ant/pom.xml to /data/hive-ptest/working/maven/org/apache/hive/hive-ant/0.13.0-SNAPSHOT/hive-ant-0.13.0-SNAPSHOT.pom
[INFO]                                                                         
[INFO] ------------------------------------------------------------------------
[INFO] Building Hive Shims Common 0.13.0-SNAPSHOT
[INFO] ------------------------------------------------------------------------
[INFO] 
[INFO] --- maven-clean-plugin:2.5:clean (default-clean) @ hive-shims-common ---
[INFO] Deleting /data/hive-ptest/working/apache-svn-trunk-source/shims/common (includes = [datanucleus.log, derby.log], excludes = [])
[INFO] 
[INFO] --- maven-resources-plugin:2.5:resources (default-resources) @ hive-shims-common ---
[debug] execute contextualize
[INFO] Using 'UTF-8' encoding to copy filtered resources.
[INFO] skip non existing resourceDirectory /data/hive-ptest/working/apache-svn-trunk-source/shims/common/src/main/resources
[INFO] 
[INFO] --- maven-antrun-plugin:1.7:run (define-classpath) @ hive-shims-common ---
[INFO] Executing tasks

main:
[INFO] Executed tasks
[INFO] 
[INFO] --- maven-compiler-plugin:3.1:compile (default-compile) @ hive-shims-common ---
[INFO] Compiling 15 source files to /data/hive-ptest/working/apache-svn-trunk-source/shims/common/target/classes
[WARNING] Note: Some input files use or override a deprecated API.
[WARNING] Note: Recompile with -Xlint:deprecation for details.
[INFO] 
[INFO] --- maven-resources-plugin:2.5:testResources (default-testResources) @ hive-shims-common ---
[debug] execute contextualize
[INFO] Using 'UTF-8' encoding to copy filtered resources.
[INFO] skip non existing resourceDirectory /data/hive-ptest/working/apache-svn-trunk-source/shims/common/src/test/resources
[INFO] 
[INFO] --- maven-antrun-plugin:1.7:run (setup-test-dirs) @ hive-shims-common ---
[INFO] Executing tasks

main:
    [mkdir] Created dir: /data/hive-ptest/working/apache-svn-trunk-source/shims/common/target/tmp
    [mkdir] Created dir: /data/hive-ptest/working/apache-svn-trunk-source/shims/common/target/warehouse
    [mkdir] Created dir: /data/hive-ptest/working/apache-svn-trunk-source/shims/common/target/tmp/conf
     [copy] Copying 4 files to /data/hive-ptest/working/apache-svn-trunk-source/shims/common/target/tmp/conf
[INFO] Executed tasks
[INFO] 
[INFO] --- maven-compiler-plugin:3.1:testCompile (default-testCompile) @ hive-shims-common ---
[INFO] No sources to compile
[INFO] 
[INFO] --- maven-surefire-plugin:2.16:test (default-test) @ hive-shims-common ---
[INFO] Tests are skipped.
[INFO] 
[INFO] --- maven-jar-plugin:2.2:jar (default-jar) @ hive-shims-common ---
[INFO] Building jar: /data/hive-ptest/working/apache-svn-trunk-source/shims/common/target/hive-shims-common-0.13.0-SNAPSHOT.jar
[INFO] 
[INFO] --- maven-install-plugin:2.4:install (default-install) @ hive-shims-common ---
[INFO] Installing /data/hive-ptest/working/apache-svn-trunk-source/shims/common/target/hive-shims-common-0.13.0-SNAPSHOT.jar to /data/hive-ptest/working/maven/org/apache/hive/shims/hive-shims-common/0.13.0-SNAPSHOT/hive-shims-common-0.13.0-SNAPSHOT.jar
[INFO] Installing /data/hive-ptest/working/apache-svn-trunk-source/shims/common/pom.xml to /data/hive-ptest/working/maven/org/apache/hive/shims/hive-shims-common/0.13.0-SNAPSHOT/hive-shims-common-0.13.0-SNAPSHOT.pom
[INFO]                                                                         
[INFO] ------------------------------------------------------------------------
[INFO] Building Hive Shims 0.20 0.13.0-SNAPSHOT
[INFO] ------------------------------------------------------------------------
[INFO] 
[INFO] --- maven-clean-plugin:2.5:clean (default-clean) @ hive-shims-0.20 ---
[INFO] Deleting /data/hive-ptest/working/apache-svn-trunk-source/shims/0.20 (includes = [datanucleus.log, derby.log], excludes = [])
[INFO] 
[INFO] --- maven-resources-plugin:2.5:resources (default-resources) @ hive-shims-0.20 ---
[debug] execute contextualize
[INFO] Using 'UTF-8' encoding to copy filtered resources.
[INFO] skip non existing resourceDirectory /data/hive-ptest/working/apache-svn-trunk-source/shims/0.20/src/main/resources
[INFO] 
[INFO] --- maven-antrun-plugin:1.7:run (define-classpath) @ hive-shims-0.20 ---
[INFO] Executing tasks

main:
[INFO] Executed tasks
[INFO] 
[INFO] --- maven-compiler-plugin:3.1:compile (default-compile) @ hive-shims-0.20 ---
[INFO] Compiling 2 source files to /data/hive-ptest/working/apache-svn-trunk-source/shims/0.20/target/classes
[WARNING] Note: /data/hive-ptest/working/apache-svn-trunk-source/shims/0.20/src/main/java/org/apache/hadoop/hive/shims/Hadoop20Shims.java uses or overrides a deprecated API.
[WARNING] Note: Recompile with -Xlint:deprecation for details.
[WARNING] Note: /data/hive-ptest/working/apache-svn-trunk-source/shims/0.20/src/main/java/org/apache/hadoop/hive/shims/Hadoop20Shims.java uses unchecked or unsafe operations.
[WARNING] Note: Recompile with -Xlint:unchecked for details.
[INFO] 
[INFO] --- maven-resources-plugin:2.5:testResources (default-testResources) @ hive-shims-0.20 ---
[debug] execute contextualize
[INFO] Using 'UTF-8' encoding to copy filtered resources.
[INFO] skip non existing resourceDirectory /data/hive-ptest/working/apache-svn-trunk-source/shims/0.20/src/test/resources
[INFO] 
[INFO] --- maven-antrun-plugin:1.7:run (setup-test-dirs) @ hive-shims-0.20 ---
[INFO] Executing tasks

main:
    [mkdir] Created dir: /data/hive-ptest/working/apache-svn-trunk-source/shims/0.20/target/tmp
    [mkdir] Created dir: /data/hive-ptest/working/apache-svn-trunk-source/shims/0.20/target/warehouse
    [mkdir] Created dir: /data/hive-ptest/working/apache-svn-trunk-source/shims/0.20/target/tmp/conf
     [copy] Copying 4 files to /data/hive-ptest/working/apache-svn-trunk-source/shims/0.20/target/tmp/conf
[INFO] Executed tasks
[INFO] 
[INFO] --- maven-compiler-plugin:3.1:testCompile (default-testCompile) @ hive-shims-0.20 ---
[INFO] No sources to compile
[INFO] 
[INFO] --- maven-surefire-plugin:2.16:test (default-test) @ hive-shims-0.20 ---
[INFO] Tests are skipped.
[INFO] 
[INFO] --- maven-jar-plugin:2.2:jar (default-jar) @ hive-shims-0.20 ---
[INFO] Building jar: /data/hive-ptest/working/apache-svn-trunk-source/shims/0.20/target/hive-shims-0.20-0.13.0-SNAPSHOT.jar
[INFO] 
[INFO] --- maven-install-plugin:2.4:install (default-install) @ hive-shims-0.20 ---
[INFO] Installing /data/hive-ptest/working/apache-svn-trunk-source/shims/0.20/target/hive-shims-0.20-0.13.0-SNAPSHOT.jar to /data/hive-ptest/working/maven/org/apache/hive/shims/hive-shims-0.20/0.13.0-SNAPSHOT/hive-shims-0.20-0.13.0-SNAPSHOT.jar
[INFO] Installing /data/hive-ptest/working/apache-svn-trunk-source/shims/0.20/pom.xml to /data/hive-ptest/working/maven/org/apache/hive/shims/hive-shims-0.20/0.13.0-SNAPSHOT/hive-shims-0.20-0.13.0-SNAPSHOT.pom
[INFO]                                                                         
[INFO] ------------------------------------------------------------------------
[INFO] Building Hive Shims Secure Common 0.13.0-SNAPSHOT
[INFO] ------------------------------------------------------------------------
[INFO] 
[INFO] --- maven-clean-plugin:2.5:clean (default-clean) @ hive-shims-common-secure ---
[INFO] Deleting /data/hive-ptest/working/apache-svn-trunk-source/shims/common-secure (includes = [datanucleus.log, derby.log], excludes = [])
[INFO] 
[INFO] --- maven-resources-plugin:2.5:resources (default-resources) @ hive-shims-common-secure ---
[debug] execute contextualize
[INFO] Using 'UTF-8' encoding to copy filtered resources.
[INFO] skip non existing resourceDirectory /data/hive-ptest/working/apache-svn-trunk-source/shims/common-secure/src/main/resources
[INFO] 
[INFO] --- maven-antrun-plugin:1.7:run (define-classpath) @ hive-shims-common-secure ---
[INFO] Executing tasks

main:
[INFO] Executed tasks
[INFO] 
[INFO] --- maven-compiler-plugin:3.1:compile (default-compile) @ hive-shims-common-secure ---
[INFO] Compiling 12 source files to /data/hive-ptest/working/apache-svn-trunk-source/shims/common-secure/target/classes
[WARNING] Note: /data/hive-ptest/working/apache-svn-trunk-source/shims/common-secure/src/main/java/org/apache/hadoop/hive/shims/HadoopShimsSecure.java uses or overrides a deprecated API.
[WARNING] Note: Recompile with -Xlint:deprecation for details.
[WARNING] Note: Some input files use unchecked or unsafe operations.
[WARNING] Note: Recompile with -Xlint:unchecked for details.
[INFO] 
[INFO] --- maven-resources-plugin:2.5:testResources (default-testResources) @ hive-shims-common-secure ---
[debug] execute contextualize
[INFO] Using 'UTF-8' encoding to copy filtered resources.
[INFO] skip non existing resourceDirectory /data/hive-ptest/working/apache-svn-trunk-source/shims/common-secure/src/test/resources
[INFO] 
[INFO] --- maven-antrun-plugin:1.7:run (setup-test-dirs) @ hive-shims-common-secure ---
[INFO] Executing tasks

main:
    [mkdir] Created dir: /data/hive-ptest/working/apache-svn-trunk-source/shims/common-secure/target/tmp
    [mkdir] Created dir: /data/hive-ptest/working/apache-svn-trunk-source/shims/common-secure/target/warehouse
    [mkdir] Created dir: /data/hive-ptest/working/apache-svn-trunk-source/shims/common-secure/target/tmp/conf
     [copy] Copying 4 files to /data/hive-ptest/working/apache-svn-trunk-source/shims/common-secure/target/tmp/conf
[INFO] Executed tasks
[INFO] 
[INFO] --- maven-compiler-plugin:3.1:testCompile (default-testCompile) @ hive-shims-common-secure ---
[INFO] No sources to compile
[INFO] 
[INFO] --- maven-surefire-plugin:2.16:test (default-test) @ hive-shims-common-secure ---
[INFO] Tests are skipped.
[INFO] 
[INFO] --- maven-jar-plugin:2.2:jar (default-jar) @ hive-shims-common-secure ---
[INFO] Building jar: /data/hive-ptest/working/apache-svn-trunk-source/shims/common-secure/target/hive-shims-common-secure-0.13.0-SNAPSHOT.jar
[INFO] 
[INFO] --- maven-install-plugin:2.4:install (default-install) @ hive-shims-common-secure ---
[INFO] Installing /data/hive-ptest/working/apache-svn-trunk-source/shims/common-secure/target/hive-shims-common-secure-0.13.0-SNAPSHOT.jar to /data/hive-ptest/working/maven/org/apache/hive/shims/hive-shims-common-secure/0.13.0-SNAPSHOT/hive-shims-common-secure-0.13.0-SNAPSHOT.jar
[INFO] Installing /data/hive-ptest/working/apache-svn-trunk-source/shims/common-secure/pom.xml to /data/hive-ptest/working/maven/org/apache/hive/shims/hive-shims-common-secure/0.13.0-SNAPSHOT/hive-shims-common-secure-0.13.0-SNAPSHOT.pom
[INFO]                                                                         
[INFO] ------------------------------------------------------------------------
[INFO] Building Hive Shims 0.20S 0.13.0-SNAPSHOT
[INFO] ------------------------------------------------------------------------
[INFO] 
[INFO] --- maven-clean-plugin:2.5:clean (default-clean) @ hive-shims-0.20S ---
[INFO] Deleting /data/hive-ptest/working/apache-svn-trunk-source/shims/0.20S (includes = [datanucleus.log, derby.log], excludes = [])
[INFO] 
[INFO] --- maven-resources-plugin:2.5:resources (default-resources) @ hive-shims-0.20S ---
[debug] execute contextualize
[INFO] Using 'UTF-8' encoding to copy filtered resources.
[INFO] skip non existing resourceDirectory /data/hive-ptest/working/apache-svn-trunk-source/shims/0.20S/src/main/resources
[INFO] 
[INFO] --- maven-antrun-plugin:1.7:run (define-classpath) @ hive-shims-0.20S ---
[INFO] Executing tasks

main:
[INFO] Executed tasks
[INFO] 
[INFO] --- maven-compiler-plugin:3.1:compile (default-compile) @ hive-shims-0.20S ---
[INFO] Compiling 3 source files to /data/hive-ptest/working/apache-svn-trunk-source/shims/0.20S/target/classes
[WARNING] Note: /data/hive-ptest/working/apache-svn-trunk-source/shims/0.20S/src/main/java/org/apache/hadoop/hive/shims/Hadoop20SShims.java uses or overrides a deprecated API.
[WARNING] Note: Recompile with -Xlint:deprecation for details.
[INFO] 
[INFO] --- maven-resources-plugin:2.5:testResources (default-testResources) @ hive-shims-0.20S ---
[debug] execute contextualize
[INFO] Using 'UTF-8' encoding to copy filtered resources.
[INFO] skip non existing resourceDirectory /data/hive-ptest/working/apache-svn-trunk-source/shims/0.20S/src/test/resources
[INFO] 
[INFO] --- maven-antrun-plugin:1.7:run (setup-test-dirs) @ hive-shims-0.20S ---
[INFO] Executing tasks

main:
    [mkdir] Created dir: /data/hive-ptest/working/apache-svn-trunk-source/shims/0.20S/target/tmp
    [mkdir] Created dir: /data/hive-ptest/working/apache-svn-trunk-source/shims/0.20S/target/warehouse
    [mkdir] Created dir: /data/hive-ptest/working/apache-svn-trunk-source/shims/0.20S/target/tmp/conf
     [copy] Copying 4 files to /data/hive-ptest/working/apache-svn-trunk-source/shims/0.20S/target/tmp/conf
[INFO] Executed tasks
[INFO] 
[INFO] --- maven-compiler-plugin:3.1:testCompile (default-testCompile) @ hive-shims-0.20S ---
[INFO] No sources to compile
[INFO] 
[INFO] --- maven-surefire-plugin:2.16:test (default-test) @ hive-shims-0.20S ---
[INFO] Tests are skipped.
[INFO] 
[INFO] --- maven-jar-plugin:2.2:jar (default-jar) @ hive-shims-0.20S ---
[INFO] Building jar: /data/hive-ptest/working/apache-svn-trunk-source/shims/0.20S/target/hive-shims-0.20S-0.13.0-SNAPSHOT.jar
[INFO] 
[INFO] --- maven-install-plugin:2.4:install (default-install) @ hive-shims-0.20S ---
[INFO] Installing /data/hive-ptest/working/apache-svn-trunk-source/shims/0.20S/target/hive-shims-0.20S-0.13.0-SNAPSHOT.jar to /data/hive-ptest/working/maven/org/apache/hive/shims/hive-shims-0.20S/0.13.0-SNAPSHOT/hive-shims-0.20S-0.13.0-SNAPSHOT.jar
[INFO] Installing /data/hive-ptest/working/apache-svn-trunk-source/shims/0.20S/pom.xml to /data/hive-ptest/working/maven/org/apache/hive/shims/hive-shims-0.20S/0.13.0-SNAPSHOT/hive-shims-0.20S-0.13.0-SNAPSHOT.pom
[INFO]                                                                         
[INFO] ------------------------------------------------------------------------
[INFO] Building Hive Shims 0.23 0.13.0-SNAPSHOT
[INFO] ------------------------------------------------------------------------
[INFO] 
[INFO] --- maven-clean-plugin:2.5:clean (default-clean) @ hive-shims-0.23 ---
[INFO] Deleting /data/hive-ptest/working/apache-svn-trunk-source/shims/0.23 (includes = [datanucleus.log, derby.log], excludes = [])
[INFO] 
[INFO] --- maven-resources-plugin:2.5:resources (default-resources) @ hive-shims-0.23 ---
[debug] execute contextualize
[INFO] Using 'UTF-8' encoding to copy filtered resources.
[INFO] skip non existing resourceDirectory /data/hive-ptest/working/apache-svn-trunk-source/shims/0.23/src/main/resources
[INFO] 
[INFO] --- maven-antrun-plugin:1.7:run (define-classpath) @ hive-shims-0.23 ---
[INFO] Executing tasks

main:
[INFO] Executed tasks
[INFO] 
[INFO] --- maven-compiler-plugin:3.1:compile (default-compile) @ hive-shims-0.23 ---
[INFO] Compiling 3 source files to /data/hive-ptest/working/apache-svn-trunk-source/shims/0.23/target/classes
[WARNING] Note: /data/hive-ptest/working/apache-svn-trunk-source/shims/0.23/src/main/java/org/apache/hadoop/hive/shims/Hadoop23Shims.java uses or overrides a deprecated API.
[WARNING] Note: Recompile with -Xlint:deprecation for details.
[INFO] 
[INFO] --- maven-resources-plugin:2.5:testResources (default-testResources) @ hive-shims-0.23 ---
[debug] execute contextualize
[INFO] Using 'UTF-8' encoding to copy filtered resources.
[INFO] skip non existing resourceDirectory /data/hive-ptest/working/apache-svn-trunk-source/shims/0.23/src/test/resources
[INFO] 
[INFO] --- maven-antrun-plugin:1.7:run (setup-test-dirs) @ hive-shims-0.23 ---
[INFO] Executing tasks

main:
    [mkdir] Created dir: /data/hive-ptest/working/apache-svn-trunk-source/shims/0.23/target/tmp
    [mkdir] Created dir: /data/hive-ptest/working/apache-svn-trunk-source/shims/0.23/target/warehouse
    [mkdir] Created dir: /data/hive-ptest/working/apache-svn-trunk-source/shims/0.23/target/tmp/conf
     [copy] Copying 4 files to /data/hive-ptest/working/apache-svn-trunk-source/shims/0.23/target/tmp/conf
[INFO] Executed tasks
[INFO] 
[INFO] --- maven-compiler-plugin:3.1:testCompile (default-testCompile) @ hive-shims-0.23 ---
[INFO] No sources to compile
[INFO] 
[INFO] --- maven-surefire-plugin:2.16:test (default-test) @ hive-shims-0.23 ---
[INFO] Tests are skipped.
[INFO] 
[INFO] --- maven-jar-plugin:2.2:jar (default-jar) @ hive-shims-0.23 ---
[INFO] Building jar: /data/hive-ptest/working/apache-svn-trunk-source/shims/0.23/target/hive-shims-0.23-0.13.0-SNAPSHOT.jar
[INFO] 
[INFO] --- maven-install-plugin:2.4:install (default-install) @ hive-shims-0.23 ---
[INFO] Installing /data/hive-ptest/working/apache-svn-trunk-source/shims/0.23/target/hive-shims-0.23-0.13.0-SNAPSHOT.jar to /data/hive-ptest/working/maven/org/apache/hive/shims/hive-shims-0.23/0.13.0-SNAPSHOT/hive-shims-0.23-0.13.0-SNAPSHOT.jar
[INFO] Installing /data/hive-ptest/working/apache-svn-trunk-source/shims/0.23/pom.xml to /data/hive-ptest/working/maven/org/apache/hive/shims/hive-shims-0.23/0.13.0-SNAPSHOT/hive-shims-0.23-0.13.0-SNAPSHOT.pom
[INFO]                                                                         
[INFO] ------------------------------------------------------------------------
[INFO] Building Hive Shims 0.13.0-SNAPSHOT
[INFO] ------------------------------------------------------------------------
[INFO] 
[INFO] --- maven-clean-plugin:2.5:clean (default-clean) @ hive-shims ---
[INFO] Deleting /data/hive-ptest/working/apache-svn-trunk-source/shims/assembly (includes = [datanucleus.log, derby.log], excludes = [])
[INFO] 
[INFO] --- maven-resources-plugin:2.5:resources (default-resources) @ hive-shims ---
[debug] execute contextualize
[INFO] Using 'UTF-8' encoding to copy filtered resources.
[INFO] skip non existing resourceDirectory /data/hive-ptest/working/apache-svn-trunk-source/shims/assembly/src/main/resources
[INFO] 
[INFO] --- maven-antrun-plugin:1.7:run (define-classpath) @ hive-shims ---
[INFO] Executing tasks

main:
[INFO] Executed tasks
[INFO] 
[INFO] --- maven-compiler-plugin:3.1:compile (default-compile) @ hive-shims ---
[INFO] No sources to compile
[INFO] 
[INFO] --- maven-resources-plugin:2.5:testResources (default-testResources) @ hive-shims ---
[debug] execute contextualize
[INFO] Using 'UTF-8' encoding to copy filtered resources.
[INFO] skip non existing resourceDirectory /data/hive-ptest/working/apache-svn-trunk-source/shims/assembly/src/test/resources
[INFO] 
[INFO] --- maven-antrun-plugin:1.7:run (setup-test-dirs) @ hive-shims ---
[INFO] Executing tasks

main:
    [mkdir] Created dir: /data/hive-ptest/working/apache-svn-trunk-source/shims/assembly/target/tmp
    [mkdir] Created dir: /data/hive-ptest/working/apache-svn-trunk-source/shims/assembly/target/warehouse
    [mkdir] Created dir: /data/hive-ptest/working/apache-svn-trunk-source/shims/assembly/target/tmp/conf
     [copy] Copying 4 files to /data/hive-ptest/working/apache-svn-trunk-source/shims/assembly/target/tmp/conf
[INFO] Executed tasks
[INFO] 
[INFO] --- maven-compiler-plugin:3.1:testCompile (default-testCompile) @ hive-shims ---
[INFO] No sources to compile
[INFO] 
[INFO] --- maven-surefire-plugin:2.16:test (default-test) @ hive-shims ---
[INFO] Tests are skipped.
[INFO] 
[INFO] --- maven-jar-plugin:2.2:jar (default-jar) @ hive-shims ---
[WARNING] JAR will be empty - no content was marked for inclusion!
[INFO] Building jar: /data/hive-ptest/working/apache-svn-trunk-source/shims/assembly/target/hive-shims-0.13.0-SNAPSHOT.jar
[INFO] 
[INFO] --- maven-assembly-plugin:2.3:single (uberjar) @ hive-shims ---
[INFO] Reading assembly descriptor: src/assemble/uberjar.xml
[WARNING] Artifact: org.apache.hive:hive-shims:jar:0.13.0-SNAPSHOT references the same file as the assembly destination file. Moving it to a temporary location for inclusion.
[INFO] META-INF/MANIFEST.MF already added, skipping
[INFO] META-INF/MANIFEST.MF already added, skipping
[INFO] META-INF/MANIFEST.MF already added, skipping
[INFO] META-INF/MANIFEST.MF already added, skipping
[INFO] META-INF/MANIFEST.MF already added, skipping
[INFO] Building jar: /data/hive-ptest/working/apache-svn-trunk-source/shims/assembly/target/hive-shims-0.13.0-SNAPSHOT.jar
[INFO] META-INF/MANIFEST.MF already added, skipping
[INFO] META-INF/MANIFEST.MF already added, skipping
[INFO] META-INF/MANIFEST.MF already added, skipping
[INFO] META-INF/MANIFEST.MF already added, skipping
[INFO] META-INF/MANIFEST.MF already added, skipping
[WARNING] Configuration options: 'appendAssemblyId' is set to false, and 'classifier' is missing.
Instead of attaching the assembly file: /data/hive-ptest/working/apache-svn-trunk-source/shims/assembly/target/hive-shims-0.13.0-SNAPSHOT.jar, it will become the file for main project artifact.
NOTE: If multiple descriptors or descriptor-formats are provided for this project, the value of this file will be non-deterministic!
[WARNING] Replacing pre-existing project main-artifact file: /data/hive-ptest/working/apache-svn-trunk-source/shims/assembly/target/archive-tmp/hive-shims-0.13.0-SNAPSHOT.jar
with assembly file: /data/hive-ptest/working/apache-svn-trunk-source/shims/assembly/target/hive-shims-0.13.0-SNAPSHOT.jar
[INFO] 
[INFO] --- maven-install-plugin:2.4:install (default-install) @ hive-shims ---
[INFO] Installing /data/hive-ptest/working/apache-svn-trunk-source/shims/assembly/target/hive-shims-0.13.0-SNAPSHOT.jar to /data/hive-ptest/working/maven/org/apache/hive/hive-shims/0.13.0-SNAPSHOT/hive-shims-0.13.0-SNAPSHOT.jar
[INFO] Installing /data/hive-ptest/working/apache-svn-trunk-source/shims/assembly/pom.xml to /data/hive-ptest/working/maven/org/apache/hive/hive-shims/0.13.0-SNAPSHOT/hive-shims-0.13.0-SNAPSHOT.pom
[INFO]                                                                         
[INFO] ------------------------------------------------------------------------
[INFO] Building Hive Common 0.13.0-SNAPSHOT
[INFO] ------------------------------------------------------------------------
[INFO] 
[INFO] --- maven-clean-plugin:2.5:clean (default-clean) @ hive-common ---
[INFO] Deleting /data/hive-ptest/working/apache-svn-trunk-source/common (includes = [datanucleus.log, derby.log], excludes = [])
[INFO] 
[INFO] --- maven-antrun-plugin:1.7:run (generate-version-annotation) @ hive-common ---
[INFO] Executing tasks

main:
[INFO] Executed tasks
[INFO] 
[INFO] --- build-helper-maven-plugin:1.8:add-source (add-source) @ hive-common ---
[INFO] Source directory: /data/hive-ptest/working/apache-svn-trunk-source/common/src/gen added.
[INFO] 
[INFO] --- maven-resources-plugin:2.5:resources (default-resources) @ hive-common ---
[debug] execute contextualize
[INFO] Using 'UTF-8' encoding to copy filtered resources.
[INFO] Copying 1 resource
[INFO] 
[INFO] --- maven-antrun-plugin:1.7:run (define-classpath) @ hive-common ---
[INFO] Executing tasks

main:
[INFO] Executed tasks
[INFO] 
[INFO] --- maven-compiler-plugin:3.1:compile (default-compile) @ hive-common ---
[INFO] Compiling 31 source files to /data/hive-ptest/working/apache-svn-trunk-source/common/target/classes
[WARNING] Note: /data/hive-ptest/working/apache-svn-trunk-source/common/src/java/org/apache/hadoop/hive/common/ObjectPair.java uses unchecked or unsafe operations.
[WARNING] Note: Recompile with -Xlint:unchecked for details.
[INFO] 
[INFO] --- maven-resources-plugin:2.5:testResources (default-testResources) @ hive-common ---
[debug] execute contextualize
[INFO] Using 'UTF-8' encoding to copy filtered resources.
[INFO] Copying 4 resources
[INFO] 
[INFO] --- maven-antrun-plugin:1.7:run (setup-test-dirs) @ hive-common ---
[INFO] Executing tasks

main:
    [mkdir] Created dir: /data/hive-ptest/working/apache-svn-trunk-source/common/target/tmp
    [mkdir] Created dir: /data/hive-ptest/working/apache-svn-trunk-source/common/target/warehouse
    [mkdir] Created dir: /data/hive-ptest/working/apache-svn-trunk-source/common/target/tmp/conf
     [copy] Copying 4 files to /data/hive-ptest/working/apache-svn-trunk-source/common/target/tmp/conf
[INFO] Executed tasks
[INFO] 
[INFO] --- maven-compiler-plugin:3.1:testCompile (default-testCompile) @ hive-common ---
[INFO] Compiling 8 source files to /data/hive-ptest/working/apache-svn-trunk-source/common/target/test-classes
[INFO] 
[INFO] --- maven-surefire-plugin:2.16:test (default-test) @ hive-common ---
[INFO] Tests are skipped.
[INFO] 
[INFO] --- maven-jar-plugin:2.2:jar (default-jar) @ hive-common ---
[INFO] Building jar: /data/hive-ptest/working/apache-svn-trunk-source/common/target/hive-common-0.13.0-SNAPSHOT.jar
[INFO] 
[INFO] --- maven-install-plugin:2.4:install (default-install) @ hive-common ---
[INFO] Installing /data/hive-ptest/working/apache-svn-trunk-source/common/target/hive-common-0.13.0-SNAPSHOT.jar to /data/hive-ptest/working/maven/org/apache/hive/hive-common/0.13.0-SNAPSHOT/hive-common-0.13.0-SNAPSHOT.jar
[INFO] Installing /data/hive-ptest/working/apache-svn-trunk-source/common/pom.xml to /data/hive-ptest/working/maven/org/apache/hive/hive-common/0.13.0-SNAPSHOT/hive-common-0.13.0-SNAPSHOT.pom
[INFO]                                                                         
[INFO] ------------------------------------------------------------------------
[INFO] Building Hive Serde 0.13.0-SNAPSHOT
[INFO] ------------------------------------------------------------------------
[INFO] 
[INFO] --- maven-clean-plugin:2.5:clean (default-clean) @ hive-serde ---
[INFO] Deleting /data/hive-ptest/working/apache-svn-trunk-source/serde (includes = [datanucleus.log, derby.log], excludes = [])
[INFO] 
[INFO] --- build-helper-maven-plugin:1.8:add-source (add-source) @ hive-serde ---
[INFO] Source directory: /data/hive-ptest/working/apache-svn-trunk-source/serde/src/gen/protobuf/gen-java added.
[INFO] Source directory: /data/hive-ptest/working/apache-svn-trunk-source/serde/src/gen/thrift/gen-javabean added.
[INFO] 
[INFO] --- maven-resources-plugin:2.5:resources (default-resources) @ hive-serde ---
[debug] execute contextualize
[INFO] Using 'UTF-8' encoding to copy filtered resources.
[INFO] skip non existing resourceDirectory /data/hive-ptest/working/apache-svn-trunk-source/serde/src/main/resources
[INFO] 
[INFO] --- maven-antrun-plugin:1.7:run (define-classpath) @ hive-serde ---
[INFO] Executing tasks

main:
[INFO] Executed tasks
[INFO] 
[INFO] --- maven-compiler-plugin:3.1:compile (default-compile) @ hive-serde ---
[INFO] Compiling 351 source files to /data/hive-ptest/working/apache-svn-trunk-source/serde/target/classes
[WARNING] Note: Some input files use or override a deprecated API.
[WARNING] Note: Recompile with -Xlint:deprecation for details.
[WARNING] Note: Some input files use unchecked or unsafe operations.
[WARNING] Note: Recompile with -Xlint:unchecked for details.
[INFO] 
[INFO] --- maven-resources-plugin:2.5:testResources (default-testResources) @ hive-serde ---
[debug] execute contextualize
[INFO] Using 'UTF-8' encoding to copy filtered resources.
[INFO] skip non existing resourceDirectory /data/hive-ptest/working/apache-svn-trunk-source/serde/src/test/resources
[INFO] 
[INFO] --- maven-antrun-plugin:1.7:run (setup-test-dirs) @ hive-serde ---
[INFO] Executing tasks

main:
    [mkdir] Created dir: /data/hive-ptest/working/apache-svn-trunk-source/serde/target/tmp
    [mkdir] Created dir: /data/hive-ptest/working/apache-svn-trunk-source/serde/target/warehouse
    [mkdir] Created dir: /data/hive-ptest/working/apache-svn-trunk-source/serde/target/tmp/conf
     [copy] Copying 4 files to /data/hive-ptest/working/apache-svn-trunk-source/serde/target/tmp/conf
[INFO] Executed tasks
[INFO] 
[INFO] --- maven-compiler-plugin:3.1:testCompile (default-testCompile) @ hive-serde ---
[INFO] Compiling 41 source files to /data/hive-ptest/working/apache-svn-trunk-source/serde/target/test-classes
[WARNING] Note: Some input files use or override a deprecated API.
[WARNING] Note: Recompile with -Xlint:deprecation for details.
[WARNING] Note: Some input files use unchecked or unsafe operations.
[WARNING] Note: Recompile with -Xlint:unchecked for details.
[INFO] 
[INFO] --- maven-surefire-plugin:2.16:test (default-test) @ hive-serde ---
[INFO] Tests are skipped.
[INFO] 
[INFO] --- maven-jar-plugin:2.2:jar (default-jar) @ hive-serde ---
[INFO] Building jar: /data/hive-ptest/working/apache-svn-trunk-source/serde/target/hive-serde-0.13.0-SNAPSHOT.jar
[INFO] 
[INFO] --- maven-install-plugin:2.4:install (default-install) @ hive-serde ---
[INFO] Installing /data/hive-ptest/working/apache-svn-trunk-source/serde/target/hive-serde-0.13.0-SNAPSHOT.jar to /data/hive-ptest/working/maven/org/apache/hive/hive-serde/0.13.0-SNAPSHOT/hive-serde-0.13.0-SNAPSHOT.jar
[INFO] Installing /data/hive-ptest/working/apache-svn-trunk-source/serde/pom.xml to /data/hive-ptest/working/maven/org/apache/hive/hive-serde/0.13.0-SNAPSHOT/hive-serde-0.13.0-SNAPSHOT.pom
[INFO]                                                                         
[INFO] ------------------------------------------------------------------------
[INFO] Building Hive Metastore 0.13.0-SNAPSHOT
[INFO] ------------------------------------------------------------------------
[INFO] 
[INFO] --- maven-clean-plugin:2.5:clean (default-clean) @ hive-metastore ---
[INFO] Deleting /data/hive-ptest/working/apache-svn-trunk-source/metastore (includes = [datanucleus.log, derby.log], excludes = [])
[INFO] 
[INFO] --- build-helper-maven-plugin:1.8:add-source (add-source) @ hive-metastore ---
[INFO] Source directory: /data/hive-ptest/working/apache-svn-trunk-source/metastore/src/model added.
[INFO] Source directory: /data/hive-ptest/working/apache-svn-trunk-source/metastore/src/gen/thrift/gen-javabean added.
[INFO] 
[INFO] --- antlr3-maven-plugin:3.4:antlr (default) @ hive-metastore ---
[INFO] ANTLR: Processing source directory /data/hive-ptest/working/apache-svn-trunk-source/metastore/src/java
ANTLR Parser Generator  Version 3.4
org/apache/hadoop/hive/metastore/parser/Filter.g
[INFO] 
[INFO] --- maven-resources-plugin:2.5:resources (default-resources) @ hive-metastore ---
[debug] execute contextualize
[INFO] Using 'UTF-8' encoding to copy filtered resources.
[INFO] Copying 1 resource
[INFO] 
[INFO] --- maven-antrun-plugin:1.7:run (define-classpath) @ hive-metastore ---
[INFO] Executing tasks

main:
[INFO] Executed tasks
[INFO] 
[INFO] --- maven-compiler-plugin:3.1:compile (default-compile) @ hive-metastore ---
[INFO] Compiling 132 source files to /data/hive-ptest/working/apache-svn-trunk-source/metastore/target/classes
[WARNING] Note: Some input files use or override a deprecated API.
[WARNING] Note: Recompile with -Xlint:deprecation for details.
[WARNING] Note: Some input files use unchecked or unsafe operations.
[WARNING] Note: Recompile with -Xlint:unchecked for details.
[INFO] 
[INFO] --- datanucleus-maven-plugin:3.3.0-release:enhance (default) @ hive-metastore ---
[INFO] DataNucleus Enhancer (version 3.2.2) for API "JDO" using JRE "1.6"
DataNucleus Enhancer : Classpath
>>  /data/hive-ptest/working/maven/org/datanucleus/datanucleus-maven-plugin/3.3.0-release/datanucleus-maven-plugin-3.3.0-release.jar
>>  /data/hive-ptest/working/maven/org/datanucleus/datanucleus-core/3.2.2/datanucleus-core-3.2.2.jar
>>  /data/hive-ptest/working/maven/org/codehaus/plexus/plexus-utils/3.0.8/plexus-utils-3.0.8.jar
>>  /data/hive-ptest/working/maven/org/codehaus/plexus/plexus-component-annotations/1.5.5/plexus-component-annotations-1.5.5.jar
>>  /data/hive-ptest/working/maven/org/sonatype/sisu/sisu-inject-bean/2.3.0/sisu-inject-bean-2.3.0.jar
>>  /data/hive-ptest/working/maven/org/sonatype/sisu/sisu-guice/3.1.0/sisu-guice-3.1.0-no_aop.jar
>>  /data/hive-ptest/working/maven/org/sonatype/sisu/sisu-guava/0.9.9/sisu-guava-0.9.9.jar
>>  /data/hive-ptest/working/maven/org/apache/xbean/xbean-reflect/3.4/xbean-reflect-3.4.jar
>>  /data/hive-ptest/working/maven/log4j/log4j/1.2.12/log4j-1.2.12.jar
>>  /data/hive-ptest/working/maven/commons-logging/commons-logging-api/1.1/commons-logging-api-1.1.jar
>>  /data/hive-ptest/working/maven/com/google/collections/google-collections/1.0/google-collections-1.0.jar
>>  /data/hive-ptest/working/maven/junit/junit/3.8.2/junit-3.8.2.jar
>>  /data/hive-ptest/working/apache-svn-trunk-source/metastore/target/classes
>>  /data/hive-ptest/working/apache-svn-trunk-source/serde/target/hive-serde-0.13.0-SNAPSHOT.jar
>>  /data/hive-ptest/working/apache-svn-trunk-source/common/target/hive-common-0.13.0-SNAPSHOT.jar
>>  /data/hive-ptest/working/maven/org/apache/commons/commons-compress/1.4.1/commons-compress-1.4.1.jar
>>  /data/hive-ptest/working/maven/org/tukaani/xz/1.0/xz-1.0.jar
>>  /data/hive-ptest/working/maven/commons-codec/commons-codec/1.4/commons-codec-1.4.jar
>>  /data/hive-ptest/working/maven/org/apache/avro/avro/1.7.1/avro-1.7.1.jar
>>  /data/hive-ptest/working/maven/org/codehaus/jackson/jackson-core-asl/1.8.8/jackson-core-asl-1.8.8.jar
>>  /data/hive-ptest/working/maven/com/thoughtworks/paranamer/paranamer/2.3/paranamer-2.3.jar
>>  /data/hive-ptest/working/maven/org/xerial/snappy/snappy-java/1.0.4.1/snappy-java-1.0.4.1.jar
>>  /data/hive-ptest/working/apache-svn-trunk-source/shims/assembly/target/hive-shims-0.13.0-SNAPSHOT.jar
>>  /data/hive-ptest/working/apache-svn-trunk-source/shims/common/target/hive-shims-common-0.13.0-SNAPSHOT.jar
>>  /data/hive-ptest/working/apache-svn-trunk-source/shims/0.20/target/hive-shims-0.20-0.13.0-SNAPSHOT.jar
>>  /data/hive-ptest/working/apache-svn-trunk-source/shims/common-secure/target/hive-shims-common-secure-0.13.0-SNAPSHOT.jar
>>  /data/hive-ptest/working/maven/org/apache/zookeeper/zookeeper/3.4.3/zookeeper-3.4.3.jar
>>  /data/hive-ptest/working/maven/jline/jline/0.9.94/jline-0.9.94.jar
>>  /data/hive-ptest/working/maven/org/jboss/netty/netty/3.2.2.Final/netty-3.2.2.Final.jar
>>  /data/hive-ptest/working/apache-svn-trunk-source/shims/0.20S/target/hive-shims-0.20S-0.13.0-SNAPSHOT.jar
>>  /data/hive-ptest/working/apache-svn-trunk-source/shims/0.23/target/hive-shims-0.23-0.13.0-SNAPSHOT.jar
>>  /data/hive-ptest/working/maven/com/google/guava/guava/11.0.2/guava-11.0.2.jar
>>  /data/hive-ptest/working/maven/com/google/code/findbugs/jsr305/1.3.9/jsr305-1.3.9.jar
>>  /data/hive-ptest/working/maven/commons-cli/commons-cli/1.2/commons-cli-1.2.jar
>>  /data/hive-ptest/working/maven/commons-lang/commons-lang/2.4/commons-lang-2.4.jar
>>  /data/hive-ptest/working/maven/commons-logging/commons-logging/1.1.3/commons-logging-1.1.3.jar
>>  /data/hive-ptest/working/maven/org/apache/derby/derby/10.4.2.0/derby-10.4.2.0.jar
>>  /data/hive-ptest/working/maven/org/datanucleus/datanucleus-api-jdo/3.2.1/datanucleus-api-jdo-3.2.1.jar
>>  /data/hive-ptest/working/maven/org/datanucleus/datanucleus-rdbms/3.2.1/datanucleus-rdbms-3.2.1.jar
>>  /data/hive-ptest/working/maven/javax/jdo/jdo-api/3.0.1/jdo-api-3.0.1.jar
>>  /data/hive-ptest/working/maven/javax/transaction/jta/1.1/jta-1.1.jar
>>  /data/hive-ptest/working/maven/org/antlr/antlr-runtime/3.4/antlr-runtime-3.4.jar
>>  /data/hive-ptest/working/maven/org/antlr/stringtemplate/3.2.1/stringtemplate-3.2.1.jar
>>  /data/hive-ptest/working/maven/antlr/antlr/2.7.7/antlr-2.7.7.jar
>>  /data/hive-ptest/working/maven/org/apache/thrift/libfb303/0.9.0/libfb303-0.9.0.jar
>>  /data/hive-ptest/working/maven/org/apache/thrift/libthrift/0.9.0/libthrift-0.9.0.jar
>>  /data/hive-ptest/working/maven/org/apache/httpcomponents/httpclient/4.1.3/httpclient-4.1.3.jar
>>  /data/hive-ptest/working/maven/org/apache/httpcomponents/httpcore/4.1.3/httpcore-4.1.3.jar
>>  /data/hive-ptest/working/maven/org/apache/hadoop/hadoop-core/1.2.1/hadoop-core-1.2.1.jar
>>  /data/hive-ptest/working/maven/xmlenc/xmlenc/0.52/xmlenc-0.52.jar
>>  /data/hive-ptest/working/maven/com/sun/jersey/jersey-core/1.8/jersey-core-1.8.jar
>>  /data/hive-ptest/working/maven/com/sun/jersey/jersey-json/1.8/jersey-json-1.8.jar
>>  /data/hive-ptest/working/maven/org/codehaus/jettison/jettison/1.1/jettison-1.1.jar
>>  /data/hive-ptest/working/maven/stax/stax-api/1.0.1/stax-api-1.0.1.jar
>>  /data/hive-ptest/working/maven/com/sun/xml/bind/jaxb-impl/2.2.3-1/jaxb-impl-2.2.3-1.jar
>>  /data/hive-ptest/working/maven/javax/xml/bind/jaxb-api/2.2.2/jaxb-api-2.2.2.jar
>>  /data/hive-ptest/working/maven/javax/xml/stream/stax-api/1.0-2/stax-api-1.0-2.jar
>>  /data/hive-ptest/working/maven/javax/activation/activation/1.1/activation-1.1.jar
>>  /data/hive-ptest/working/maven/org/codehaus/jackson/jackson-jaxrs/1.7.1/jackson-jaxrs-1.7.1.jar
>>  /data/hive-ptest/working/maven/org/codehaus/jackson/jackson-xc/1.7.1/jackson-xc-1.7.1.jar
>>  /data/hive-ptest/working/maven/com/sun/jersey/jersey-server/1.8/jersey-server-1.8.jar
>>  /data/hive-ptest/working/maven/asm/asm/3.1/asm-3.1.jar
>>  /data/hive-ptest/working/maven/commons-io/commons-io/2.1/commons-io-2.1.jar
>>  /data/hive-ptest/working/maven/commons-httpclient/commons-httpclient/3.0.1/commons-httpclient-3.0.1.jar
>>  /data/hive-ptest/working/maven/org/apache/commons/commons-math/2.1/commons-math-2.1.jar
>>  /data/hive-ptest/working/maven/commons-configuration/commons-configuration/1.6/commons-configuration-1.6.jar
>>  /data/hive-ptest/working/maven/commons-collections/commons-collections/3.2.1/commons-collections-3.2.1.jar
>>  /data/hive-ptest/working/maven/commons-digester/commons-digester/1.8/commons-digester-1.8.jar
>>  /data/hive-ptest/working/maven/commons-beanutils/commons-beanutils/1.7.0/commons-beanutils-1.7.0.jar
>>  /data/hive-ptest/working/maven/commons-beanutils/commons-beanutils-core/1.8.0/commons-beanutils-core-1.8.0.jar
>>  /data/hive-ptest/working/maven/commons-net/commons-net/1.4.1/commons-net-1.4.1.jar
>>  /data/hive-ptest/working/maven/org/mortbay/jetty/jetty/6.1.26/jetty-6.1.26.jar
>>  /data/hive-ptest/working/maven/org/mortbay/jetty/servlet-api/2.5-20081211/servlet-api-2.5-20081211.jar
>>  /data/hive-ptest/working/maven/org/mortbay/jetty/jetty-util/6.1.26/jetty-util-6.1.26.jar
>>  /data/hive-ptest/working/maven/tomcat/jasper-runtime/5.5.12/jasper-runtime-5.5.12.jar
>>  /data/hive-ptest/working/maven/tomcat/jasper-compiler/5.5.12/jasper-compiler-5.5.12.jar
>>  /data/hive-ptest/working/maven/org/mortbay/jetty/jsp-api-2.1/6.1.14/jsp-api-2.1-6.1.14.jar
>>  /data/hive-ptest/working/maven/org/mortbay/jetty/servlet-api-2.5/6.1.14/servlet-api-2.5-6.1.14.jar
>>  /data/hive-ptest/working/maven/org/mortbay/jetty/jsp-2.1/6.1.14/jsp-2.1-6.1.14.jar
>>  /data/hive-ptest/working/maven/ant/ant/1.6.5/ant-1.6.5.jar
>>  /data/hive-ptest/working/maven/commons-el/commons-el/1.0/commons-el-1.0.jar
>>  /data/hive-ptest/working/maven/net/java/dev/jets3t/jets3t/0.6.1/jets3t-0.6.1.jar
>>  /data/hive-ptest/working/maven/hsqldb/hsqldb/1.8.0.10/hsqldb-1.8.0.10.jar
>>  /data/hive-ptest/working/maven/oro/oro/2.0.8/oro-2.0.8.jar
>>  /data/hive-ptest/working/maven/org/eclipse/jdt/core/3.1.1/core-3.1.1.jar
>>  /data/hive-ptest/working/maven/org/codehaus/jackson/jackson-mapper-asl/1.8.8/jackson-mapper-asl-1.8.8.jar
>>  /data/hive-ptest/working/maven/org/slf4j/slf4j-api/1.6.1/slf4j-api-1.6.1.jar
>>  /data/hive-ptest/working/maven/org/slf4j/slf4j-log4j12/1.6.1/slf4j-log4j12-1.6.1.jar
>>  /data/hive-ptest/working/maven/log4j/log4j/1.2.16/log4j-1.2.16.jar
ENHANCED (PersistenceCapable) : org.apache.hadoop.hive.metastore.model.MDatabase
ENHANCED (PersistenceCapable) : org.apache.hadoop.hive.metastore.model.MFieldSchema
ENHANCED (PersistenceCapable) : org.apache.hadoop.hive.metastore.model.MType
ENHANCED (PersistenceCapable) : org.apache.hadoop.hive.metastore.model.MTable
ENHANCED (PersistenceCapable) : org.apache.hadoop.hive.metastore.model.MSerDeInfo
ENHANCED (PersistenceCapable) : org.apache.hadoop.hive.metastore.model.MOrder
ENHANCED (PersistenceCapable) : org.apache.hadoop.hive.metastore.model.MColumnDescriptor
ENHANCED (PersistenceCapable) : org.apache.hadoop.hive.metastore.model.MStringList
ENHANCED (PersistenceCapable) : org.apache.hadoop.hive.metastore.model.MStorageDescriptor
ENHANCED (PersistenceCapable) : org.apache.hadoop.hive.metastore.model.MPartition
ENHANCED (PersistenceCapable) : org.apache.hadoop.hive.metastore.model.MIndex
ENHANCED (PersistenceCapable) : org.apache.hadoop.hive.metastore.model.MRole
ENHANCED (PersistenceCapable) : org.apache.hadoop.hive.metastore.model.MRoleMap
ENHANCED (PersistenceCapable) : org.apache.hadoop.hive.metastore.model.MGlobalPrivilege
ENHANCED (PersistenceCapable) : org.apache.hadoop.hive.metastore.model.MDBPrivilege
ENHANCED (PersistenceCapable) : org.apache.hadoop.hive.metastore.model.MTablePrivilege
ENHANCED (PersistenceCapable) : org.apache.hadoop.hive.metastore.model.MPartitionPrivilege
ENHANCED (PersistenceCapable) : org.apache.hadoop.hive.metastore.model.MTableColumnPrivilege
ENHANCED (PersistenceCapable) : org.apache.hadoop.hive.metastore.model.MPartitionColumnPrivilege
ENHANCED (PersistenceCapable) : org.apache.hadoop.hive.metastore.model.MPartitionEvent
ENHANCED (PersistenceCapable) : org.apache.hadoop.hive.metastore.model.MMasterKey
ENHANCED (PersistenceCapable) : org.apache.hadoop.hive.metastore.model.MDelegationToken
ENHANCED (PersistenceCapable) : org.apache.hadoop.hive.metastore.model.MTableColumnStatistics
ENHANCED (PersistenceCapable) : org.apache.hadoop.hive.metastore.model.MPartitionColumnStatistics
ENHANCED (PersistenceCapable) : org.apache.hadoop.hive.metastore.model.MVersionTable
DataNucleus Enhancer completed with success for 25 classes. Timings : input=586 ms, enhance=930 ms, total=1516 ms. Consult the log for full details

[INFO] 
[INFO] --- maven-resources-plugin:2.5:testResources (default-testResources) @ hive-metastore ---
[debug] execute contextualize
[INFO] Using 'UTF-8' encoding to copy filtered resources.
[INFO] skip non existing resourceDirectory /data/hive-ptest/working/apache-svn-trunk-source/metastore/src/test/resources
[INFO] 
[INFO] --- maven-antrun-plugin:1.7:run (setup-test-dirs) @ hive-metastore ---
[INFO] Executing tasks

main:
    [mkdir] Created dir: /data/hive-ptest/working/apache-svn-trunk-source/metastore/target/tmp
    [mkdir] Created dir: /data/hive-ptest/working/apache-svn-trunk-source/metastore/target/warehouse
    [mkdir] Created dir: /data/hive-ptest/working/apache-svn-trunk-source/metastore/target/tmp/conf
     [copy] Copying 4 files to /data/hive-ptest/working/apache-svn-trunk-source/metastore/target/tmp/conf
[INFO] Executed tasks
[INFO] 
[INFO] --- maven-compiler-plugin:3.1:testCompile (default-testCompile) @ hive-metastore ---
[INFO] Compiling 10 source files to /data/hive-ptest/working/apache-svn-trunk-source/metastore/target/test-classes
[INFO] 
[INFO] --- maven-surefire-plugin:2.16:test (default-test) @ hive-metastore ---
[INFO] Tests are skipped.
[INFO] 
[INFO] --- maven-jar-plugin:2.2:jar (default-jar) @ hive-metastore ---
[INFO] Building jar: /data/hive-ptest/working/apache-svn-trunk-source/metastore/target/hive-metastore-0.13.0-SNAPSHOT.jar
[INFO] 
[INFO] --- maven-jar-plugin:2.2:test-jar (default) @ hive-metastore ---
[INFO] Building jar: /data/hive-ptest/working/apache-svn-trunk-source/metastore/target/hive-metastore-0.13.0-SNAPSHOT-tests.jar
[INFO] 
[INFO] --- maven-install-plugin:2.4:install (default-install) @ hive-metastore ---
[INFO] Installing /data/hive-ptest/working/apache-svn-trunk-source/metastore/target/hive-metastore-0.13.0-SNAPSHOT.jar to /data/hive-ptest/working/maven/org/apache/hive/hive-metastore/0.13.0-SNAPSHOT/hive-metastore-0.13.0-SNAPSHOT.jar
[INFO] Installing /data/hive-ptest/working/apache-svn-trunk-source/metastore/pom.xml to /data/hive-ptest/working/maven/org/apache/hive/hive-metastore/0.13.0-SNAPSHOT/hive-metastore-0.13.0-SNAPSHOT.pom
[INFO] Installing /data/hive-ptest/working/apache-svn-trunk-source/metastore/target/hive-metastore-0.13.0-SNAPSHOT-tests.jar to /data/hive-ptest/working/maven/org/apache/hive/hive-metastore/0.13.0-SNAPSHOT/hive-metastore-0.13.0-SNAPSHOT-tests.jar
[INFO]                                                                         
[INFO] ------------------------------------------------------------------------
[INFO] Building Hive Query Language 0.13.0-SNAPSHOT
[INFO] ------------------------------------------------------------------------
[INFO] ------------------------------------------------------------------------
[INFO] Reactor Summary:
[INFO] 
[INFO] Hive .............................................. SUCCESS [2.517s]
[INFO] Hive Ant Utilities ................................ SUCCESS [6.852s]
[INFO] Hive Shims Common ................................. SUCCESS [2.799s]
[INFO] Hive Shims 0.20 ................................... SUCCESS [1.816s]
[INFO] Hive Shims Secure Common .......................... SUCCESS [2.991s]
[INFO] Hive Shims 0.20S .................................. SUCCESS [1.340s]
[INFO] Hive Shims 0.23 ................................... SUCCESS [3.039s]
[INFO] Hive Shims ........................................ SUCCESS [3.512s]
[INFO] Hive Common ....................................... SUCCESS [5.242s]
[INFO] Hive Serde ........................................ SUCCESS [11.398s]
[INFO] Hive Metastore .................................... SUCCESS [24.890s]
[INFO] Hive Query Language ............................... FAILURE [0.200s]
[INFO] Hive Service ...................................... SKIPPED
[INFO] Hive JDBC ......................................... SKIPPED
[INFO] Hive Beeline ...................................... SKIPPED
[INFO] Hive CLI .......................................... SKIPPED
[INFO] Hive Contrib ...................................... SKIPPED
[INFO] Hive HBase Handler ................................ SKIPPED
[INFO] Hive HCatalog ..................................... SKIPPED
[INFO] Hive HCatalog Core ................................ SKIPPED
[INFO] Hive HCatalog Pig Adapter ......................... SKIPPED
[INFO] Hive HCatalog Server Extensions ................... SKIPPED
[INFO] Hive HCatalog Webhcat Java Client ................. SKIPPED
[INFO] Hive HCatalog Webhcat ............................. SKIPPED
[INFO] Hive HCatalog HBase Storage Handler ............... SKIPPED
[INFO] Hive HWI .......................................... SKIPPED
[INFO] Hive ODBC ......................................... SKIPPED
[INFO] Hive Shims Aggregator ............................. SKIPPED
[INFO] Hive TestUtils .................................... SKIPPED
[INFO] Hive Packaging .................................... SKIPPED
[INFO] ------------------------------------------------------------------------
[INFO] BUILD FAILURE
[INFO] ------------------------------------------------------------------------
[INFO] Total time: 1:08.956s
[INFO] Finished at: Thu Nov 07 12:23:08 EST 2013
[INFO] Final Memory: 43M/202M
[INFO] ------------------------------------------------------------------------
[ERROR] Failed to execute goal on project hive-exec: Could not resolve dependencies for project org.apache.hive:hive-exec:jar:0.13.0-SNAPSHOT: Could not find artifact org.apache.hive:hive-shims:jar:uberjar:0.13.0-SNAPSHOT -> [Help 1]
[ERROR] 
[ERROR] To see the full stack trace of the errors, re-run Maven with the -e switch.
[ERROR] Re-run Maven using the -X switch to enable full debug logging.
[ERROR] 
[ERROR] For more information about the errors and possible solutions, please read the following articles:
[ERROR] [Help 1] http://cwiki.apache.org/confluence/display/MAVEN/DependencyResolutionException
[ERROR] 
[ERROR] After correcting the problems, you can resume the build with the command
[ERROR]   mvn <goals> -rf :hive-exec
+ exit 1
'
{noformat}

This message is automatically generated.

ATTACHMENT ID: 12612535

> Skip generating vectorization code if possible
> ----------------------------------------------
>
>                 Key: HIVE-5722
>                 URL: https://issues.apache.org/jira/browse/HIVE-5722
>             Project: Hive
>          Issue Type: Improvement
>          Components: Build Infrastructure
>            Reporter: Navis
>            Assignee: Navis
>            Priority: Minor
>         Attachments: D13941.1.patch, HIVE-5722.1.patch.txt
>
>
> Currently, ql module always generates new vectorization code, which might not be changed so frequently.



--
This message was sent by Atlassian JIRA
(v6.1#6144)

Mime
View raw message