hive-dev mailing list archives

Site index · List index
Message view « Date » · « Thread »
Top « Date » · « Thread »
From "Hive QA (JIRA)" <j...@apache.org>
Subject [jira] [Commented] (HIVE-5127) Upgrade xerces and xalan for WebHCat
Date Sat, 07 Sep 2013 02:53:52 GMT

    [ https://issues.apache.org/jira/browse/HIVE-5127?page=com.atlassian.jira.plugin.system.issuetabpanels:comment-tabpanel&focusedCommentId=13760890#comment-13760890 ] 

Hive QA commented on HIVE-5127:
-------------------------------



{color:red}Overall{color}: -1 no tests executed

Here are the results of testing the latest attachment:
https://issues.apache.org/jira/secure/attachment/12601945/HIVE-5127.patch

Test results: https://builds.apache.org/job/PreCommit-HIVE-Build/653/testReport
Console output: https://builds.apache.org/job/PreCommit-HIVE-Build/653/console

Messages:
{noformat}
Executing org.apache.hive.ptest.execution.PrepPhase
Tests failed with: NonZeroExitCodeException: Command 'bash /data/hive-ptest/working/scratch/source-prep.sh' failed with exit status 1 and output '+ [[ -n '' ]]
+ export 'ANT_OPTS=-Xmx1g -XX:MaxPermSize=256m -Dhttp.proxyHost=localhost -Dhttp.proxyPort=3128'
+ ANT_OPTS='-Xmx1g -XX:MaxPermSize=256m -Dhttp.proxyHost=localhost -Dhttp.proxyPort=3128'
+ cd /data/hive-ptest/working/
+ tee /data/hive-ptest/logs/PreCommit-HIVE-Build-653/source-prep.txt
+ mkdir -p maven ivy
+ [[ svn = \s\v\n ]]
+ [[ -n '' ]]
+ [[ -d apache-svn-trunk-source ]]
+ [[ ! -d apache-svn-trunk-source/.svn ]]
+ [[ ! -d apache-svn-trunk-source ]]
+ cd apache-svn-trunk-source
+ svn revert -R .
++ awk '{print $2}'
++ egrep -v '^X|^Performing status on external'
++ svn status --no-ignore
+ rm -rf
+ svn update

Fetching external item into 'hcatalog/src/test/e2e/harness'
External at revision 1520721.

At revision 1520721.
+ patchCommandPath=/data/hive-ptest/working/scratch/smart-apply-patch.sh
+ patchFilePath=/data/hive-ptest/working/scratch/build.patch
+ [[ -f /data/hive-ptest/working/scratch/build.patch ]]
+ chmod +x /data/hive-ptest/working/scratch/smart-apply-patch.sh
+ /data/hive-ptest/working/scratch/smart-apply-patch.sh /data/hive-ptest/working/scratch/build.patch
Going to apply patch with: patch -p0
patching file hcatalog/webhcat/svr/pom.xml
+ [[ true == \t\r\u\e ]]
+ rm -rf /data/hive-ptest/working/ivy /data/hive-ptest/working/maven
+ mkdir /data/hive-ptest/working/ivy /data/hive-ptest/working/maven
+ ant -Dtest.continue.on.failure=true -Dtest.silent=false -Divy.default.ivy.user.dir=/data/hive-ptest/working/ivy -Dmvn.local.repo=/data/hive-ptest/working/maven clean package test -Dtestcase=nothing
Buildfile: /data/hive-ptest/working/apache-svn-trunk-source/build.xml

clean:
     [echo] Project: hive

clean:
     [echo] Project: anttasks

clean:
     [echo] Project: shims

clean:
     [echo] Project: common

clean:
     [echo] Project: serde

clean:
     [echo] Project: metastore

clean:
     [echo] Project: ql

clean:
     [echo] Project: contrib

clean:
     [echo] Project: service

clean:
     [echo] Project: cli

clean:
     [echo] Project: jdbc

clean:
     [echo] Project: beeline

clean:
     [echo] Project: hwi

clean:
     [echo] Project: hbase-handler

clean:
     [echo] Project: testutils

clean:
     [echo] hcatalog

clean:
     [echo] hcatalog-core

clean:
     [echo] hcatalog-pig-adapter

clean:
     [echo] hcatalog-server-extensions

clean:
     [echo] webhcat

clean:
     [echo] webhcat-java-client

clean:

clean:
     [echo] Project: odbc
     [exec] rm -rf /data/hive-ptest/working/apache-svn-trunk-source/build/odbc /data/hive-ptest/working/apache-svn-trunk-source/build/service/objs /data/hive-ptest/working/apache-svn-trunk-source/build/ql/objs /data/hive-ptest/working/apache-svn-trunk-source/build/metastore/objs

clean-online:
     [echo] Project: hive

clean-offline:

ivy-init-dirs:
     [echo] Project: hive
    [mkdir] Created dir: /data/hive-ptest/working/apache-svn-trunk-source/build/ivy
    [mkdir] Created dir: /data/hive-ptest/working/apache-svn-trunk-source/build/ivy/lib
    [mkdir] Created dir: /data/hive-ptest/working/apache-svn-trunk-source/build/ivy/report
    [mkdir] Created dir: /data/hive-ptest/working/apache-svn-trunk-source/build/ivy/maven

ivy-download:
     [echo] Project: hive
      [get] Getting: http://repo2.maven.org/maven2/org/apache/ivy/ivy/2.3.0/ivy-2.3.0.jar
      [get] To: /data/hive-ptest/working/apache-svn-trunk-source/build/ivy/lib/ivy-2.3.0.jar

ivy-probe-antlib:
     [echo] Project: hive

ivy-init-antlib:
     [echo] Project: hive

compile-ant-tasks:
     [echo] Project: hive

create-dirs:
     [echo] Project: anttasks
    [mkdir] Created dir: /data/hive-ptest/working/apache-svn-trunk-source/build/anttasks
    [mkdir] Created dir: /data/hive-ptest/working/apache-svn-trunk-source/build/anttasks/classes
    [mkdir] Created dir: /data/hive-ptest/working/apache-svn-trunk-source/build/jexl/classes
    [mkdir] Created dir: /data/hive-ptest/working/apache-svn-trunk-source/build/hadoopcore
    [mkdir] Created dir: /data/hive-ptest/working/apache-svn-trunk-source/build/anttasks/test
    [mkdir] Created dir: /data/hive-ptest/working/apache-svn-trunk-source/build/anttasks/test/src
    [mkdir] Created dir: /data/hive-ptest/working/apache-svn-trunk-source/build/anttasks/test/classes
    [mkdir] Created dir: /data/hive-ptest/working/apache-svn-trunk-source/build/anttasks/test/resources
     [copy] Warning: /data/hive-ptest/working/apache-svn-trunk-source/ant/src/test/resources does not exist.

init:
     [echo] Project: anttasks

ivy-init-settings:
     [echo] Project: anttasks

ivy-resolve:
     [echo] Project: anttasks
[ivy:resolve] :: Apache Ivy 2.3.0 - 20130110142753 :: http://ant.apache.org/ivy/ ::
[ivy:resolve] :: loading settings :: file = /data/hive-ptest/working/apache-svn-trunk-source/ivy/ivysettings.xml
[ivy:resolve] :: resolving dependencies :: org.apache.hive#hive-anttasks;0.13.0-SNAPSHOT
[ivy:resolve] 	confs: [default]
[ivy:resolve] 	found commons-lang#commons-lang;2.4 in maven2
[ivy:resolve] 	found velocity#velocity;1.5 in maven2
[ivy:resolve] downloading http://repo1.maven.org/maven2/commons-lang/commons-lang/2.4/commons-lang-2.4.jar ...
[ivy:resolve] ..... (255kB)
[ivy:resolve] .. (0kB)
[ivy:resolve] 	[SUCCESSFUL ] commons-lang#commons-lang;2.4!commons-lang.jar (38ms)
[ivy:resolve] downloading http://repo1.maven.org/maven2/velocity/velocity/1.5/velocity-1.5.jar ...
[ivy:resolve] ....... (382kB)
[ivy:resolve] .. (0kB)
[ivy:resolve] 	[SUCCESSFUL ] velocity#velocity;1.5!velocity.jar (36ms)
[ivy:resolve] :: resolution report :: resolve 5465ms :: artifacts dl 95ms
	---------------------------------------------------------------------
	|                  |            modules            ||   artifacts   |
	|       conf       | number| search|dwnlded|evicted|| number|dwnlded|
	---------------------------------------------------------------------
	|      default     |   2   |   2   |   2   |   0   ||   2   |   2   |
	---------------------------------------------------------------------
[ivy:report] Processing /data/hive-ptest/working/apache-svn-trunk-source/build/ivy/resolution-cache/org.apache.hive-hive-anttasks-default.xml to /data/hive-ptest/working/apache-svn-trunk-source/build/ivy/report/org.apache.hive-hive-anttasks-default.html

ivy-retrieve:
     [echo] Project: anttasks
[ivy:retrieve] :: retrieving :: org.apache.hive#hive-anttasks
[ivy:retrieve] 	confs: [default]
[ivy:retrieve] 	2 artifacts copied, 0 already retrieved (638kB/7ms)

compile:
     [echo] anttasks
    [javac] /data/hive-ptest/working/apache-svn-trunk-source/ant/build.xml:38: warning: 'includeantruntime' was not set, defaulting to build.sysclasspath=last; set to false for repeatable builds
    [javac] Compiling 3 source files to /data/hive-ptest/working/apache-svn-trunk-source/build/anttasks/classes
    [javac] Note: /data/hive-ptest/working/apache-svn-trunk-source/ant/src/org/apache/hadoop/hive/ant/QTestGenTask.java uses or overrides a deprecated API.
    [javac] Note: Recompile with -Xlint:deprecation for details.
    [javac] Note: /data/hive-ptest/working/apache-svn-trunk-source/ant/src/org/apache/hadoop/hive/ant/DistinctElementsClassPath.java uses unchecked or unsafe operations.
    [javac] Note: Recompile with -Xlint:unchecked for details.

deploy-ant-tasks:
     [echo] Project: hive

create-dirs:
     [echo] Project: anttasks
     [copy] Warning: /data/hive-ptest/working/apache-svn-trunk-source/ant/src/test/resources does not exist.

init:
     [echo] Project: anttasks

ivy-init-settings:
     [echo] Project: anttasks

ivy-resolve:
     [echo] Project: anttasks
[ivy:resolve] :: loading settings :: file = /data/hive-ptest/working/apache-svn-trunk-source/ivy/ivysettings.xml
[ivy:resolve] :: resolving dependencies :: org.apache.hive#hive-anttasks;0.13.0-SNAPSHOT
[ivy:resolve] 	confs: [default]
[ivy:resolve] 	found commons-lang#commons-lang;2.4 in maven2
[ivy:resolve] 	found velocity#velocity;1.5 in maven2
[ivy:resolve] :: resolution report :: resolve 498ms :: artifacts dl 3ms
	---------------------------------------------------------------------
	|                  |            modules            ||   artifacts   |
	|       conf       | number| search|dwnlded|evicted|| number|dwnlded|
	---------------------------------------------------------------------
	|      default     |   2   |   0   |   0   |   0   ||   2   |   0   |
	---------------------------------------------------------------------
[ivy:report] Processing /data/hive-ptest/working/apache-svn-trunk-source/build/ivy/resolution-cache/org.apache.hive-hive-anttasks-default.xml to /data/hive-ptest/working/apache-svn-trunk-source/build/ivy/report/org.apache.hive-hive-anttasks-default.html

ivy-retrieve:
     [echo] Project: anttasks
[ivy:retrieve] :: retrieving :: org.apache.hive#hive-anttasks
[ivy:retrieve] 	confs: [default]
[ivy:retrieve] 	0 artifacts copied, 2 already retrieved (0kB/7ms)

compile:
     [echo] anttasks
    [javac] /data/hive-ptest/working/apache-svn-trunk-source/ant/build.xml:38: warning: 'includeantruntime' was not set, defaulting to build.sysclasspath=last; set to false for repeatable builds

jar:
     [echo] anttasks
     [copy] Copying 1 file to /data/hive-ptest/working/apache-svn-trunk-source/build/anttasks/classes/org/apache/hadoop/hive/ant
      [jar] Building jar: /data/hive-ptest/working/apache-svn-trunk-source/build/anttasks/hive-anttasks-0.13.0-SNAPSHOT.jar

init:
     [echo] Project: hive

create-dirs:
     [echo] Project: anttasks
     [copy] Warning: /data/hive-ptest/working/apache-svn-trunk-source/ant/src/test/resources does not exist.

init:
     [echo] Project: anttasks

create-dirs:
     [echo] Project: shims
    [mkdir] Created dir: /data/hive-ptest/working/apache-svn-trunk-source/build/shims
    [mkdir] Created dir: /data/hive-ptest/working/apache-svn-trunk-source/build/shims/classes
    [mkdir] Created dir: /data/hive-ptest/working/apache-svn-trunk-source/build/shims/test
    [mkdir] Created dir: /data/hive-ptest/working/apache-svn-trunk-source/build/shims/test/src
    [mkdir] Created dir: /data/hive-ptest/working/apache-svn-trunk-source/build/shims/test/classes
    [mkdir] Created dir: /data/hive-ptest/working/apache-svn-trunk-source/build/shims/test/resources
     [copy] Warning: /data/hive-ptest/working/apache-svn-trunk-source/shims/src/test/resources does not exist.

init:
     [echo] Project: shims

create-dirs:
     [echo] Project: common
    [mkdir] Created dir: /data/hive-ptest/working/apache-svn-trunk-source/build/common
    [mkdir] Created dir: /data/hive-ptest/working/apache-svn-trunk-source/build/common/classes
    [mkdir] Created dir: /data/hive-ptest/working/apache-svn-trunk-source/build/common/test
    [mkdir] Created dir: /data/hive-ptest/working/apache-svn-trunk-source/build/common/test/src
    [mkdir] Created dir: /data/hive-ptest/working/apache-svn-trunk-source/build/common/test/classes
    [mkdir] Created dir: /data/hive-ptest/working/apache-svn-trunk-source/build/common/test/resources
     [copy] Copying 4 files to /data/hive-ptest/working/apache-svn-trunk-source/build/common/test/resources

init:
     [echo] Project: common

create-dirs:
     [echo] Project: serde
    [mkdir] Created dir: /data/hive-ptest/working/apache-svn-trunk-source/build/serde
    [mkdir] Created dir: /data/hive-ptest/working/apache-svn-trunk-source/build/serde/classes
    [mkdir] Created dir: /data/hive-ptest/working/apache-svn-trunk-source/build/serde/test
    [mkdir] Created dir: /data/hive-ptest/working/apache-svn-trunk-source/build/serde/test/src
    [mkdir] Created dir: /data/hive-ptest/working/apache-svn-trunk-source/build/serde/test/classes
    [mkdir] Created dir: /data/hive-ptest/working/apache-svn-trunk-source/build/serde/test/resources
     [copy] Warning: /data/hive-ptest/working/apache-svn-trunk-source/serde/src/test/resources does not exist.

init:
     [echo] Project: serde

create-dirs:
     [echo] Project: metastore
    [mkdir] Created dir: /data/hive-ptest/working/apache-svn-trunk-source/build/metastore
    [mkdir] Created dir: /data/hive-ptest/working/apache-svn-trunk-source/build/metastore/classes
    [mkdir] Created dir: /data/hive-ptest/working/apache-svn-trunk-source/build/metastore/test
    [mkdir] Created dir: /data/hive-ptest/working/apache-svn-trunk-source/build/metastore/test/src
    [mkdir] Created dir: /data/hive-ptest/working/apache-svn-trunk-source/build/metastore/test/classes
    [mkdir] Created dir: /data/hive-ptest/working/apache-svn-trunk-source/build/metastore/test/resources
     [copy] Warning: /data/hive-ptest/working/apache-svn-trunk-source/metastore/src/test/resources does not exist.

init:
     [echo] Project: metastore

create-dirs:
     [echo] Project: ql
    [mkdir] Created dir: /data/hive-ptest/working/apache-svn-trunk-source/build/ql
    [mkdir] Created dir: /data/hive-ptest/working/apache-svn-trunk-source/build/ql/classes
    [mkdir] Created dir: /data/hive-ptest/working/apache-svn-trunk-source/build/ql/test
    [mkdir] Created dir: /data/hive-ptest/working/apache-svn-trunk-source/build/ql/test/src
    [mkdir] Created dir: /data/hive-ptest/working/apache-svn-trunk-source/build/ql/test/classes
    [mkdir] Created dir: /data/hive-ptest/working/apache-svn-trunk-source/build/ql/test/resources
     [copy] Copying 4 files to /data/hive-ptest/working/apache-svn-trunk-source/build/ql/test/resources

init:
     [echo] Project: ql

create-dirs:
     [echo] Project: contrib
    [mkdir] Created dir: /data/hive-ptest/working/apache-svn-trunk-source/build/contrib
    [mkdir] Created dir: /data/hive-ptest/working/apache-svn-trunk-source/build/contrib/classes
    [mkdir] Created dir: /data/hive-ptest/working/apache-svn-trunk-source/build/contrib/test
    [mkdir] Created dir: /data/hive-ptest/working/apache-svn-trunk-source/build/contrib/test/src
    [mkdir] Created dir: /data/hive-ptest/working/apache-svn-trunk-source/build/contrib/test/classes
    [mkdir] Created dir: /data/hive-ptest/working/apache-svn-trunk-source/build/contrib/test/resources
     [copy] Warning: /data/hive-ptest/working/apache-svn-trunk-source/contrib/src/test/resources does not exist.

init:
     [echo] Project: contrib

create-dirs:
     [echo] Project: service
    [mkdir] Created dir: /data/hive-ptest/working/apache-svn-trunk-source/build/service
    [mkdir] Created dir: /data/hive-ptest/working/apache-svn-trunk-source/build/service/classes
    [mkdir] Created dir: /data/hive-ptest/working/apache-svn-trunk-source/build/service/test
    [mkdir] Created dir: /data/hive-ptest/working/apache-svn-trunk-source/build/service/test/src
    [mkdir] Created dir: /data/hive-ptest/working/apache-svn-trunk-source/build/service/test/classes
    [mkdir] Created dir: /data/hive-ptest/working/apache-svn-trunk-source/build/service/test/resources
     [copy] Warning: /data/hive-ptest/working/apache-svn-trunk-source/service/src/test/resources does not exist.

init:
     [echo] Project: service

create-dirs:
     [echo] Project: cli
    [mkdir] Created dir: /data/hive-ptest/working/apache-svn-trunk-source/build/cli
    [mkdir] Created dir: /data/hive-ptest/working/apache-svn-trunk-source/build/cli/classes
    [mkdir] Created dir: /data/hive-ptest/working/apache-svn-trunk-source/build/cli/test
    [mkdir] Created dir: /data/hive-ptest/working/apache-svn-trunk-source/build/cli/test/src
    [mkdir] Created dir: /data/hive-ptest/working/apache-svn-trunk-source/build/cli/test/classes
    [mkdir] Created dir: /data/hive-ptest/working/apache-svn-trunk-source/build/cli/test/resources
     [copy] Warning: /data/hive-ptest/working/apache-svn-trunk-source/cli/src/test/resources does not exist.

init:
     [echo] Project: cli

create-dirs:
     [echo] Project: jdbc
    [mkdir] Created dir: /data/hive-ptest/working/apache-svn-trunk-source/build/jdbc
    [mkdir] Created dir: /data/hive-ptest/working/apache-svn-trunk-source/build/jdbc/classes
    [mkdir] Created dir: /data/hive-ptest/working/apache-svn-trunk-source/build/jdbc/test
    [mkdir] Created dir: /data/hive-ptest/working/apache-svn-trunk-source/build/jdbc/test/src
    [mkdir] Created dir: /data/hive-ptest/working/apache-svn-trunk-source/build/jdbc/test/classes
    [mkdir] Created dir: /data/hive-ptest/working/apache-svn-trunk-source/build/jdbc/test/resources
     [copy] Warning: /data/hive-ptest/working/apache-svn-trunk-source/jdbc/src/test/resources does not exist.

init:
     [echo] Project: jdbc

create-dirs:
     [echo] Project: beeline
    [mkdir] Created dir: /data/hive-ptest/working/apache-svn-trunk-source/build/beeline
    [mkdir] Created dir: /data/hive-ptest/working/apache-svn-trunk-source/build/beeline/classes
    [mkdir] Created dir: /data/hive-ptest/working/apache-svn-trunk-source/build/beeline/test
    [mkdir] Created dir: /data/hive-ptest/working/apache-svn-trunk-source/build/beeline/test/src
    [mkdir] Created dir: /data/hive-ptest/working/apache-svn-trunk-source/build/beeline/test/classes
    [mkdir] Created dir: /data/hive-ptest/working/apache-svn-trunk-source/build/beeline/test/resources
     [copy] Warning: /data/hive-ptest/working/apache-svn-trunk-source/beeline/src/test/resources does not exist.

init:
     [echo] Project: beeline

create-dirs:
     [echo] Project: hwi
    [mkdir] Created dir: /data/hive-ptest/working/apache-svn-trunk-source/build/hwi
    [mkdir] Created dir: /data/hive-ptest/working/apache-svn-trunk-source/build/hwi/classes
    [mkdir] Created dir: /data/hive-ptest/working/apache-svn-trunk-source/build/hwi/test
    [mkdir] Created dir: /data/hive-ptest/working/apache-svn-trunk-source/build/hwi/test/src
    [mkdir] Created dir: /data/hive-ptest/working/apache-svn-trunk-source/build/hwi/test/classes
    [mkdir] Created dir: /data/hive-ptest/working/apache-svn-trunk-source/build/hwi/test/resources
     [copy] Warning: /data/hive-ptest/working/apache-svn-trunk-source/hwi/src/test/resources does not exist.

init:
     [echo] Project: hwi

create-dirs:
     [echo] Project: hbase-handler
    [mkdir] Created dir: /data/hive-ptest/working/apache-svn-trunk-source/build/hbase-handler
    [mkdir] Created dir: /data/hive-ptest/working/apache-svn-trunk-source/build/hbase-handler/classes
    [mkdir] Created dir: /data/hive-ptest/working/apache-svn-trunk-source/build/hbase-handler/test
    [mkdir] Created dir: /data/hive-ptest/working/apache-svn-trunk-source/build/hbase-handler/test/src
    [mkdir] Created dir: /data/hive-ptest/working/apache-svn-trunk-source/build/hbase-handler/test/classes
    [mkdir] Created dir: /data/hive-ptest/working/apache-svn-trunk-source/build/hbase-handler/test/resources
     [copy] Warning: /data/hive-ptest/working/apache-svn-trunk-source/hbase-handler/src/test/resources does not exist.

init:
     [echo] Project: hbase-handler

create-dirs:
     [echo] Project: testutils
    [mkdir] Created dir: /data/hive-ptest/working/apache-svn-trunk-source/build/testutils
    [mkdir] Created dir: /data/hive-ptest/working/apache-svn-trunk-source/build/testutils/classes
    [mkdir] Created dir: /data/hive-ptest/working/apache-svn-trunk-source/build/testutils/test
    [mkdir] Created dir: /data/hive-ptest/working/apache-svn-trunk-source/build/testutils/test/src
    [mkdir] Created dir: /data/hive-ptest/working/apache-svn-trunk-source/build/testutils/test/classes
    [mkdir] Created dir: /data/hive-ptest/working/apache-svn-trunk-source/build/testutils/test/resources
     [copy] Warning: /data/hive-ptest/working/apache-svn-trunk-source/testutils/src/test/resources does not exist.

init:
     [echo] Project: testutils

init:
    [mkdir] Created dir: /data/hive-ptest/working/apache-svn-trunk-source/hcatalog/build/hcatalog-0.12.0-SNAPSHOT

jar:
     [echo] Project: hive

ivy-init-settings:
     [echo] Project: shims

check-ivy:
     [echo] Project: shims

ivy-resolve:
     [echo] Project: shims
[ivy:resolve] :: loading settings :: file = /data/hive-ptest/working/apache-svn-trunk-source/ivy/ivysettings.xml
[ivy:resolve] :: resolving dependencies :: org.apache.hive#hive-shims;0.13.0-SNAPSHOT
[ivy:resolve] 	confs: [default]
[ivy:resolve] 	found org.apache.zookeeper#zookeeper;3.4.3 in maven2
[ivy:resolve] 	found org.apache.thrift#libthrift;0.9.0 in maven2
[ivy:resolve] 	found commons-logging#commons-logging;1.0.4 in maven2
[ivy:resolve] 	found commons-logging#commons-logging-api;1.0.4 in maven2
[ivy:resolve] 	found org.codehaus.jackson#jackson-core-asl;1.8.8 in maven2
[ivy:resolve] 	found org.codehaus.jackson#jackson-mapper-asl;1.8.8 in maven2
[ivy:resolve] 	found log4j#log4j;1.2.16 in maven2
[ivy:resolve] 	found com.google.guava#guava;11.0.2 in maven2
[ivy:resolve] 	found commons-io#commons-io;2.4 in maven2
[ivy:resolve] downloading http://repo1.maven.org/maven2/org/apache/zookeeper/zookeeper/3.4.3/zookeeper-3.4.3.jar ...
[ivy:resolve] .............. (749kB)
[ivy:resolve] .. (0kB)
[ivy:resolve] 	[SUCCESSFUL ] org.apache.zookeeper#zookeeper;3.4.3!zookeeper.jar (39ms)
[ivy:resolve] downloading http://repo1.maven.org/maven2/org/apache/thrift/libthrift/0.9.0/libthrift-0.9.0.jar ...
[ivy:resolve] ....... (339kB)
[ivy:resolve] .. (0kB)
[ivy:resolve] 	[SUCCESSFUL ] org.apache.thrift#libthrift;0.9.0!libthrift.jar (29ms)
[ivy:resolve] downloading http://repo1.maven.org/maven2/commons-logging/commons-logging/1.0.4/commons-logging-1.0.4.jar ...
[ivy:resolve] .. (37kB)
[ivy:resolve] .. (0kB)
[ivy:resolve] 	[SUCCESSFUL ] commons-logging#commons-logging;1.0.4!commons-logging.jar (23ms)
[ivy:resolve] downloading http://repo1.maven.org/maven2/commons-logging/commons-logging-api/1.0.4/commons-logging-api-1.0.4.jar ...
[ivy:resolve] .. (25kB)
[ivy:resolve] .. (0kB)
[ivy:resolve] 	[SUCCESSFUL ] commons-logging#commons-logging-api;1.0.4!commons-logging-api.jar (23ms)
[ivy:resolve] downloading http://repo1.maven.org/maven2/org/codehaus/jackson/jackson-core-asl/1.8.8/jackson-core-asl-1.8.8.jar ...
[ivy:resolve] ..... (222kB)
[ivy:resolve] .. (0kB)
[ivy:resolve] 	[SUCCESSFUL ] org.codehaus.jackson#jackson-core-asl;1.8.8!jackson-core-asl.jar (27ms)
[ivy:resolve] downloading http://repo1.maven.org/maven2/org/codehaus/jackson/jackson-mapper-asl/1.8.8/jackson-mapper-asl-1.8.8.jar ...
[ivy:resolve] ............. (652kB)
[ivy:resolve] .. (0kB)
[ivy:resolve] 	[SUCCESSFUL ] org.codehaus.jackson#jackson-mapper-asl;1.8.8!jackson-mapper-asl.jar (38ms)
[ivy:resolve] downloading http://repo1.maven.org/maven2/log4j/log4j/1.2.16/log4j-1.2.16.jar ...
[ivy:resolve] ......... (470kB)
[ivy:resolve] .. (0kB)
[ivy:resolve] 	[SUCCESSFUL ] log4j#log4j;1.2.16!log4j.jar(bundle) (31ms)
[ivy:resolve] downloading http://repo1.maven.org/maven2/com/google/guava/guava/11.0.2/guava-11.0.2.jar ...
[ivy:resolve] ............................ (1609kB)
[ivy:resolve] .. (0kB)
[ivy:resolve] 	[SUCCESSFUL ] com.google.guava#guava;11.0.2!guava.jar (50ms)
[ivy:resolve] downloading http://repo1.maven.org/maven2/commons-io/commons-io/2.4/commons-io-2.4.jar ...
[ivy:resolve] .... (180kB)
[ivy:resolve] .. (0kB)
[ivy:resolve] 	[SUCCESSFUL ] commons-io#commons-io;2.4!commons-io.jar (26ms)
[ivy:resolve] :: resolution report :: resolve 9410ms :: artifacts dl 318ms
	---------------------------------------------------------------------
	|                  |            modules            ||   artifacts   |
	|       conf       | number| search|dwnlded|evicted|| number|dwnlded|
	---------------------------------------------------------------------
	|      default     |   9   |   9   |   9   |   0   ||   9   |   9   |
	---------------------------------------------------------------------
[ivy:report] Processing /data/hive-ptest/working/apache-svn-trunk-source/build/ivy/resolution-cache/org.apache.hive-hive-shims-default.xml to /data/hive-ptest/working/apache-svn-trunk-source/build/ivy/report/org.apache.hive-hive-shims-default.html

make-pom:
     [echo] Project: shims
     [echo]  Writing POM to /data/hive-ptest/working/apache-svn-trunk-source/build/shims/pom.xml
[ivy:makepom] DEPRECATED: 'ivy.conf.file' is deprecated, use 'ivy.settings.file' instead
[ivy:makepom] :: loading settings :: file = /data/hive-ptest/working/apache-svn-trunk-source/ivy/ivysettings.xml

create-dirs:
     [echo] Project: shims
     [copy] Warning: /data/hive-ptest/working/apache-svn-trunk-source/shims/src/test/resources does not exist.

init:
     [echo] Project: shims

ivy-retrieve:
     [echo] Project: shims
[ivy:retrieve] :: retrieving :: org.apache.hive#hive-shims
[ivy:retrieve] 	confs: [default]
[ivy:retrieve] 	9 artifacts copied, 0 already retrieved (4287kB/19ms)

compile:
     [echo] Project: shims
     [echo] Building shims 0.20

build-shims:
     [echo] Project: shims
     [echo] Compiling /data/hive-ptest/working/apache-svn-trunk-source/shims/src/common/java;/data/hive-ptest/working/apache-svn-trunk-source/shims/src/0.20/java against hadoop 0.20.2 (/data/hive-ptest/working/apache-svn-trunk-source/build/hadoopcore/hadoop-0.20.2)

ivy-init-settings:
     [echo] Project: shims

ivy-resolve-hadoop-shim:
     [echo] Project: shims
[ivy:resolve] :: loading settings :: file = /data/hive-ptest/working/apache-svn-trunk-source/ivy/ivysettings.xml
[ivy:resolve] :: resolving dependencies :: org.apache.hive#hive-shims;0.13.0-SNAPSHOT
[ivy:resolve] 	confs: [hadoop0.20.shim]
[ivy:resolve] 	found org.apache.hadoop#hadoop-core;0.20.2 in maven2
[ivy:resolve] 	found commons-cli#commons-cli;1.2 in maven2
[ivy:resolve] 	found xmlenc#xmlenc;0.52 in maven2
[ivy:resolve] 	found commons-httpclient#commons-httpclient;3.0.1 in maven2
[ivy:resolve] 	found commons-logging#commons-logging;1.0.3 in maven2
[ivy:resolve] 	found commons-codec#commons-codec;1.3 in maven2
[ivy:resolve] 	found commons-net#commons-net;1.4.1 in maven2
[ivy:resolve] 	found oro#oro;2.0.8 in maven2
[ivy:resolve] 	found org.mortbay.jetty#jetty;6.1.14 in maven2
[ivy:resolve] 	found org.mortbay.jetty#jetty-util;6.1.14 in maven2
[ivy:resolve] 	found org.mortbay.jetty#servlet-api-2.5;6.1.14 in maven2
[ivy:resolve] 	found tomcat#jasper-runtime;5.5.12 in maven2
[ivy:resolve] 	found tomcat#jasper-compiler;5.5.12 in maven2
[ivy:resolve] 	found org.mortbay.jetty#jsp-api-2.1;6.1.14 in maven2
[ivy:resolve] 	found org.mortbay.jetty#jsp-2.1;6.1.14 in maven2
[ivy:resolve] 	found org.eclipse.jdt#core;3.1.1 in maven2
[ivy:resolve] 	found ant#ant;1.6.5 in maven2
[ivy:resolve] 	found commons-el#commons-el;1.0 in maven2
[ivy:resolve] 	found net.java.dev.jets3t#jets3t;0.7.1 in maven2
[ivy:resolve] 	found commons-logging#commons-logging;1.1.1 in maven2
[ivy:resolve] 	found net.sf.kosmosfs#kfs;0.3 in maven2
[ivy:resolve] 	found junit#junit;4.5 in maven2
[ivy:resolve] 	found hsqldb#hsqldb;1.8.0.10 in maven2
[ivy:resolve] 	found org.apache.hadoop#hadoop-tools;0.20.2 in maven2
[ivy:resolve] 	found org.apache.hadoop#hadoop-test;0.20.2 in maven2
[ivy:resolve] 	found org.apache.ftpserver#ftplet-api;1.0.0 in maven2
[ivy:resolve] 	found org.apache.mina#mina-core;2.0.0-M5 in maven2
[ivy:resolve] 	found org.slf4j#slf4j-api;1.5.2 in maven2
[ivy:resolve] 	found org.apache.ftpserver#ftpserver-core;1.0.0 in maven2
[ivy:resolve] 	found org.apache.ftpserver#ftpserver-deprecated;1.0.0-M2 in maven2
[ivy:resolve] downloading http://repo1.maven.org/maven2/org/apache/hadoop/hadoop-core/0.20.2/hadoop-core-0.20.2.jar ...
[ivy:resolve] ............................................. (2624kB)
[ivy:resolve] .. (0kB)
[ivy:resolve] 	[SUCCESSFUL ] org.apache.hadoop#hadoop-core;0.20.2!hadoop-core.jar (91ms)
[ivy:resolve] downloading http://repo1.maven.org/maven2/org/apache/hadoop/hadoop-tools/0.20.2/hadoop-tools-0.20.2.jar ...
[ivy:resolve] ... (68kB)
[ivy:resolve] .. (0kB)
[ivy:resolve] 	[SUCCESSFUL ] org.apache.hadoop#hadoop-tools;0.20.2!hadoop-tools.jar (7ms)
[ivy:resolve] downloading http://repo1.maven.org/maven2/org/apache/hadoop/hadoop-test/0.20.2/hadoop-test-0.20.2.jar ...
[ivy:resolve] .......................... (1527kB)
[ivy:resolve] .. (0kB)
[ivy:resolve] 	[SUCCESSFUL ] org.apache.hadoop#hadoop-test;0.20.2!hadoop-test.jar (32ms)
[ivy:resolve] downloading http://repo1.maven.org/maven2/commons-cli/commons-cli/1.2/commons-cli-1.2.jar ...
[ivy:resolve] .. (40kB)
[ivy:resolve] .. (0kB)
[ivy:resolve] 	[SUCCESSFUL ] commons-cli#commons-cli;1.2!commons-cli.jar (35ms)
[ivy:resolve] downloading http://repo1.maven.org/maven2/xmlenc/xmlenc/0.52/xmlenc-0.52.jar ...
[ivy:resolve] .. (14kB)
[ivy:resolve] .. (0kB)
[ivy:resolve] 	[SUCCESSFUL ] xmlenc#xmlenc;0.52!xmlenc.jar (34ms)
[ivy:resolve] downloading http://repo1.maven.org/maven2/commons-httpclient/commons-httpclient/3.0.1/commons-httpclient-3.0.1.jar ...
[ivy:resolve] ...... (273kB)
[ivy:resolve] .. (0kB)
[ivy:resolve] 	[SUCCESSFUL ] commons-httpclient#commons-httpclient;3.0.1!commons-httpclient.jar (38ms)
[ivy:resolve] downloading http://repo1.maven.org/maven2/commons-codec/commons-codec/1.3/commons-codec-1.3.jar ...
[ivy:resolve] .. (45kB)
[ivy:resolve] .. (0kB)
[ivy:resolve] 	[SUCCESSFUL ] commons-codec#commons-codec;1.3!commons-codec.jar (34ms)
[ivy:resolve] downloading http://repo1.maven.org/maven2/commons-net/commons-net/1.4.1/commons-net-1.4.1.jar ...
[ivy:resolve] .... (176kB)
[ivy:resolve] .. (0kB)
[ivy:resolve] 	[SUCCESSFUL ] commons-net#commons-net;1.4.1!commons-net.jar (39ms)
[ivy:resolve] downloading http://repo1.maven.org/maven2/org/mortbay/jetty/jetty/6.1.14/jetty-6.1.14.jar ...
[ivy:resolve] ......... (504kB)
[ivy:resolve] .. (0kB)
[ivy:resolve] 	[SUCCESSFUL ] org.mortbay.jetty#jetty;6.1.14!jetty.jar (43ms)
[ivy:resolve] downloading http://repo1.maven.org/maven2/org/mortbay/jetty/jetty-util/6.1.14/jetty-util-6.1.14.jar ...
[ivy:resolve] .... (159kB)
[ivy:resolve] .. (0kB)
[ivy:resolve] 	[SUCCESSFUL ] org.mortbay.jetty#jetty-util;6.1.14!jetty-util.jar (50ms)
[ivy:resolve] downloading http://repo1.maven.org/maven2/tomcat/jasper-runtime/5.5.12/jasper-runtime-5.5.12.jar ...
[ivy:resolve] ... (74kB)
[ivy:resolve] .. (0kB)
[ivy:resolve] 	[SUCCESSFUL ] tomcat#jasper-runtime;5.5.12!jasper-runtime.jar (37ms)
[ivy:resolve] downloading http://repo1.maven.org/maven2/tomcat/jasper-compiler/5.5.12/jasper-compiler-5.5.12.jar ...
[ivy:resolve] ........ (395kB)
[ivy:resolve] .. (0kB)
[ivy:resolve] 	[SUCCESSFUL ] tomcat#jasper-compiler;5.5.12!jasper-compiler.jar (47ms)
[ivy:resolve] downloading http://repo1.maven.org/maven2/org/mortbay/jetty/jsp-api-2.1/6.1.14/jsp-api-2.1-6.1.14.jar ...
[ivy:resolve] .... (131kB)
[ivy:resolve] .. (0kB)
[ivy:resolve] 	[SUCCESSFUL ] org.mortbay.jetty#jsp-api-2.1;6.1.14!jsp-api-2.1.jar (36ms)
[ivy:resolve] downloading http://repo1.maven.org/maven2/org/mortbay/jetty/jsp-2.1/6.1.14/jsp-2.1-6.1.14.jar ...
[ivy:resolve] .................. (1000kB)
[ivy:resolve] .. (0kB)
[ivy:resolve] 	[SUCCESSFUL ] org.mortbay.jetty#jsp-2.1;6.1.14!jsp-2.1.jar (57ms)
[ivy:resolve] downloading http://repo1.maven.org/maven2/commons-el/commons-el/1.0/commons-el-1.0.jar ...
[ivy:resolve] ... (109kB)
[ivy:resolve] .. (0kB)
[ivy:resolve] 	[SUCCESSFUL ] commons-el#commons-el;1.0!commons-el.jar (41ms)
[ivy:resolve] downloading http://repo1.maven.org/maven2/net/java/dev/jets3t/jets3t/0.7.1/jets3t-0.7.1.jar ...
[ivy:resolve] ....... (368kB)
[ivy:resolve] .. (0kB)
[ivy:resolve] 	[SUCCESSFUL ] net.java.dev.jets3t#jets3t;0.7.1!jets3t.jar (64ms)
[ivy:resolve] downloading http://repo1.maven.org/maven2/org/mortbay/jetty/servlet-api-2.5/6.1.14/servlet-api-2.5-6.1.14.jar ...
[ivy:resolve] .... (129kB)
[ivy:resolve] .. (0kB)
[ivy:resolve] 	[SUCCESSFUL ] org.mortbay.jetty#servlet-api-2.5;6.1.14!servlet-api-2.5.jar (38ms)
[ivy:resolve] downloading http://repo1.maven.org/maven2/net/sf/kosmosfs/kfs/0.3/kfs-0.3.jar ...
[ivy:resolve] .. (11kB)
[ivy:resolve] .. (0kB)
[ivy:resolve] 	[SUCCESSFUL ] net.sf.kosmosfs#kfs;0.3!kfs.jar (37ms)
[ivy:resolve] downloading http://repo1.maven.org/maven2/junit/junit/4.5/junit-4.5.jar ...
[ivy:resolve] ..... (194kB)
[ivy:resolve] .. (0kB)
[ivy:resolve] 	[SUCCESSFUL ] junit#junit;4.5!junit.jar (38ms)
[ivy:resolve] downloading http://repo1.maven.org/maven2/hsqldb/hsqldb/1.8.0.10/hsqldb-1.8.0.10.jar ...
[ivy:resolve] ............ (690kB)
[ivy:resolve] .. (0kB)
[ivy:resolve] 	[SUCCESSFUL ] hsqldb#hsqldb;1.8.0.10!hsqldb.jar (47ms)
[ivy:resolve] downloading http://repo1.maven.org/maven2/oro/oro/2.0.8/oro-2.0.8.jar ...
[ivy:resolve] .. (63kB)
[ivy:resolve] .. (0kB)
[ivy:resolve] 	[SUCCESSFUL ] oro#oro;2.0.8!oro.jar (34ms)
[ivy:resolve] downloading http://repo1.maven.org/maven2/org/eclipse/jdt/core/3.1.1/core-3.1.1.jar ...
[ivy:resolve] .................................................................................................. (3483kB)
[ivy:resolve] .. (0kB)
[ivy:resolve] 	[SUCCESSFUL ] org.eclipse.jdt#core;3.1.1!core.jar (100ms)
[ivy:resolve] downloading http://repo1.maven.org/maven2/ant/ant/1.6.5/ant-1.6.5.jar ...
[ivy:resolve] ................. (1009kB)
[ivy:resolve] .. (0kB)
[ivy:resolve] 	[SUCCESSFUL ] ant#ant;1.6.5!ant.jar (53ms)
[ivy:resolve] downloading http://repo1.maven.org/maven2/commons-logging/commons-logging/1.1.1/commons-logging-1.1.1.jar ...
[ivy:resolve] .. (59kB)
[ivy:resolve] .. (0kB)
[ivy:resolve] 	[SUCCESSFUL ] commons-logging#commons-logging;1.1.1!commons-logging.jar (42ms)
[ivy:resolve] downloading http://repo1.maven.org/maven2/org/apache/ftpserver/ftplet-api/1.0.0/ftplet-api-1.0.0.jar ...
[ivy:resolve] .. (22kB)
[ivy:resolve] .. (0kB)
[ivy:resolve] 	[SUCCESSFUL ] org.apache.ftpserver#ftplet-api;1.0.0!ftplet-api.jar(bundle) (38ms)
[ivy:resolve] downloading http://repo1.maven.org/maven2/org/apache/mina/mina-core/2.0.0-M5/mina-core-2.0.0-M5.jar ...
[ivy:resolve] ........... (622kB)
[ivy:resolve] .. (0kB)
[ivy:resolve] 	[SUCCESSFUL ] org.apache.mina#mina-core;2.0.0-M5!mina-core.jar(bundle) (47ms)
[ivy:resolve] downloading http://repo1.maven.org/maven2/org/apache/ftpserver/ftpserver-core/1.0.0/ftpserver-core-1.0.0.jar ...
[ivy:resolve] ...... (264kB)
[ivy:resolve] .. (0kB)
[ivy:resolve] 	[SUCCESSFUL ] org.apache.ftpserver#ftpserver-core;1.0.0!ftpserver-core.jar(bundle) (78ms)
[ivy:resolve] downloading http://repo1.maven.org/maven2/org/apache/ftpserver/ftpserver-deprecated/1.0.0-M2/ftpserver-deprecated-1.0.0-M2.jar ...
[ivy:resolve] .. (31kB)
[ivy:resolve] .. (0kB)
[ivy:resolve] 	[SUCCESSFUL ] org.apache.ftpserver#ftpserver-deprecated;1.0.0-M2!ftpserver-deprecated.jar (59ms)
[ivy:resolve] downloading http://repo1.maven.org/maven2/org/slf4j/slf4j-api/1.5.2/slf4j-api-1.5.2.jar ...
[ivy:resolve] .. (16kB)
[ivy:resolve] .. (0kB)
[ivy:resolve] 	[SUCCESSFUL ] org.slf4j#slf4j-api;1.5.2!slf4j-api.jar (34ms)
[ivy:resolve] :: resolution report :: resolve 38865ms :: artifacts dl 1435ms
[ivy:resolve] 	:: evicted modules:
[ivy:resolve] 	junit#junit;3.8.1 by [junit#junit;4.5] in [hadoop0.20.shim]
[ivy:resolve] 	commons-logging#commons-logging;1.0.3 by [commons-logging#commons-logging;1.1.1] in [hadoop0.20.shim]
[ivy:resolve] 	commons-codec#commons-codec;1.2 by [commons-codec#commons-codec;1.3] in [hadoop0.20.shim]
[ivy:resolve] 	commons-httpclient#commons-httpclient;3.1 by [commons-httpclient#commons-httpclient;3.0.1] in [hadoop0.20.shim]
[ivy:resolve] 	org.apache.mina#mina-core;2.0.0-M4 by [org.apache.mina#mina-core;2.0.0-M5] in [hadoop0.20.shim]
[ivy:resolve] 	org.apache.ftpserver#ftplet-api;1.0.0-M2 by [org.apache.ftpserver#ftplet-api;1.0.0] in [hadoop0.20.shim]
[ivy:resolve] 	org.apache.ftpserver#ftpserver-core;1.0.0-M2 by [org.apache.ftpserver#ftpserver-core;1.0.0] in [hadoop0.20.shim]
[ivy:resolve] 	org.apache.mina#mina-core;2.0.0-M2 by [org.apache.mina#mina-core;2.0.0-M5] in [hadoop0.20.shim]
	---------------------------------------------------------------------
	|                  |            modules            ||   artifacts   |
	|       conf       | number| search|dwnlded|evicted|| number|dwnlded|
	---------------------------------------------------------------------
	|  hadoop0.20.shim |   37  |   30  |   30  |   8   ||   29  |   29  |
	---------------------------------------------------------------------

ivy-retrieve-hadoop-shim:
     [echo] Project: shims
[ivy:retrieve] :: retrieving :: org.apache.hive#hive-shims
[ivy:retrieve] 	confs: [hadoop0.20.shim]
[ivy:retrieve] 	29 artifacts copied, 0 already retrieved (14115kB/94ms)
    [javac] Compiling 17 source files to /data/hive-ptest/working/apache-svn-trunk-source/build/shims/classes
    [javac] Note: Some input files use or override a deprecated API.
    [javac] Note: Recompile with -Xlint:deprecation for details.
    [javac] Note: /data/hive-ptest/working/apache-svn-trunk-source/shims/src/0.20/java/org/apache/hadoop/hive/shims/Hadoop20Shims.java uses unchecked or unsafe operations.
    [javac] Note: Recompile with -Xlint:unchecked for details.
     [echo] Building shims 0.20S

build-shims:
     [echo] Project: shims
     [echo] Compiling /data/hive-ptest/working/apache-svn-trunk-source/shims/src/common/java;/data/hive-ptest/working/apache-svn-trunk-source/shims/src/common-secure/java;/data/hive-ptest/working/apache-svn-trunk-source/shims/src/0.20S/java against hadoop 1.1.2 (/data/hive-ptest/working/apache-svn-trunk-source/build/hadoopcore/hadoop-1.1.2)

ivy-init-settings:
     [echo] Project: shims

ivy-resolve-hadoop-shim:
     [echo] Project: shims
[ivy:resolve] :: loading settings :: file = /data/hive-ptest/working/apache-svn-trunk-source/ivy/ivysettings.xml
[ivy:resolve] :: resolving dependencies :: org.apache.hive#hive-shims;0.13.0-SNAPSHOT
[ivy:resolve] 	confs: [hadoop0.20S.shim]
[ivy:resolve] 	found org.apache.hadoop#hadoop-core;1.1.2 in maven2
[ivy:resolve] 	found commons-cli#commons-cli;1.2 in maven2
[ivy:resolve] 	found xmlenc#xmlenc;0.52 in maven2
[ivy:resolve] 	found com.sun.jersey#jersey-core;1.8 in maven2
[ivy:resolve] 	found com.sun.jersey#jersey-json;1.8 in maven2
[ivy:resolve] 	found org.codehaus.jettison#jettison;1.1 in maven2
[ivy:resolve] 	found stax#stax-api;1.0.1 in maven2
[ivy:resolve] 	found com.sun.xml.bind#jaxb-impl;2.2.3-1 in maven2
[ivy:resolve] 	found javax.xml.bind#jaxb-api;2.2.2 in maven2
[ivy:resolve] 	found javax.xml.stream#stax-api;1.0-2 in maven2
[ivy:resolve] 	found javax.activation#activation;1.1 in maven2
[ivy:resolve] 	found org.codehaus.jackson#jackson-core-asl;1.7.1 in maven2
[ivy:resolve] 	found org.codehaus.jackson#jackson-mapper-asl;1.7.1 in maven2
[ivy:resolve] 	found org.codehaus.jackson#jackson-jaxrs;1.7.1 in maven2
[ivy:resolve] 	found org.codehaus.jackson#jackson-xc;1.7.1 in maven2
[ivy:resolve] 	found com.sun.jersey#jersey-server;1.8 in maven2
[ivy:resolve] 	found asm#asm;3.1 in maven2
[ivy:resolve] 	found commons-io#commons-io;2.1 in maven2
[ivy:resolve] 	found commons-httpclient#commons-httpclient;3.0.1 in maven2
[ivy:resolve] 	found junit#junit;3.8.1 in maven2
[ivy:resolve] 	found commons-logging#commons-logging;1.0.3 in maven2
[ivy:resolve] 	found commons-codec#commons-codec;1.4 in maven2
[ivy:resolve] 	found org.apache.commons#commons-math;2.1 in maven2
[ivy:resolve] 	found commons-configuration#commons-configuration;1.6 in maven2
[ivy:resolve] 	found commons-collections#commons-collections;3.2.1 in maven2
[ivy:resolve] 	found commons-lang#commons-lang;2.4 in maven2
[ivy:resolve] 	found commons-logging#commons-logging;1.1.1 in maven2
[ivy:resolve] 	found commons-digester#commons-digester;1.8 in maven2
[ivy:resolve] 	found commons-beanutils#commons-beanutils;1.7.0 in maven2
[ivy:resolve] 	found commons-beanutils#commons-beanutils-core;1.8.0 in maven2
[ivy:resolve] 	found commons-net#commons-net;1.4.1 in maven2
[ivy:resolve] 	found oro#oro;2.0.8 in maven2
[ivy:resolve] 	found org.mortbay.jetty#jetty;6.1.26 in maven2
[ivy:resolve] 	found org.mortbay.jetty#jetty-util;6.1.26 in maven2
[ivy:resolve] 	found org.mortbay.jetty#servlet-api;2.5-20081211 in maven2
[ivy:resolve] 	found tomcat#jasper-runtime;5.5.12 in maven2
[ivy:resolve] 	found tomcat#jasper-compiler;5.5.12 in maven2
[ivy:resolve] 	found org.mortbay.jetty#jsp-api-2.1;6.1.14 in maven2
[ivy:resolve] 	found org.mortbay.jetty#servlet-api-2.5;6.1.14 in maven2
[ivy:resolve] 	found org.mortbay.jetty#jsp-2.1;6.1.14 in maven2
[ivy:resolve] 	found org.eclipse.jdt#core;3.1.1 in maven2
[ivy:resolve] 	found ant#ant;1.6.5 in maven2
[ivy:resolve] 	found commons-el#commons-el;1.0 in maven2
[ivy:resolve] 	found net.java.dev.jets3t#jets3t;0.6.1 in maven2
[ivy:resolve] 	found hsqldb#hsqldb;1.8.0.10 in maven2
[ivy:resolve] 	found org.codehaus.jackson#jackson-mapper-asl;1.8.8 in maven2
[ivy:resolve] 	found org.codehaus.jackson#jackson-core-asl;1.8.8 in maven2
[ivy:resolve] 	found org.apache.hadoop#hadoop-tools;1.1.2 in maven2
[ivy:resolve] 	found org.apache.hadoop#hadoop-test;1.1.2 in maven2
[ivy:resolve] 	found org.apache.ftpserver#ftplet-api;1.0.0 in maven2
[ivy:resolve] 	found org.apache.mina#mina-core;2.0.0-M5 in maven2
[ivy:resolve] 	found org.slf4j#slf4j-api;1.5.2 in maven2
[ivy:resolve] 	found org.apache.ftpserver#ftpserver-core;1.0.0 in maven2
[ivy:resolve] 	found org.apache.ftpserver#ftpserver-deprecated;1.0.0-M2 in maven2
[ivy:resolve] downloading http://repo1.maven.org/maven2/org/apache/hadoop/hadoop-core/1.1.2/hadoop-core-1.1.2.jar ...
[ivy:resolve] .......................................................................................................... (3941kB)
[ivy:resolve] .. (0kB)
[ivy:resolve] 	[SUCCESSFUL ] org.apache.hadoop#hadoop-core;1.1.2!hadoop-core.jar (95ms)
[ivy:resolve] downloading http://repo1.maven.org/maven2/org/apache/hadoop/hadoop-tools/1.1.2/hadoop-tools-1.1.2.jar ...
[ivy:resolve] ...... (299kB)
[ivy:resolve] .. (0kB)
[ivy:resolve] 	[SUCCESSFUL ] org.apache.hadoop#hadoop-tools;1.1.2!hadoop-tools.jar (19ms)
[ivy:resolve] downloading http://repo1.maven.org/maven2/org/apache/hadoop/hadoop-test/1.1.2/hadoop-test-1.1.2.jar ...
[ivy:resolve] ...................................................... (2712kB)
[ivy:resolve] .. (0kB)
[ivy:resolve] 	[SUCCESSFUL ] org.apache.hadoop#hadoop-test;1.1.2!hadoop-test.jar (57ms)
[ivy:resolve] downloading http://repo1.maven.org/maven2/com/sun/jersey/jersey-core/1.8/jersey-core-1.8.jar ...
[ivy:resolve] ........ (447kB)
[ivy:resolve] .. (0kB)
[ivy:resolve] 	[SUCCESSFUL ] com.sun.jersey#jersey-core;1.8!jersey-core.jar(bundle) (43ms)
[ivy:resolve] downloading http://repo1.maven.org/maven2/com/sun/jersey/jersey-json/1.8/jersey-json-1.8.jar ...
[ivy:resolve] .... (144kB)
[ivy:resolve] .. (0kB)
[ivy:resolve] 	[SUCCESSFUL ] com.sun.jersey#jersey-json;1.8!jersey-json.jar(bundle) (37ms)
[ivy:resolve] downloading http://repo1.maven.org/maven2/com/sun/jersey/jersey-server/1.8/jersey-server-1.8.jar ...
[ivy:resolve] ............ (678kB)
[ivy:resolve] .. (0kB)
[ivy:resolve] 	[SUCCESSFUL ] com.sun.jersey#jersey-server;1.8!jersey-server.jar(bundle) (53ms)
[ivy:resolve] downloading http://repo1.maven.org/maven2/commons-io/commons-io/2.1/commons-io-2.1.jar ...
[ivy:resolve] .... (159kB)
[ivy:resolve] .. (0kB)
[ivy:resolve] 	[SUCCESSFUL ] commons-io#commons-io;2.1!commons-io.jar (38ms)
[ivy:resolve] downloading http://repo1.maven.org/maven2/commons-codec/commons-codec/1.4/commons-codec-1.4.jar ...
[ivy:resolve] .. (56kB)
[ivy:resolve] .. (0kB)
[ivy:resolve] 	[SUCCESSFUL ] commons-codec#commons-codec;1.4!commons-codec.jar (37ms)
[ivy:resolve] downloading http://repo1.maven.org/maven2/org/apache/commons/commons-math/2.1/commons-math-2.1.jar ...
[ivy:resolve] ............... (812kB)
[ivy:resolve] .. (0kB)
[ivy:resolve] 	[SUCCESSFUL ] org.apache.commons#commons-math;2.1!commons-math.jar (49ms)
[ivy:resolve] downloading http://repo1.maven.org/maven2/commons-configuration/commons-configuration/1.6/commons-configuration-1.6.jar ...
[ivy:resolve] ...... (291kB)
[ivy:resolve] .. (0kB)
[ivy:resolve] 	[SUCCESSFUL ] commons-configuration#commons-configuration;1.6!commons-configuration.jar (44ms)
[ivy:resolve] downloading http://repo1.maven.org/maven2/org/mortbay/jetty/jetty/6.1.26/jetty-6.1.26.jar ...
[ivy:resolve] .......... (527kB)
[ivy:resolve] .. (0kB)
[ivy:resolve] 	[SUCCESSFUL ] org.mortbay.jetty#jetty;6.1.26!jetty.jar (45ms)
[ivy:resolve] downloading http://repo1.maven.org/maven2/org/mortbay/jetty/jetty-util/6.1.26/jetty-util-6.1.26.jar ...
[ivy:resolve] .... (172kB)
[ivy:resolve] .. (0kB)
[ivy:resolve] 	[SUCCESSFUL ] org.mortbay.jetty#jetty-util;6.1.26!jetty-util.jar (42ms)
[ivy:resolve] downloading http://repo1.maven.org/maven2/net/java/dev/jets3t/jets3t/0.6.1/jets3t-0.6.1.jar ...
[ivy:resolve] ...... (314kB)
[ivy:resolve] .. (0kB)
[ivy:resolve] 	[SUCCESSFUL ] net.java.dev.jets3t#jets3t;0.6.1!jets3t.jar (44ms)
[ivy:resolve] downloading http://repo1.maven.org/maven2/org/codehaus/jettison/jettison/1.1/jettison-1.1.jar ...
[ivy:resolve] ... (66kB)
[ivy:resolve] .. (0kB)
[ivy:resolve] 	[SUCCESSFUL ] org.codehaus.jettison#jettison;1.1!jettison.jar(bundle) (37ms)
[ivy:resolve] downloading http://repo1.maven.org/maven2/com/sun/xml/bind/jaxb-impl/2.2.3-1/jaxb-impl-2.2.3-1.jar ...
[ivy:resolve] ................ (869kB)
[ivy:resolve] .. (0kB)
[ivy:resolve] 	[SUCCESSFUL ] com.sun.xml.bind#jaxb-impl;2.2.3-1!jaxb-impl.jar (48ms)
[ivy:resolve] downloading http://repo1.maven.org/maven2/org/codehaus/jackson/jackson-jaxrs/1.7.1/jackson-jaxrs-1.7.1.jar ...
[ivy:resolve] .. (17kB)
[ivy:resolve] .. (0kB)
[ivy:resolve] 	[SUCCESSFUL ] org.codehaus.jackson#jackson-jaxrs;1.7.1!jackson-jaxrs.jar (59ms)
[ivy:resolve] downloading http://repo1.maven.org/maven2/org/codehaus/jackson/jackson-xc/1.7.1/jackson-xc-1.7.1.jar ...
[ivy:resolve] .. (30kB)
[ivy:resolve] .. (0kB)
[ivy:resolve] 	[SUCCESSFUL ] org.codehaus.jackson#jackson-xc;1.7.1!jackson-xc.jar (51ms)
[ivy:resolve] downloading http://repo1.maven.org/maven2/stax/stax-api/1.0.1/stax-api-1.0.1.jar ...
[ivy:resolve] .. (25kB)
[ivy:resolve] .. (0kB)
[ivy:resolve] 	[SUCCESSFUL ] stax#stax-api;1.0.1!stax-api.jar (55ms)
[ivy:resolve] downloading http://repo1.maven.org/maven2/javax/xml/bind/jaxb-api/2.2.2/jaxb-api-2.2.2.jar ...
[ivy:resolve] ... (102kB)
[ivy:resolve] .. (0kB)
[ivy:resolve] 	[SUCCESSFUL ] javax.xml.bind#jaxb-api;2.2.2!jaxb-api.jar (36ms)
[ivy:resolve] downloading http://repo1.maven.org/maven2/javax/xml/stream/stax-api/1.0-2/stax-api-1.0-2.jar ...
[ivy:resolve] .. (22kB)
[ivy:resolve] .. (0kB)
[ivy:resolve] 	[SUCCESSFUL ] javax.xml.stream#stax-api;1.0-2!stax-api.jar (39ms)
[ivy:resolve] downloading http://repo1.maven.org/maven2/javax/activation/activation/1.1/activation-1.1.jar ...
[ivy:resolve] .. (61kB)
[ivy:resolve] .. (0kB)
[ivy:resolve] 	[SUCCESSFUL ] javax.activation#activation;1.1!activation.jar (37ms)
[ivy:resolve] downloading http://repo1.maven.org/maven2/asm/asm/3.1/asm-3.1.jar ...
[ivy:resolve] .. (42kB)
[ivy:resolve] .. (0kB)
[ivy:resolve] 	[SUCCESSFUL ] asm#asm;3.1!asm.jar (35ms)
[ivy:resolve] downloading http://repo1.maven.org/maven2/junit/junit/3.8.1/junit-3.8.1.jar ...
[ivy:resolve] ... (118kB)
[ivy:resolve] .. (0kB)
[ivy:resolve] 	[SUCCESSFUL ] junit#junit;3.8.1!junit.jar (8ms)
[ivy:resolve] downloading http://repo1.maven.org/maven2/commons-collections/commons-collections/3.2.1/commons-collections-3.2.1.jar ...
[ivy:resolve] ........... (561kB)
[ivy:resolve] .. (0kB)
[ivy:resolve] 	[SUCCESSFUL ] commons-collections#commons-collections;3.2.1!commons-collections.jar (48ms)
[ivy:resolve] downloading http://repo1.maven.org/maven2/commons-digester/commons-digester/1.8/commons-digester-1.8.jar ...
[ivy:resolve] .... (140kB)
[ivy:resolve] .. (0kB)
[ivy:resolve] 	[SUCCESSFUL ] commons-digester#commons-digester;1.8!commons-digester.jar (43ms)
[ivy:resolve] downloading http://repo1.maven.org/maven2/commons-beanutils/commons-beanutils-core/1.8.0/commons-beanutils-core-1.8.0.jar ...
[ivy:resolve] ..... (201kB)
[ivy:resolve] .. (0kB)
[ivy:resolve] 	[SUCCESSFUL ] commons-beanutils#commons-beanutils-core;1.8.0!commons-beanutils-core.jar (38ms)
[ivy:resolve] downloading http://repo1.maven.org/maven2/commons-beanutils/commons-beanutils/1.7.0/commons-beanutils-1.7.0.jar ...
[ivy:resolve] .... (184kB)
[ivy:resolve] .. (0kB)
[ivy:resolve] 	[SUCCESSFUL ] commons-beanutils#commons-beanutils;1.7.0!commons-beanutils.jar (48ms)
[ivy:resolve] downloading http://repo1.maven.org/maven2/org/mortbay/jetty/servlet-api/2.5-20081211/servlet-api-2.5-20081211.jar ...
[ivy:resolve] .... (130kB)
[ivy:resolve] .. (0kB)
[ivy:resolve] 	[SUCCESSFUL ] org.mortbay.jetty#servlet-api;2.5-20081211!servlet-api.jar (57ms)
[ivy:resolve] :: resolution report :: resolve 36181ms :: artifacts dl 1329ms
[ivy:resolve] 	:: evicted modules:
[ivy:resolve] 	org.codehaus.jackson#jackson-core-asl;1.7.1 by [org.codehaus.jackson#jackson-core-asl;1.8.8] in [hadoop0.20S.shim]
[ivy:resolve] 	org.codehaus.jackson#jackson-mapper-asl;1.7.1 by [org.codehaus.jackson#jackson-mapper-asl;1.8.8] in [hadoop0.20S.shim]
[ivy:resolve] 	commons-logging#commons-logging;1.0.3 by [commons-logging#commons-logging;1.1.1] in [hadoop0.20S.shim]
[ivy:resolve] 	commons-codec#commons-codec;1.2 by [commons-codec#commons-codec;1.4] in [hadoop0.20S.shim]
[ivy:resolve] 	commons-logging#commons-logging;1.1 by [commons-logging#commons-logging;1.1.1] in [hadoop0.20S.shim]
[ivy:resolve] 	commons-codec#commons-codec;1.3 by [commons-codec#commons-codec;1.4] in [hadoop0.20S.shim]
[ivy:resolve] 	commons-httpclient#commons-httpclient;3.1 by [commons-httpclient#commons-httpclient;3.0.1] in [hadoop0.20S.shim]
[ivy:resolve] 	org.apache.mina#mina-core;2.0.0-M4 by [org.apache.mina#mina-core;2.0.0-M5] in [hadoop0.20S.shim]
[ivy:resolve] 	org.apache.ftpserver#ftplet-api;1.0.0-M2 by [org.apache.ftpserver#ftplet-api;1.0.0] in [hadoop0.20S.shim]
[ivy:resolve] 	org.apache.ftpserver#ftpserver-core;1.0.0-M2 by [org.apache.ftpserver#ftpserver-core;1.0.0] in [hadoop0.20S.shim]
[ivy:resolve] 	org.apache.mina#mina-core;2.0.0-M2 by [org.apache.mina#mina-core;2.0.0-M5] in [hadoop0.20S.shim]
	---------------------------------------------------------------------
	|                  |            modules            ||   artifacts   |
	|       conf       | number| search|dwnlded|evicted|| number|dwnlded|
	---------------------------------------------------------------------
	| hadoop0.20S.shim |   62  |   30  |   30  |   11  ||   51  |   28  |
	---------------------------------------------------------------------

ivy-retrieve-hadoop-shim:
     [echo] Project: shims
[ivy:retrieve] :: retrieving :: org.apache.hive#hive-shims
[ivy:retrieve] 	confs: [hadoop0.20S.shim]
[ivy:retrieve] 	51 artifacts copied, 0 already retrieved (22876kB/75ms)
    [javac] Compiling 15 source files to /data/hive-ptest/working/apache-svn-trunk-source/build/shims/classes
    [javac] Note: Some input files use or override a deprecated API.
    [javac] Note: Recompile with -Xlint:deprecation for details.
    [javac] Note: Some input files use unchecked or unsafe operations.
    [javac] Note: Recompile with -Xlint:unchecked for details.
     [echo] Building shims 0.23

build-shims:
     [echo] Project: shims
     [echo] Compiling /data/hive-ptest/working/apache-svn-trunk-source/shims/src/common/java;/data/hive-ptest/working/apache-svn-trunk-source/shims/src/common-secure/java;/data/hive-ptest/working/apache-svn-trunk-source/shims/src/0.23/java against hadoop 2.0.5-alpha (/data/hive-ptest/working/apache-svn-trunk-source/build/hadoopcore/hadoop-2.0.5-alpha)

ivy-init-settings:
     [echo] Project: shims

ivy-resolve-hadoop-shim:
     [echo] Project: shims
[ivy:resolve] :: loading settings :: file = /data/hive-ptest/working/apache-svn-trunk-source/ivy/ivysettings.xml
[ivy:resolve] :: resolving dependencies :: org.apache.hive#hive-shims;0.13.0-SNAPSHOT
[ivy:resolve] 	confs: [hadoop0.23.shim]
[ivy:resolve] 	found org.apache.hadoop#hadoop-common;2.0.5-alpha in maven2
[ivy:resolve] 	found org.apache.hadoop#hadoop-annotations;2.0.5-alpha in maven2
[ivy:resolve] 	found com.google.guava#guava;11.0.2 in maven2
[ivy:resolve] 	found com.google.code.findbugs#jsr305;1.3.9 in maven2
[ivy:resolve] 	found commons-cli#commons-cli;1.2 in maven2
[ivy:resolve] 	found org.apache.commons#commons-math;2.1 in maven2
[ivy:resolve] 	found xmlenc#xmlenc;0.52 in maven2
[ivy:resolve] 	found commons-httpclient#commons-httpclient;3.1 in maven2
[ivy:resolve] 	found commons-logging#commons-logging;1.1.1 in maven2
[ivy:resolve] 	found commons-codec#commons-codec;1.4 in maven2
[ivy:resolve] 	found commons-io#commons-io;2.1 in maven2
[ivy:resolve] 	found commons-net#commons-net;3.1 in maven2
[ivy:resolve] 	found javax.servlet#servlet-api;2.5 in maven2
[ivy:resolve] 	found org.mortbay.jetty#jetty;6.1.26 in maven2
[ivy:resolve] 	found org.mortbay.jetty#jetty-util;6.1.26 in maven2
[ivy:resolve] 	found com.sun.jersey#jersey-core;1.8 in maven2
[ivy:resolve] 	found com.sun.jersey#jersey-json;1.8 in maven2
[ivy:resolve] 	found org.codehaus.jettison#jettison;1.1 in maven2
[ivy:resolve] 	found stax#stax-api;1.0.1 in maven2
[ivy:resolve] 	found com.sun.xml.bind#jaxb-impl;2.2.3-1 in maven2
[ivy:resolve] 	found javax.xml.bind#jaxb-api;2.2.2 in maven2
[ivy:resolve] 	found javax.activation#activation;1.1 in maven2
[ivy:resolve] 	found org.codehaus.jackson#jackson-core-asl;1.8.8 in maven2
[ivy:resolve] 	found org.codehaus.jackson#jackson-mapper-asl;1.8.8 in maven2
[ivy:resolve] 	found org.codehaus.jackson#jackson-jaxrs;1.8.8 in maven2
[ivy:resolve] 	found org.codehaus.jackson#jackson-xc;1.8.8 in maven2
[ivy:resolve] 	found com.sun.jersey#jersey-server;1.8 in maven2
[ivy:resolve] 	found asm#asm;3.2 in maven2
[ivy:resolve] 	found log4j#log4j;1.2.17 in maven2
[ivy:resolve] 	found net.java.dev.jets3t#jets3t;0.6.1 in maven2
[ivy:resolve] 	found commons-lang#commons-lang;2.5 in maven2
[ivy:resolve] 	found commons-configuration#commons-configuration;1.6 in maven2
[ivy:resolve] 	found commons-collections#commons-collections;3.2.1 in maven2
[ivy:resolve] 	found commons-digester#commons-digester;1.8 in maven2
[ivy:resolve] 	found commons-beanutils#commons-beanutils;1.7.0 in maven2
[ivy:resolve] 	found commons-beanutils#commons-beanutils-core;1.8.0 in maven2
[ivy:resolve] 	found org.slf4j#slf4j-api;1.6.1 in maven2
[ivy:resolve] 	found org.apache.avro#avro;1.5.3 in maven2
[ivy:resolve] 	found com.thoughtworks.paranamer#paranamer;2.3 in maven2
[ivy:resolve] 	found org.xerial.snappy#snappy-java;1.0.3.2 in maven2
[ivy:resolve] 	found net.sf.kosmosfs#kfs;0.3 in maven2
[ivy:resolve] 	found com.google.protobuf#protobuf-java;2.4.0a in maven2
[ivy:resolve] 	found org.apache.hadoop#hadoop-auth;2.0.5-alpha in maven2
[ivy:resolve] 	found org.slf4j#slf4j-log4j12;1.6.1 in maven2
[ivy:resolve] 	found com.jcraft#jsch;0.1.42 in maven2
[ivy:resolve] 	found org.apache.zookeeper#zookeeper;3.4.2 in maven2
[ivy:resolve] 	found tomcat#jasper-compiler;5.5.23 in maven2
[ivy:resolve] 	found tomcat#jasper-runtime;5.5.23 in maven2
[ivy:resolve] 	found commons-el#commons-el;1.0 in maven2
[ivy:resolve] 	found javax.servlet.jsp#jsp-api;2.1 in maven2
[ivy:resolve] 	found org.apache.hadoop#hadoop-mapreduce-client-core;2.0.5-alpha in maven2
[ivy:resolve] 	found org.apache.hadoop#hadoop-yarn-common;2.0.5-alpha in maven2
[ivy:resolve] 	found org.apache.hadoop#hadoop-yarn-api;2.0.5-alpha in maven2
[ivy:resolve] 	found com.google.inject.extensions#guice-servlet;3.0 in maven2
[ivy:resolve] 	found com.google.inject#guice;3.0 in maven2
[ivy:resolve] 	found javax.inject#javax.inject;1 in maven2
[ivy:resolve] 	found aopalliance#aopalliance;1.0 in maven2
[ivy:resolve] 	found org.sonatype.sisu.inject#cglib;2.2.1-v20090111 in maven2
[ivy:resolve] 	found io.netty#netty;3.5.11.Final in maven2
[ivy:resolve] 	found com.sun.jersey.jersey-test-framework#jersey-test-framework-grizzly2;1.8 in maven2
[ivy:resolve] 	found com.sun.jersey.contribs#jersey-guice;1.8 in maven2
[ivy:resolve] 	found org.apache.hadoop#hadoop-archives;2.0.5-alpha in maven2
[ivy:resolve] 	found org.apache.hadoop#hadoop-hdfs;2.0.5-alpha in maven2
[ivy:resolve] 	found org.apache.hadoop#hadoop-mapreduce-client-jobclient;2.0.5-alpha in maven2
[ivy:resolve] 	found org.apache.hadoop#hadoop-mapreduce-client-common;2.0.5-alpha in maven2
[ivy:resolve] 	found org.apache.hadoop#hadoop-yarn-client;2.0.5-alpha in maven2
[ivy:resolve] 	found org.apache.hadoop#hadoop-yarn-server-common;2.0.5-alpha in maven2
[ivy:resolve] 	found org.apache.hadoop#hadoop-yarn-server-tests;2.0.5-alpha in maven2
[ivy:resolve] 	found org.apache.hadoop#hadoop-yarn-server-nodemanager;2.0.5-alpha in maven2
[ivy:resolve] 	found org.apache.hadoop#hadoop-yarn-server-resourcemanager;2.0.5-alpha in maven2
[ivy:resolve] 	found org.apache.hadoop#hadoop-yarn-server-web-proxy;2.0.5-alpha in maven2
[ivy:resolve] 	found org.apache.hadoop#hadoop-mapreduce-client-app;2.0.5-alpha in maven2
[ivy:resolve] 	found org.apache.hadoop#hadoop-mapreduce-client-shuffle;2.0.5-alpha in maven2
[ivy:resolve] 	found org.apache.hadoop#hadoop-mapreduce-client-hs;2.0.5-alpha in maven2
[ivy:resolve] downloading http://repo1.maven.org/maven2/org/apache/hadoop/hadoop-common/2.0.5-alpha/hadoop-common-2.0.5-alpha.jar ...
[ivy:resolve] ....................................... (2295kB)
[ivy:resolve] .. (0kB)
[ivy:resolve] 	[SUCCESSFUL ] org.apache.hadoop#hadoop-common;2.0.5-alpha!hadoop-common.jar (47ms)
[ivy:resolve] downloading http://repo1.maven.org/maven2/org/apache/hadoop/hadoop-common/2.0.5-alpha/hadoop-common-2.0.5-alpha-tests.jar ...
[ivy:resolve] .................... (1151kB)
[ivy:resolve] .. (0kB)
[ivy:resolve] 	[SUCCESSFUL ] org.apache.hadoop#hadoop-common;2.0.5-alpha!hadoop-common.jar(tests) (26ms)
[ivy:resolve] downloading http://repo1.maven.org/maven2/org/apache/hadoop/hadoop-mapreduce-client-core/2.0.5-alpha/hadoop-mapreduce-client-core-2.0.5-alpha.jar ...
[ivy:resolve] ...................... (1325kB)
[ivy:resolve] .. (0kB)
[ivy:resolve] 	[SUCCESSFUL ] org.apache.hadoop#hadoop-mapreduce-client-core;2.0.5-alpha!hadoop-mapreduce-client-core.jar (27ms)
[ivy:resolve] downloading http://repo1.maven.org/maven2/org/apache/hadoop/hadoop-archives/2.0.5-alpha/hadoop-archives-2.0.5-alpha.jar ...
[ivy:resolve] .. (20kB)
[ivy:resolve] .. (0kB)
[ivy:resolve] 	[SUCCESSFUL ] org.apache.hadoop#hadoop-archives;2.0.5-alpha!hadoop-archives.jar (5ms)
[ivy:resolve] downloading http://repo1.maven.org/maven2/org/apache/hadoop/hadoop-hdfs/2.0.5-alpha/hadoop-hdfs-2.0.5-alpha.jar ...
[ivy:resolve] ........................................................................................................................................................................................................................................................................................................................................................................................................................................................................................................................................................................................................................................................................................................................................................................................................................................................................................................................................................................................................................................................................................................................................................................................................................................................................................................................................................................ (4241kB)
[ivy:resolve] .. (0kB)
[ivy:resolve] 	[SUCCESSFUL ] org.apache.hadoop#hadoop-hdfs;2.0.5-alpha!hadoop-hdfs.jar (298ms)
[ivy:resolve] downloading http://repo1.maven.org/maven2/org/apache/hadoop/hadoop-hdfs/2.0.5-alpha/hadoop-hdfs-2.0.5-alpha-tests.jar ...
[ivy:resolve] ............................ (1631kB)
[ivy:resolve] .. (0kB)
[ivy:resolve] 	[SUCCESSFUL ] org.apache.hadoop#hadoop-hdfs;2.0.5-alpha!hadoop-hdfs.jar(tests) (35ms)
[ivy:resolve] downloading http://repo1.maven.org/maven2/org/apache/hadoop/hadoop-mapreduce-client-jobclient/2.0.5-alpha/hadoop-mapreduce-client-jobclient-2.0.5-alpha-tests.jar ...
[ivy:resolve] ....................... (1350kB)
[ivy:resolve] .. (0kB)
[ivy:resolve] 	[SUCCESSFUL ] org.apache.hadoop#hadoop-mapreduce-client-jobclient;2.0.5-alpha!hadoop-mapreduce-client-jobclient.jar(tests) (30ms)
[ivy:resolve] downloading http://repo1.maven.org/maven2/org/apache/hadoop/hadoop-mapreduce-client-jobclient/2.0.5-alpha/hadoop-mapreduce-client-jobclient-2.0.5-alpha.jar ...
[ivy:resolve] .. (32kB)
[ivy:resolve] .. (0kB)
[ivy:resolve] 	[SUCCESSFUL ] org.apache.hadoop#hadoop-mapreduce-client-jobclient;2.0.5-alpha!hadoop-mapreduce-client-jobclient.jar (7ms)
[ivy:resolve] downloading http://repo1.maven.org/maven2/org/apache/hadoop/hadoop-mapreduce-client-common/2.0.5-alpha/hadoop-mapreduce-client-common-2.0.5-alpha.jar ...
[ivy:resolve] ........... (579kB)
[ivy:resolve] .. (0kB)
[ivy:resolve] 	[SUCCESSFUL ] org.apache.hadoop#hadoop-mapreduce-client-common;2.0.5-alpha!hadoop-mapreduce-client-common.jar (15ms)
[ivy:resolve] downloading http://repo1.maven.org/maven2/org/apache/hadoop/hadoop-yarn-server-tests/2.0.5-alpha/hadoop-yarn-server-tests-2.0.5-alpha-tests.jar ...
[ivy:resolve] .. (39kB)
[ivy:resolve] .. (0kB)
[ivy:resolve] 	[SUCCESSFUL ] org.apache.hadoop#hadoop-yarn-server-tests;2.0.5-alpha!hadoop-yarn-server-tests.jar(tests) (7ms)
[ivy:resolve] downloading http://repo1.maven.org/maven2/org/apache/hadoop/hadoop-mapreduce-client-app/2.0.5-alpha/hadoop-mapreduce-client-app-2.0.5-alpha.jar ...
[ivy:resolve] ......... (463kB)
[ivy:resolve] .. (0kB)
[ivy:resolve] 	[SUCCESSFUL ] org.apache.hadoop#hadoop-mapreduce-client-app;2.0.5-alpha!hadoop-mapreduce-client-app.jar (13ms)
[ivy:resolve] downloading http://repo1.maven.org/maven2/org/apache/hadoop/hadoop-mapreduce-client-hs/2.0.5-alpha/hadoop-mapreduce-client-hs-2.0.5-alpha.jar ...
[ivy:resolve] ... (111kB)
[ivy:resolve] .. (0kB)
[ivy:resolve] 	[SUCCESSFUL ] org.apache.hadoop#hadoop-mapreduce-client-hs;2.0.5-alpha!hadoop-mapreduce-client-hs.jar (7ms)
[ivy:resolve] downloading http://repo1.maven.org/maven2/org/apache/hadoop/hadoop-annotations/2.0.5-alpha/hadoop-annotations-2.0.5-alpha.jar ...
[ivy:resolve] .. (16kB)
[ivy:resolve] .. (0kB)
[ivy:resolve] 	[SUCCESSFUL ] org.apache.hadoop#hadoop-annotations;2.0.5-alpha!hadoop-annotations.jar (5ms)
[ivy:resolve] downloading http://repo1.maven.org/maven2/commons-httpclient/commons-httpclient/3.1/commons-httpclient-3.1.jar ...
[ivy:resolve] ...... (297kB)
[ivy:resolve] .. (0kB)
[ivy:resolve] 	[SUCCESSFUL ] commons-httpclient#commons-httpclient;3.1!commons-httpclient.jar (13ms)
[ivy:resolve] downloading http://repo1.maven.org/maven2/commons-net/commons-net/3.1/commons-net-3.1.jar ...
[ivy:resolve] ...... (266kB)
[ivy:resolve] .. (0kB)
[ivy:resolve] 	[SUCCESSFUL ] commons-net#commons-net;3.1!commons-net.jar (17ms)
[ivy:resolve] downloading http://repo1.maven.org/maven2/javax/servlet/servlet-api/2.5/servlet-api-2.5.jar ...
[ivy:resolve] ... (102kB)
[ivy:resolve] .. (0kB)
[ivy:resolve] 	[SUCCESSFUL ] javax.servlet#servlet-api;2.5!servlet-api.jar (8ms)
[ivy:resolve] downloading http://repo1.maven.org/maven2/log4j/log4j/1.2.17/log4j-1.2.17.jar ...
[ivy:resolve] ......... (478kB)
[ivy:resolve] .. (0kB)
[ivy:resolve] 	[SUCCESSFUL ] log4j#log4j;1.2.17!log4j.jar(bundle) (17ms)
[ivy:resolve] downloading http://repo1.maven.org/maven2/commons-lang/commons-lang/2.5/commons-lang-2.5.jar ...
[ivy:resolve] ...... (272kB)
[ivy:resolve] .. (0kB)
[ivy:resolve] 	[SUCCESSFUL ] commons-lang#commons-lang;2.5!commons-lang.jar (10ms)
[ivy:resolve] downloading http://repo1.maven.org/maven2/org/slf4j/slf4j-api/1.6.1/slf4j-api-1.6.1.jar ...
[ivy:resolve] .. (24kB)
[ivy:resolve] .. (0kB)
[ivy:resolve] 	[SUCCESSFUL ] org.slf4j#slf4j-api;1.6.1!slf4j-api.jar (10ms)
[ivy:resolve] downloading http://repo1.maven.org/maven2/org/apache/avro/avro/1.5.3/avro-1.5.3.jar ...
[ivy:resolve] ...... (257kB)
[ivy:resolve] .. (0kB)
[ivy:resolve] 	[SUCCESSFUL ] org.apache.avro#avro;1.5.3!avro.jar (15ms)
[ivy:resolve] downloading http://repo1.maven.org/maven2/com/google/protobuf/protobuf-java/2.4.0a/protobuf-java-2.4.0a.jar ...
[ivy:resolve] ........ (439kB)
[ivy:resolve] .. (0kB)
[ivy:resolve] 	[SUCCESSFUL ] com.google.protobuf#protobuf-java;2.4.0a!protobuf-java.jar (39ms)
[ivy:resolve] downloading http://repo1.maven.org/maven2/org/apache/hadoop/hadoop-auth/2.0.5-alpha/hadoop-auth-2.0.5-alpha.jar ...
[ivy:resolve] .. (46kB)
[ivy:resolve] .. (0kB)
[ivy:resolve] 	[SUCCESSFUL ] org.apache.hadoop#hadoop-auth;2.0.5-alpha!hadoop-auth.jar (6ms)
[ivy:resolve] downloading http://repo1.maven.org/maven2/com/jcraft/jsch/0.1.42/jsch-0.1.42.jar ...
[ivy:resolve] .... (181kB)
[ivy:resolve] .. (0kB)
[ivy:resolve] 	[SUCCESSFUL ] com.jcraft#jsch;0.1.42!jsch.jar (13ms)
[ivy:resolve] downloading http://repo1.maven.org/maven2/org/apache/zookeeper/zookeeper/3.4.2/zookeeper-3.4.2.jar ...
[ivy:resolve] .............. (746kB)
[ivy:resolve] .. (0kB)
[ivy:resolve] 	[SUCCESSFUL ] org.apache.zookeeper#zookeeper;3.4.2!zookeeper.jar (24ms)
[ivy:resolve] downloading http://repo1.maven.org/maven2/com/google/code/findbugs/jsr305/1.3.9/jsr305-1.3.9.jar ...
[ivy:resolve] .. (32kB)
[ivy:resolve] .. (0kB)
[ivy:resolve] 	[SUCCESSFUL ] com.google.code.findbugs#jsr305;1.3.9!jsr305.jar (5ms)
[ivy:resolve] downloading http://repo1.maven.org/maven2/org/codehaus/jackson/jackson-jaxrs/1.8.8/jackson-jaxrs-1.8.8.jar ...
[ivy:resolve] .. (17kB)
[ivy:resolve] .. (0kB)
[ivy:resolve] 	[SUCCESSFUL ] org.codehaus.jackson#jackson-jaxrs;1.8.8!jackson-jaxrs.jar (9ms)
[ivy:resolve] downloading http://repo1.maven.org/maven2/org/codehaus/jackson/jackson-xc/1.8.8/jackson-xc-1.8.8.jar ...
[ivy:resolve] .. (31kB)
[ivy:resolve] .. (0kB)
[ivy:resolve] 	[SUCCESSFUL ] org.codehaus.jackson#jackson-xc;1.8.8!jackson-xc.jar (31ms)
[ivy:resolve] downloading http://repo1.maven.org/maven2/asm/asm/3.2/asm-3.2.jar ...
[ivy:resolve] .. (42kB)
[ivy:resolve] .. (0kB)
[ivy:resolve] 	[SUCCESSFUL ] asm#asm;3.2!asm.jar (6ms)
[ivy:resolve] downloading http://repo1.maven.org/maven2/com/thoughtworks/paranamer/paranamer/2.3/paranamer-2.3.jar ...
[ivy:resolve] .. (28kB)
[ivy:resolve] .. (0kB)
[ivy:resolve] 	[SUCCESSFUL ] com.thoughtworks.paranamer#paranamer;2.3!paranamer.jar (10ms)
[ivy:resolve] downloading http://repo1.maven.org/maven2/org/xerial/snappy/snappy-java/1.0.3.2/snappy-java-1.0.3.2.jar ...
[ivy:resolve] ................. (972kB)
[ivy:resolve] .. (0kB)
[ivy:resolve] 	[SUCCESSFUL ] org.xerial.snappy#snappy-java;1.0.3.2!snappy-java.jar(bundle) (28ms)
[ivy:resolve] downloading http://repo1.maven.org/maven2/org/slf4j/slf4j-log4j12/1.6.1/slf4j-log4j12-1.6.1.jar ...
[ivy:resolve] .. (9kB)
[ivy:resolve] .. (0kB)
[ivy:resolve] 	[SUCCESSFUL ] org.slf4j#slf4j-log4j12;1.6.1!slf4j-log4j12.jar (10ms)
[ivy:resolve] downloading http://repo1.maven.org/maven2/tomcat/jasper-compiler/5.5.23/jasper-compiler-5.5.23.jar ...
[ivy:resolve] ........ (398kB)
[ivy:resolve] .. (0kB)
[ivy:resolve] 	[SUCCESSFUL ] tomcat#jasper-compiler;5.5.23!jasper-compiler.jar (18ms)
[ivy:resolve] downloading http://repo1.maven.org/maven2/tomcat/jasper-runtime/5.5.23/jasper-runtime-5.5.23.jar ...
[ivy:resolve] ... (75kB)
[ivy:resolve] .. (0kB)
[ivy:resolve] 	[SUCCESSFUL ] tomcat#jasper-runtime;5.5.23!jasper-runtime.jar (15ms)
[ivy:resolve] downloading http://repo1.maven.org/maven2/javax/servlet/jsp/jsp-api/2.1/jsp-api-2.1.jar ...
[ivy:resolve] ... (98kB)
[ivy:resolve] .. (0kB)
[ivy:resolve] 	[SUCCESSFUL ] javax.servlet.jsp#jsp-api;2.1!jsp-api.jar (11ms)
[ivy:resolve] downloading http://repo1.maven.org/maven2/org/apache/hadoop/hadoop-yarn-common/2.0.5-alpha/hadoop-yarn-common-2.0.5-alpha.jar ...
[ivy:resolve] .................. (1050kB)
[ivy:resolve] .. (0kB)
[ivy:resolve] 	[SUCCESSFUL ] org.apache.hadoop#hadoop-yarn-common;2.0.5-alpha!hadoop-yarn-common.jar (23ms)
[ivy:resolve] downloading http://repo1.maven.org/maven2/com/google/inject/extensions/guice-servlet/3.0/guice-servlet-3.0.jar ...
[ivy:resolve] .. (63kB)
[ivy:resolve] .. (0kB)
[ivy:resolve] 	[SUCCESSFUL ] com.google.inject.extensions#guice-servlet;3.0!guice-servlet.jar (6ms)
[ivy:resolve] downloading http://repo1.maven.org/maven2/io/netty/netty/3.5.11.Final/netty-3.5.11.Final.jar ...
[ivy:resolve] ................... (1106kB)
[ivy:resolve] .. (0kB)
[ivy:resolve] 	[SUCCESSFUL ] io.netty#netty;3.5.11.Final!netty.jar(bundle) (24ms)
[ivy:resolve] downloading http://repo1.maven.org/maven2/org/apache/hadoop/hadoop-yarn-api/2.0.5-alpha/hadoop-yarn-api-2.0.5-alpha.jar ...
[ivy:resolve] .................. (1014kB)
[ivy:resolve] .. (0kB)
[ivy:resolve] 	[SUCCESSFUL ] org.apache.hadoop#hadoop-yarn-api;2.0.5-alpha!hadoop-yarn-api.jar (23ms)
[ivy:resolve] downloading http://repo1.maven.org/maven2/com/google/inject/guice/3.0/guice-3.0.jar ...
[ivy:resolve] ............ (693kB)
[ivy:resolve] .. (0kB)
[ivy:resolve] 	[SUCCESSFUL ] com.google.inject#guice;3.0!guice.jar (17ms)
[ivy:resolve] downloading http://repo1.maven.org/maven2/com/sun/jersey/jersey-test-framework/jersey-test-framework-grizzly2/1.8/jersey-test-framework-grizzly2-1.8.jar ...
[ivy:resolve] .. (12kB)
[ivy:resolve] .. (0kB)
[ivy:resolve] 	[SUCCESSFUL ] com.sun.jersey.jersey-test-framework#jersey-test-framework-grizzly2;1.8!jersey-test-framework-grizzly2.jar (6ms)
[ivy:resolve] downloading http://repo1.maven.org/maven2/com/sun/jersey/contribs/jersey-guice/1.8/jersey-guice-1.8.jar ...
[ivy:resolve] .. (14kB)
[ivy:resolve] .. (0kB)
[ivy:resolve] 	[SUCCESSFUL ] com.sun.jersey.contribs#jersey-guice;1.8!jersey-guice.jar (6ms)
[ivy:resolve] downloading http://repo1.maven.org/maven2/javax/inject/javax.inject/1/javax.inject-1.jar ...
[ivy:resolve] .. (2kB)
[ivy:resolve] .. (0kB)
[ivy:resolve] 	[SUCCESSFUL ] javax.inject#javax.inject;1!javax.inject.jar (9ms)
[ivy:resolve] downloading http://repo1.maven.org/maven2/aopalliance/aopalliance/1.0/aopalliance-1.0.jar ...
[ivy:resolve] .. (4kB)
[ivy:resolve] .. (0kB)
[ivy:resolve] 	[SUCCESSFUL ] aopalliance#aopalliance;1.0!aopalliance.jar (5ms)
[ivy:resolve] downloading http://repo1.maven.org/maven2/org/sonatype/sisu/inject/cglib/2.2.1-v20090111/cglib-2.2.1-v20090111.jar ...
[ivy:resolve] ...... (272kB)
[ivy:resolve] .. (0kB)
[ivy:resolve] 	[SUCCESSFUL ] org.sonatype.sisu.inject#cglib;2.2.1-v20090111!cglib.jar (15ms)
[ivy:resolve] downloading http://repo1.maven.org/maven2/org/apache/hadoop/hadoop-yarn-client/2.0.5-alpha/hadoop-yarn-client-2.0.5-alpha.jar ...
[ivy:resolve] .. (28kB)
[ivy:resolve] .. (0kB)
[ivy:resolve] 	[SUCCESSFUL ] org.apache.hadoop#hadoop-yarn-client;2.0.5-alpha!hadoop-yarn-client.jar (5ms)
[ivy:resolve] downloading http://repo1.maven.org/maven2/org/apache/hadoop/hadoop-yarn-server-common/2.0.5-alpha/hadoop-yarn-server-common-2.0.5-alpha.jar ...
[ivy:resolve] .... (148kB)
[ivy:resolve] .. (0kB)
[ivy:resolve] 	[SUCCESSFUL ] org.apache.hadoop#hadoop-yarn-server-common;2.0.5-alpha!hadoop-yarn-server-common.jar (8ms)
[ivy:resolve] downloading http://repo1.maven.org/maven2/org/apache/hadoop/hadoop-yarn-server-nodemanager/2.0.5-alpha/hadoop-yarn-server-nodemanager-2.0.5-alpha.jar ...
[ivy:resolve] ........ (404kB)
[ivy:resolve] .. (0kB)
[ivy:resolve] 	[SUCCESSFUL ] org.apache.hadoop#hadoop-yarn-server-nodemanager;2.0.5-alpha!hadoop-yarn-server-nodemanager.jar (12ms)
[ivy:resolve] downloading http://repo1.maven.org/maven2/org/apache/hadoop/hadoop-yarn-server-resourcemanager/2.0.5-alpha/hadoop-yarn-server-resourcemanager-2.0.5-alpha.jar ...
[ivy:resolve] .......... (517kB)
[ivy:resolve] .. (0kB)
[ivy:resolve] 	[SUCCESSFUL ] org.apache.hadoop#hadoop-yarn-server-resourcemanager;2.0.5-alpha!hadoop-yarn-server-resourcemanager.jar (14ms)
[ivy:resolve] downloading http://repo1.maven.org/maven2/org/apache/hadoop/hadoop-yarn-server-web-proxy/2.0.5-alpha/hadoop-yarn-server-web-proxy-2.0.5-alpha.jar ...
[ivy:resolve] .. (24kB)
[ivy:resolve] .. (0kB)
[ivy:resolve] 	[SUCCESSFUL ] org.apache.hadoop#hadoop-yarn-server-web-proxy;2.0.5-alpha!hadoop-yarn-server-web-proxy.jar (6ms)
[ivy:resolve] downloading http://repo1.maven.org/maven2/org/apache/hadoop/hadoop-mapreduce-client-shuffle/2.0.5-alpha/hadoop-mapreduce-client-shuffle-2.0.5-alpha.jar ...
[ivy:resolve] .. (20kB)
[ivy:resolve] .. (0kB)
[ivy:resolve] 	[SUCCESSFUL ] org.apache.hadoop#hadoop-mapreduce-client-shuffle;2.0.5-alpha!hadoop-mapreduce-client-shuffle.jar (5ms)
[ivy:resolve] :: resolution report :: resolve 64293ms :: artifacts dl 1139ms
	---------------------------------------------------------------------
	|                  |            modules            ||   artifacts   |
	|       conf       | number| search|dwnlded|evicted|| number|dwnlded|
	---------------------------------------------------------------------
	|  hadoop0.23.shim |   74  |   47  |   47  |   0   ||   77  |   50  |
	---------------------------------------------------------------------

ivy-retrieve-hadoop-shim:
     [echo] Project: shims
[ivy:retrieve] :: retrieving :: org.apache.hive#hive-shims
[ivy:retrieve] 	confs: [hadoop0.23.shim]
[ivy:retrieve] 	77 artifacts copied, 0 already retrieved (31997kB/108ms)
    [javac] Compiling 3 source files to /data/hive-ptest/working/apache-svn-trunk-source/build/shims/classes
    [javac] Note: /data/hive-ptest/working/apache-svn-trunk-source/shims/src/0.23/java/org/apache/hadoop/hive/shims/Hadoop23Shims.java uses or overrides a deprecated API.
    [javac] Note: Recompile with -Xlint:deprecation for details.

jar:
     [echo] Project: shims
      [jar] Building jar: /data/hive-ptest/working/apache-svn-trunk-source/build/shims/hive-shims-0.13.0-SNAPSHOT.jar
[ivy:publish] :: delivering :: org.apache.hive#hive-shims;0.13.0-SNAPSHOT :: 0.13.0-SNAPSHOT :: integration :: Fri Sep 06 22:48:50 EDT 2013
[ivy:publish] 	delivering ivy file to /data/hive-ptest/working/apache-svn-trunk-source/build/shims/ivy-0.13.0-SNAPSHOT.xml
[ivy:publish] :: publishing :: org.apache.hive#hive-shims
[ivy:publish] 	published hive-shims to /data/hive-ptest/working/ivy/local/org.apache.hive/hive-shims/0.13.0-SNAPSHOT/jars/hive-shims.jar
[ivy:publish] 	published ivy to /data/hive-ptest/working/ivy/local/org.apache.hive/hive-shims/0.13.0-SNAPSHOT/ivys/ivy.xml

ivy-init-settings:
     [echo] Project: common

check-ivy:
     [echo] Project: common

ivy-resolve:
     [echo] Project: common
[ivy:resolve] :: loading settings :: file = /data/hive-ptest/working/apache-svn-trunk-source/ivy/ivysettings.xml
[ivy:resolve] :: resolving dependencies :: org.apache.hive#hive-common;0.13.0-SNAPSHOT
[ivy:resolve] 	confs: [default]
[ivy:resolve] 	found org.apache.hive#hive-shims;0.13.0-SNAPSHOT in local
[ivy:resolve] 	found commons-cli#commons-cli;1.2 in maven2
[ivy:resolve] 	found org.apache.commons#commons-compress;1.4.1 in maven2
[ivy:resolve] 	found org.tukaani#xz;1.0 in maven2
[ivy:resolve] 	found commons-lang#commons-lang;2.4 in maven2
[ivy:resolve] 	found log4j#log4j;1.2.16 in maven2
[ivy:resolve] downloading /data/hive-ptest/working/ivy/local/org.apache.hive/hive-shims/0.13.0-SNAPSHOT/jars/hive-shims.jar ...
[ivy:resolve] .... (140kB)
[ivy:resolve] .. (0kB)
[ivy:resolve] 	[SUCCESSFUL ] org.apache.hive#hive-shims;0.13.0-SNAPSHOT!hive-shims.jar (4ms)
[ivy:resolve] downloading http://repo1.maven.org/maven2/org/apache/commons/commons-compress/1.4.1/commons-compress-1.4.1.jar ...
[ivy:resolve] ..... (235kB)
[ivy:resolve] .. (0kB)
[ivy:resolve] 	[SUCCESSFUL ] org.apache.commons#commons-compress;1.4.1!commons-compress.jar (14ms)
[ivy:resolve] downloading http://repo1.maven.org/maven2/org/tukaani/xz/1.0/xz-1.0.jar ...
[ivy:resolve] ... (92kB)
[ivy:resolve] .. (0kB)
[ivy:resolve] 	[SUCCESSFUL ] org.tukaani#xz;1.0!xz.jar (12ms)
[ivy:resolve] :: resolution report :: resolve 9206ms :: artifacts dl 36ms
	---------------------------------------------------------------------
	|                  |            modules            ||   artifacts   |
	|       conf       | number| search|dwnlded|evicted|| number|dwnlded|
	---------------------------------------------------------------------
	|      default     |   6   |   3   |   3   |   0   ||   6   |   3   |
	---------------------------------------------------------------------
[ivy:report] Processing /data/hive-ptest/working/apache-svn-trunk-source/build/ivy/resolution-cache/org.apache.hive-hive-common-default.xml to /data/hive-ptest/working/apache-svn-trunk-source/build/ivy/report/org.apache.hive-hive-common-default.html

make-pom:
     [echo] Project: common
     [echo]  Writing POM to /data/hive-ptest/working/apache-svn-trunk-source/build/common/pom.xml
[ivy:makepom] DEPRECATED: 'ivy.conf.file' is deprecated, use 'ivy.settings.file' instead
[ivy:makepom] :: loading settings :: file = /data/hive-ptest/working/apache-svn-trunk-source/ivy/ivysettings.xml

create-dirs:
     [echo] Project: common

init:
     [echo] Project: common

setup:
     [echo] Project: common

ivy-retrieve:
     [echo] Project: common
[ivy:retrieve] :: retrieving :: org.apache.hive#hive-common
[ivy:retrieve] 	confs: [default]
[ivy:retrieve] 	4 artifacts copied, 2 already retrieved (508kB/6ms)

compile:
     [echo] Project: common
    [javac] Compiling 25 source files to /data/hive-ptest/working/apache-svn-trunk-source/build/common/classes
    [javac] Note: /data/hive-ptest/working/apache-svn-trunk-source/common/src/java/org/apache/hadoop/hive/common/ObjectPair.java uses unchecked or unsafe operations.
    [javac] Note: Recompile with -Xlint:unchecked for details.
     [copy] Copying 1 file to /data/hive-ptest/working/apache-svn-trunk-source/build/common/classes

jar:
     [echo] Project: common
      [jar] Building jar: /data/hive-ptest/working/apache-svn-trunk-source/build/common/hive-common-0.13.0-SNAPSHOT.jar
[ivy:publish] :: delivering :: org.apache.hive#hive-common;0.13.0-SNAPSHOT :: 0.13.0-SNAPSHOT :: integration :: Fri Sep 06 22:49:19 EDT 2013
[ivy:publish] 	delivering ivy file to /data/hive-ptest/working/apache-svn-trunk-source/build/common/ivy-0.13.0-SNAPSHOT.xml
[ivy:publish] :: publishing :: org.apache.hive#hive-common
[ivy:publish] 	published hive-common to /data/hive-ptest/working/ivy/local/org.apache.hive/hive-common/0.13.0-SNAPSHOT/jars/hive-common.jar
[ivy:publish] 	published ivy to /data/hive-ptest/working/ivy/local/org.apache.hive/hive-common/0.13.0-SNAPSHOT/ivys/ivy.xml

ivy-init-settings:
     [echo] Project: serde

check-ivy:
     [echo] Project: serde

ivy-resolve:
     [echo] Project: serde
[ivy:resolve] :: loading settings :: file = /data/hive-ptest/working/apache-svn-trunk-source/ivy/ivysettings.xml
[ivy:resolve] :: resolving dependencies :: org.apache.hive#hive-serde;0.13.0-SNAPSHOT
[ivy:resolve] 	confs: [default]
[ivy:resolve] 	found org.apache.hive#hive-common;0.13.0-SNAPSHOT in local
[ivy:resolve] 	found org.apache.hive#hive-shims;0.13.0-SNAPSHOT in local
[ivy:resolve] 	found commons-cli#commons-cli;1.2 in maven2
[ivy:resolve] 	found org.apache.commons#commons-compress;1.4.1 in maven2
[ivy:resolve] 	found org.tukaani#xz;1.0 in maven2
[ivy:resolve] 	found commons-lang#commons-lang;2.4 in maven2
[ivy:resolve] 	found log4j#log4j;1.2.16 in maven2
[ivy:resolve] 	found org.slf4j#slf4j-api;1.6.1 in maven2
[ivy:resolve] 	found org.slf4j#slf4j-log4j12;1.6.1 in maven2
[ivy:resolve] 	found org.mockito#mockito-all;1.8.2 in maven2
[ivy:resolve] 	found org.apache.thrift#libfb303;0.9.0 in maven2
[ivy:resolve] 	found commons-codec#commons-codec;1.4 in maven2
[ivy:resolve] 	found org.apache.avro#avro;1.7.1 in maven2
[ivy:resolve] 	found org.apache.avro#avro-mapred;1.7.1 in maven2
[ivy:resolve] downloading /data/hive-ptest/working/ivy/local/org.apache.hive/hive-common/0.13.0-SNAPSHOT/jars/hive-common.jar ...
[ivy:resolve] ... (95kB)
[ivy:resolve] .. (0kB)
[ivy:resolve] 	[SUCCESSFUL ] org.apache.hive#hive-common;0.13.0-SNAPSHOT!hive-common.jar (3ms)
[ivy:resolve] downloading http://repo1.maven.org/maven2/org/mockito/mockito-all/1.8.2/mockito-all-1.8.2.jar ...
[ivy:resolve] ...................... (1315kB)
[ivy:resolve] .. (0kB)
[ivy:resolve] 	[SUCCESSFUL ] org.mockito#mockito-all;1.8.2!mockito-all.jar (27ms)
[ivy:resolve] downloading http://repo1.maven.org/maven2/org/apache/thrift/libfb303/0.9.0/libfb303-0.9.0.jar ...
[ivy:resolve] ...... (268kB)
[ivy:resolve] .. (0kB)
[ivy:resolve] 	[SUCCESSFUL ] org.apache.thrift#libfb303;0.9.0!libfb303.jar (14ms)
[ivy:resolve] downloading http://repo1.maven.org/maven2/org/apache/avro/avro/1.7.1/avro-1.7.1.jar ...
[ivy:resolve] ...... (290kB)
[ivy:resolve] .. (0kB)
[ivy:resolve] 	[SUCCESSFUL ] org.apache.avro#avro;1.7.1!avro.jar (10ms)
[ivy:resolve] downloading http://repo1.maven.org/maven2/org/apache/avro/avro-mapred/1.7.1/avro-mapred-1.7.1.jar ...
[ivy:resolve] .... (164kB)
[ivy:resolve] .. (0kB)
[ivy:resolve] 	[SUCCESSFUL ] org.apache.avro#avro-mapred;1.7.1!avro-mapred.jar (8ms)
[ivy:resolve] :: resolution report :: resolve 7401ms :: artifacts dl 74ms
	---------------------------------------------------------------------
	|                  |            modules            ||   artifacts   |
	|       conf       | number| search|dwnlded|evicted|| number|dwnlded|
	---------------------------------------------------------------------
	|      default     |   14  |   5   |   5   |   0   ||   14  |   5   |
	---------------------------------------------------------------------
[ivy:report] Processing /data/hive-ptest/working/apache-svn-trunk-source/build/ivy/resolution-cache/org.apache.hive-hive-serde-default.xml to /data/hive-ptest/working/apache-svn-trunk-source/build/ivy/report/org.apache.hive-hive-serde-default.html

make-pom:
     [echo] Project: serde
     [echo]  Writing POM to /data/hive-ptest/working/apache-svn-trunk-source/build/serde/pom.xml
[ivy:makepom] DEPRECATED: 'ivy.conf.file' is deprecated, use 'ivy.settings.file' instead
[ivy:makepom] :: loading settings :: file = /data/hive-ptest/working/apache-svn-trunk-source/ivy/ivysettings.xml

create-dirs:
     [echo] Project: serde
     [copy] Warning: /data/hive-ptest/working/apache-svn-trunk-source/serde/src/test/resources does not exist.

init:
     [echo] Project: serde

ivy-retrieve:
     [echo] Project: serde
[ivy:retrieve] :: retrieving :: org.apache.hive#hive-serde
[ivy:retrieve] 	confs: [default]
[ivy:retrieve] 	8 artifacts copied, 6 already retrieved (2227kB/25ms)

dynamic-serde:

compile:
     [echo] Project: serde
    [javac] Compiling 325 source files to /data/hive-ptest/working/apache-svn-trunk-source/build/serde/classes
    [javac] Note: Some input files use or override a deprecated API.
    [javac] Note: Recompile with -Xlint:deprecation for details.
    [javac] Note: Some input files use unchecked or unsafe operations.
    [javac] Note: Recompile with -Xlint:unchecked for details.
    [javac] Creating empty /data/hive-ptest/working/apache-svn-trunk-source/build/serde/classes/org/apache/hadoop/hive/serde2/typeinfo/package-info.class

jar:
     [echo] Project: serde
      [jar] Building jar: /data/hive-ptest/working/apache-svn-trunk-source/build/serde/hive-serde-0.13.0-SNAPSHOT.jar
[ivy:publish] :: delivering :: org.apache.hive#hive-serde;0.13.0-SNAPSHOT :: 0.13.0-SNAPSHOT :: integration :: Fri Sep 06 22:49:38 EDT 2013
[ivy:publish] 	delivering ivy file to /data/hive-ptest/working/apache-svn-trunk-source/build/serde/ivy-0.13.0-SNAPSHOT.xml
[ivy:publish] :: publishing :: org.apache.hive#hive-serde
[ivy:publish] 	published hive-serde to /data/hive-ptest/working/ivy/local/org.apache.hive/hive-serde/0.13.0-SNAPSHOT/jars/hive-serde.jar
[ivy:publish] 	published ivy to /data/hive-ptest/working/ivy/local/org.apache.hive/hive-serde/0.13.0-SNAPSHOT/ivys/ivy.xml

ivy-init-settings:
     [echo] Project: metastore

check-ivy:
     [echo] Project: metastore

ivy-resolve:
     [echo] Project: metastore
[ivy:resolve] :: loading settings :: file = /data/hive-ptest/working/apache-svn-trunk-source/ivy/ivysettings.xml
[ivy:resolve] :: resolving dependencies :: org.apache.hive#hive-metastore;0.13.0-SNAPSHOT
[ivy:resolve] 	confs: [default]
[ivy:resolve] 	found org.apache.hive#hive-serde;0.13.0-SNAPSHOT in local
[ivy:resolve] 	found org.apache.hive#hive-common;0.13.0-SNAPSHOT in local
[ivy:resolve] 	found org.apache.hive#hive-shims;0.13.0-SNAPSHOT in local
[ivy:resolve] 	found commons-cli#commons-cli;1.2 in maven2
[ivy:resolve] 	found org.apache.commons#commons-compress;1.4.1 in maven2
[ivy:resolve] 	found org.tukaani#xz;1.0 in maven2
[ivy:resolve] 	found commons-lang#commons-lang;2.4 in maven2
[ivy:resolve] 	found log4j#log4j;1.2.16 in maven2
[ivy:resolve] 	found org.slf4j#slf4j-api;1.6.1 in maven2
[ivy:resolve] 	found org.slf4j#slf4j-log4j12;1.6.1 in maven2
[ivy:resolve] 	found org.mockito#mockito-all;1.8.2 in maven2
[ivy:resolve] 	found org.apache.thrift#libfb303;0.9.0 in maven2
[ivy:resolve] 	found commons-codec#commons-codec;1.4 in maven2
[ivy:resolve] 	found org.apache.avro#avro;1.7.1 in maven2
[ivy:resolve] 	found org.apache.avro#avro-mapred;1.7.1 in maven2
[ivy:resolve] 	found org.antlr#antlr;3.4 in maven2
[ivy:resolve] 	found org.antlr#antlr-runtime;3.4 in maven2
[ivy:resolve] 	found org.antlr#ST4;4.0.4 in maven2
[ivy:resolve] 	found com.jolbox#bonecp;0.7.1.RELEASE in maven2
[ivy:resolve] 	found com.google.guava#guava;r08 in maven2
[ivy:resolve] 	found commons-pool#commons-pool;1.5.4 in maven2
[ivy:resolve] 	found org.datanucleus#datanucleus-api-jdo;3.2.1 in maven2
[ivy:resolve] 	found org.datanucleus#datanucleus-core;3.2.2 in maven2
[ivy:resolve] 	found org.datanucleus#datanucleus-rdbms;3.2.1 in maven2
[ivy:resolve] 	found javax.jdo#jdo-api;3.0.1 in maven2
[ivy:resolve] 	found org.apache.derby#derby;10.4.2.0 in maven2
[ivy:resolve] downloading /data/hive-ptest/working/ivy/local/org.apache.hive/hive-serde/0.13.0-SNAPSHOT/jars/hive-serde.jar ...
[ivy:resolve] ............ (663kB)
[ivy:resolve] .. (0kB)
[ivy:resolve] 	[SUCCESSFUL ] org.apache.hive#hive-serde;0.13.0-SNAPSHOT!hive-serde.jar (19ms)
[ivy:resolve] downloading http://repo1.maven.org/maven2/org/antlr/antlr/3.4/antlr-3.4.jar ...
[ivy:resolve] ................... (1086kB)
[ivy:resolve] .. (0kB)
[ivy:resolve] 	[SUCCESSFUL ] org.antlr#antlr;3.4!antlr.jar (38ms)
[ivy:resolve] downloading http://repo1.maven.org/maven2/org/antlr/antlr-runtime/3.4/antlr-runtime-3.4.jar ...
[ivy:resolve] .... (160kB)
[ivy:resolve] .. (0kB)
[ivy:resolve] 	[SUCCESSFUL ] org.antlr#antlr-runtime;3.4!antlr-runtime.jar (8ms)
[ivy:resolve] downloading http://repo1.maven.org/maven2/org/antlr/ST4/4.0.4/ST4-4.0.4.jar ...
[ivy:resolve] ..... (231kB)
[ivy:resolve] .. (0kB)
[ivy:resolve] 	[SUCCESSFUL ] org.antlr#ST4;4.0.4!ST4.jar (8ms)
[ivy:resolve] downloading http://repo1.maven.org/maven2/com/jolbox/bonecp/0.7.1.RELEASE/bonecp-0.7.1.RELEASE.jar ...
[ivy:resolve] ... (112kB)
[ivy:resolve] .. (0kB)
[ivy:resolve] 	[SUCCESSFUL ] com.jolbox#bonecp;0.7.1.RELEASE!bonecp.jar(bundle) (36ms)
[ivy:resolve] downloading http://repo1.maven.org/maven2/commons-pool/commons-pool/1.5.4/commons-pool-1.5.4.jar ...
[ivy:resolve] ... (93kB)
[ivy:resolve] .. (0kB)
[ivy:resolve] 	[SUCCESSFUL ] commons-pool#commons-pool;1.5.4!commons-pool.jar (7ms)
[ivy:resolve] downloading http://repo1.maven.org/maven2/org/datanucleus/datanucleus-api-jdo/3.2.1/datanucleus-api-jdo-3.2.1.jar ...
[ivy:resolve] ....... (329kB)
[ivy:resolve] .. (0kB)
[ivy:resolve] 	[SUCCESSFUL ] org.datanucleus#datanucleus-api-jdo;3.2.1!datanucleus-api-jdo.jar (10ms)
[ivy:resolve] downloading http://repo1.maven.org/maven2/org/datanucleus/datanucleus-core/3.2.2/datanucleus-core-3.2.2.jar ...
[ivy:resolve] ............................. (1759kB)
[ivy:resolve] .. (0kB)
[ivy:resolve] 	[SUCCESSFUL ] org.datanucleus#datanucleus-core;3.2.2!datanucleus-core.jar (36ms)
[ivy:resolve] downloading http://repo1.maven.org/maven2/org/datanucleus/datanucleus-rdbms/3.2.1/datanucleus-rdbms-3.2.1.jar ...
[ivy:resolve] ............................. (1728kB)
[ivy:resolve] .. (0kB)
[ivy:resolve] 	[SUCCESSFUL ] org.datanucleus#datanucleus-rdbms;3.2.1!datanucleus-rdbms.jar (35ms)
[ivy:resolve] downloading http://repo1.maven.org/maven2/javax/jdo/jdo-api/3.0.1/jdo-api-3.0.1.jar ...
[ivy:resolve] ..... (196kB)
[ivy:resolve] .. (0kB)
[ivy:resolve] 	[SUCCESSFUL ] javax.jdo#jdo-api;3.0.1!jdo-api.jar (38ms)
[ivy:resolve] downloading http://repo1.maven.org/maven2/org/apache/derby/derby/10.4.2.0/derby-10.4.2.0.jar ...
[ivy:resolve] ....................................... (2389kB)
[ivy:resolve] .. (0kB)
[ivy:resolve] 	[SUCCESSFUL ] org.apache.derby#derby;10.4.2.0!derby.jar (85ms)
[ivy:resolve] downloading http://repo1.maven.org/maven2/com/google/guava/guava/r08/guava-r08.jar ...
[ivy:resolve] ................... (1088kB)
[ivy:resolve] .. (0kB)
[ivy:resolve] 	[SUCCESSFUL ] com.google.guava#guava;r08!guava.jar (72ms)
[ivy:resolve] :: resolution report :: resolve 10845ms :: artifacts dl 419ms
[ivy:resolve] 	:: evicted modules:
[ivy:resolve] 	org.slf4j#slf4j-api;1.5.10 by [org.slf4j#slf4j-api;1.6.1] in [default]
	---------------------------------------------------------------------
	|                  |            modules            ||   artifacts   |
	|       conf       | number| search|dwnlded|evicted|| number|dwnlded|
	---------------------------------------------------------------------
	|      default     |   27  |   12  |   12  |   1   ||   26  |   12  |
	---------------------------------------------------------------------
[ivy:report] Processing /data/hive-ptest/working/apache-svn-trunk-source/build/ivy/resolution-cache/org.apache.hive-hive-metastore-default.xml to /data/hive-ptest/working/apache-svn-trunk-source/build/ivy/report/org.apache.hive-hive-metastore-default.html

make-pom:
     [echo] Project: metastore
     [echo]  Writing POM to /data/hive-ptest/working/apache-svn-trunk-source/build/metastore/pom.xml
[ivy:makepom] DEPRECATED: 'ivy.conf.file' is deprecated, use 'ivy.settings.file' instead
[ivy:makepom] :: loading settings :: file = /data/hive-ptest/working/apache-svn-trunk-source/ivy/ivysettings.xml

create-dirs:
     [echo] Project: metastore
     [copy] Warning: /data/hive-ptest/working/apache-svn-trunk-source/metastore/src/test/resources does not exist.

init:
     [echo] Project: metastore

metastore-init:
     [echo] Project: metastore
    [mkdir] Created dir: /data/hive-ptest/working/apache-svn-trunk-source/build/metastore/gen/antlr/gen-java/org/apache/hadoop/hive/metastore/parser

ivy-retrieve:
     [echo] Project: metastore
[ivy:retrieve] :: retrieving :: org.apache.hive#hive-metastore
[ivy:retrieve] 	confs: [default]
[ivy:retrieve] 	12 artifacts copied, 14 already retrieved (9838kB/31ms)

build-grammar:
     [echo] Project: metastore
     [echo] Building Grammar /data/hive-ptest/working/apache-svn-trunk-source/metastore/src/java/org/apache/hadoop/hive/metastore/parser/Filter.g  ....

model-compile:
     [echo] Project: metastore
    [javac] Compiling 24 source files to /data/hive-ptest/working/apache-svn-trunk-source/build/metastore/classes
     [copy] Copying 1 file to /data/hive-ptest/working/apache-svn-trunk-source/build/metastore/classes

core-compile:
     [echo] Project: metastore
    [javac] Compiling 104 source files to /data/hive-ptest/working/apache-svn-trunk-source/build/metastore/classes
    [javac] Note: Some input files use or override a deprecated API.
    [javac] Note: Recompile with -Xlint:deprecation for details.
    [javac] Note: Some input files use unchecked or unsafe operations.
    [javac] Note: Recompile with -Xlint:unchecked for details.
    [javac] Creating empty /data/hive-ptest/working/apache-svn-trunk-source/build/metastore/classes/org/apache/hadoop/hive/metastore/parser/package-info.class

model-enhance:
     [echo] Project: metastore
[datanucleusenhancer] log4j:WARN No appenders could be found for logger (DataNucleus.General).
[datanucleusenhancer] log4j:WARN Please initialize the log4j system properly.
[datanucleusenhancer] log4j:WARN See http://logging.apache.org/log4j/1.2/faq.html#noconfig for more info.
[datanucleusenhancer] DataNucleus Enhancer (version 3.2.2) for API "JDO" using JRE "1.6"
[datanucleusenhancer] DataNucleus Enhancer : Classpath
[datanucleusenhancer] >>  /data/hive-ptest/working/apache-svn-trunk-source/build/service/classes
[datanucleusenhancer] >>  /data/hive-ptest/working/apache-svn-trunk-source/build/common/classes
[datanucleusenhancer] >>  /data/hive-ptest/working/apache-svn-trunk-source/build/serde/classes
[datanucleusenhancer] >>  /data/hive-ptest/working/apache-svn-trunk-source/build/metastore/classes
[datanucleusenhancer] >>  /data/hive-ptest/working/apache-svn-trunk-source/build/ql/classes
[datanucleusenhancer] >>  /data/hive-ptest/working/apache-svn-trunk-source/build/beeline/classes
[datanucleusenhancer] >>  /data/hive-ptest/working/apache-svn-trunk-source/build/cli/classes
[datanucleusenhancer] >>  /data/hive-ptest/working/apache-svn-trunk-source/build/shims/classes
[datanucleusenhancer] >>  /data/hive-ptest/working/apache-svn-trunk-source/build/hwi/classes
[datanucleusenhancer] >>  /data/hive-ptest/working/apache-svn-trunk-source/build/jdbc/classes
[datanucleusenhancer] >>  /data/hive-ptest/working/apache-svn-trunk-source/build/hbase-handler/classes
[datanucleusenhancer] >>  /data/hive-ptest/working/apache-svn-trunk-source/build/anttasks/hive-anttasks-0.13.0-SNAPSHOT.jar
[datanucleusenhancer] >>  /data/hive-ptest/working/apache-svn-trunk-source/build/common/hive-common-0.13.0-SNAPSHOT.jar
[datanucleusenhancer] >>  /data/hive-ptest/working/apache-svn-trunk-source/build/serde/hive-serde-0.13.0-SNAPSHOT.jar
[datanucleusenhancer] >>  /data/hive-ptest/working/apache-svn-trunk-source/build/shims/hive-shims-0.13.0-SNAPSHOT.jar
[datanucleusenhancer] >>  /data/hive-ptest/working/apache-svn-trunk-source/build/ivy/lib/hadoop0.20S.shim/activation-1.1.jar
[datanucleusenhancer] >>  /data/hive-ptest/working/apache-svn-trunk-source/build/ivy/lib/hadoop0.20S.shim/ant-1.6.5.jar
[datanucleusenhancer] >>  /data/hive-ptest/working/apache-svn-trunk-source/build/ivy/lib/hadoop0.20S.shim/asm-3.1.jar
[datanucleusenhancer] >>  /data/hive-ptest/working/apache-svn-trunk-source/build/ivy/lib/hadoop0.20S.shim/commons-beanutils-1.7.0.jar
[datanucleusenhancer] >>  /data/hive-ptest/working/apache-svn-trunk-source/build/ivy/lib/hadoop0.20S.shim/commons-beanutils-core-1.8.0.jar
[datanucleusenhancer] >>  /data/hive-ptest/working/apache-svn-trunk-source/build/ivy/lib/hadoop0.20S.shim/commons-cli-1.2.jar
[datanucleusenhancer] >>  /data/hive-ptest/working/apache-svn-trunk-source/build/ivy/lib/hadoop0.20S.shim/commons-codec-1.4.jar
[datanucleusenhancer] >>  /data/hive-ptest/working/apache-svn-trunk-source/build/ivy/lib/hadoop0.20S.shim/commons-collections-3.2.1.jar
[datanucleusenhancer] >>  /data/hive-ptest/working/apache-svn-trunk-source/build/ivy/lib/hadoop0.20S.shim/commons-configuration-1.6.jar
[datanucleusenhancer] >>  /data/hive-ptest/working/apache-svn-trunk-source/build/ivy/lib/hadoop0.20S.shim/commons-digester-1.8.jar
[datanucleusenhancer] >>  /data/hive-ptest/working/apache-svn-trunk-source/build/ivy/lib/hadoop0.20S.shim/commons-el-1.0.jar
[datanucleusenhancer] >>  /data/hive-ptest/working/apache-svn-trunk-source/build/ivy/lib/hadoop0.20S.shim/commons-httpclient-3.0.1.jar
[datanucleusenhancer] >>  /data/hive-ptest/working/apache-svn-trunk-source/build/ivy/lib/hadoop0.20S.shim/commons-io-2.1.jar
[datanucleusenhancer] >>  /data/hive-ptest/working/apache-svn-trunk-source/build/ivy/lib/hadoop0.20S.shim/commons-lang-2.4.jar
[datanucleusenhancer] >>  /data/hive-ptest/working/apache-svn-trunk-source/build/ivy/lib/hadoop0.20S.shim/commons-logging-1.1.1.jar
[datanucleusenhancer] >>  /data/hive-ptest/working/apache-svn-trunk-source/build/ivy/lib/hadoop0.20S.shim/commons-math-2.1.jar
[datanucleusenhancer] >>  /data/hive-ptest/working/apache-svn-trunk-source/build/ivy/lib/hadoop0.20S.shim/commons-net-1.4.1.jar
[datanucleusenhancer] >>  /data/hive-ptest/working/apache-svn-trunk-source/build/ivy/lib/hadoop0.20S.shim/core-3.1.1.jar
[datanucleusenhancer] >>  /data/hive-ptest/working/apache-svn-trunk-source/build/ivy/lib/hadoop0.20S.shim/ftplet-api-1.0.0.jar
[datanucleusenhancer] >>  /data/hive-ptest/working/apache-svn-trunk-source/build/ivy/lib/hadoop0.20S.shim/ftpserver-core-1.0.0.jar
[datanucleusenhancer] >>  /data/hive-ptest/working/apache-svn-trunk-source/build/ivy/lib/hadoop0.20S.shim/ftpserver-deprecated-1.0.0-M2.jar
[datanucleusenhancer] >>  /data/hive-ptest/working/apache-svn-trunk-source/build/ivy/lib/hadoop0.20S.shim/hadoop-core-1.1.2.jar
[datanucleusenhancer] >>  /data/hive-ptest/working/apache-svn-trunk-source/build/ivy/lib/hadoop0.20S.shim/hadoop-test-1.1.2.jar
[datanucleusenhancer] >>  /data/hive-ptest/working/apache-svn-trunk-source/build/ivy/lib/hadoop0.20S.shim/hadoop-tools-1.1.2.jar
[datanucleusenhancer] >>  /data/hive-ptest/working/apache-svn-trunk-source/build/ivy/lib/hadoop0.20S.shim/hsqldb-1.8.0.10.jar
[datanucleusenhancer] >>  /data/hive-ptest/working/apache-svn-trunk-source/build/ivy/lib/hadoop0.20S.shim/jackson-core-asl-1.8.8.jar
[datanucleusenhancer] >>  /data/hive-ptest/working/apache-svn-trunk-source/build/ivy/lib/hadoop0.20S.shim/jackson-jaxrs-1.7.1.jar
[datanucleusenhancer] >>  /data/hive-ptest/working/apache-svn-trunk-source/build/ivy/lib/hadoop0.20S.shim/jackson-mapper-asl-1.8.8.jar
[datanucleusenhancer] >>  /data/hive-ptest/working/apache-svn-trunk-source/build/ivy/lib/hadoop0.20S.shim/jackson-xc-1.7.1.jar
[datanucleusenhancer] >>  /data/hive-ptest/working/apache-svn-trunk-source/build/ivy/lib/hadoop0.20S.shim/jasper-compiler-5.5.12.jar
[datanucleusenhancer] >>  /data/hive-ptest/working/apache-svn-trunk-source/build/ivy/lib/hadoop0.20S.shim/jasper-runtime-5.5.12.jar
[datanucleusenhancer] >>  /data/hive-ptest/working/apache-svn-trunk-source/build/ivy/lib/hadoop0.20S.shim/jaxb-api-2.2.2.jar
[datanucleusenhancer] >>  /data/hive-ptest/working/apache-svn-trunk-source/build/ivy/lib/hadoop0.20S.shim/jaxb-impl-2.2.3-1.jar
[datanucleusenhancer] >>  /data/hive-ptest/working/apache-svn-trunk-source/build/ivy/lib/hadoop0.20S.shim/jersey-core-1.8.jar
[datanucleusenhancer] >>  /data/hive-ptest/working/apache-svn-trunk-source/build/ivy/lib/hadoop0.20S.shim/jersey-json-1.8.jar
[datanucleusenhancer] >>  /data/hive-ptest/working/apache-svn-trunk-source/build/ivy/lib/hadoop0.20S.shim/jersey-server-1.8.jar
[datanucleusenhancer] >>  /data/hive-ptest/working/apache-svn-trunk-source/build/ivy/lib/hadoop0.20S.shim/jets3t-0.6.1.jar
[datanucleusenhancer] >>  /data/hive-ptest/working/apache-svn-trunk-source/build/ivy/lib/hadoop0.20S.shim/jettison-1.1.jar
[datanucleusenhancer] >>  /data/hive-ptest/working/apache-svn-trunk-source/build/ivy/lib/hadoop0.20S.shim/jetty-6.1.26.jar
[datanucleusenhancer] >>  /data/hive-ptest/working/apache-svn-trunk-source/build/ivy/lib/hadoop0.20S.shim/jetty-util-6.1.26.jar
[datanucleusenhancer] >>  /data/hive-ptest/working/apache-svn-trunk-source/build/ivy/lib/hadoop0.20S.shim/jsp-2.1-6.1.14.jar
[datanucleusenhancer] >>  /data/hive-ptest/working/apache-svn-trunk-source/build/ivy/lib/hadoop0.20S.shim/jsp-api-2.1-6.1.14.jar
[datanucleusenhancer] >>  /data/hive-ptest/working/apache-svn-trunk-source/build/ivy/lib/hadoop0.20S.shim/junit-3.8.1.jar
[datanucleusenhancer] >>  /data/hive-ptest/working/apache-svn-trunk-source/build/ivy/lib/hadoop0.20S.shim/mina-core-2.0.0-M5.jar
[datanucleusenhancer] >>  /data/hive-ptest/working/apache-svn-trunk-source/build/ivy/lib/hadoop0.20S.shim/oro-2.0.8.jar
[datanucleusenhancer] >>  /data/hive-ptest/working/apache-svn-trunk-source/build/ivy/lib/hadoop0.20S.shim/servlet-api-2.5-20081211.jar
[datanucleusenhancer] >>  /data/hive-ptest/working/apache-svn-trunk-source/build/ivy/lib/hadoop0.20S.shim/servlet-api-2.5-6.1.14.jar
[datanucleusenhancer] >>  /data/hive-ptest/working/apache-svn-trunk-source/build/ivy/lib/hadoop0.20S.shim/slf4j-api-1.5.2.jar
[datanucleusenhancer] >>  /data/hive-ptest/working/apache-svn-trunk-source/build/ivy/lib/hadoop0.20S.shim/stax-api-1.0-2.jar
[datanucleusenhancer] >>  /data/hive-ptest/working/apache-svn-trunk-source/build/ivy/lib/hadoop0.20S.shim/stax-api-1.0.1.jar
[datanucleusenhancer] >>  /data/hive-ptest/working/apache-svn-trunk-source/build/ivy/lib/hadoop0.20S.shim/xmlenc-0.52.jar
[datanucleusenhancer] >>  /data/hive-ptest/working/apache-svn-trunk-source/build/ivy/lib/default/ST4-4.0.4.jar
[datanucleusenhancer] >>  /data/hive-ptest/working/apache-svn-trunk-source/build/ivy/lib/default/antlr-3.4.jar
[datanucleusenhancer] >>  /data/hive-ptest/working/apache-svn-trunk-source/build/ivy/lib/default/antlr-runtime-3.4.jar
[datanucleusenhancer] >>  /data/hive-ptest/working/apache-svn-trunk-source/build/ivy/lib/default/avro-1.7.1.jar
[datanucleusenhancer] >>  /data/hive-ptest/working/apache-svn-trunk-source/build/ivy/lib/default/avro-mapred-1.7.1.jar
[datanucleusenhancer] >>  /data/hive-ptest/working/apache-svn-trunk-source/build/ivy/lib/default/bonecp-0.7.1.RELEASE.jar
[datanucleusenhancer] >>  /data/hive-ptest/working/apache-svn-trunk-source/build/ivy/lib/default/commons-cli-1.2.jar
[datanucleusenhancer] >>  /data/hive-ptest/working/apache-svn-trunk-source/build/ivy/lib/default/commons-codec-1.4.jar
[datanucleusenhancer] >>  /data/hive-ptest/working/apache-svn-trunk-source/build/ivy/lib/default/commons-compress-1.4.1.jar
[datanucleusenhancer] >>  /data/hive-ptest/working/apache-svn-trunk-source/build/ivy/lib/default/commons-io-2.4.jar
[datanucleusenhancer] >>  /data/hive-ptest/working/apache-svn-trunk-source/build/ivy/lib/default/commons-lang-2.4.jar
[datanucleusenhancer] >>  /data/hive-ptest/working/apache-svn-trunk-source/build/ivy/lib/default/commons-logging-1.0.4.jar
[datanucleusenhancer] >>  /data/hive-ptest/working/apache-svn-trunk-source/build/ivy/lib/default/commons-logging-api-1.0.4.jar
[datanucleusenhancer] >>  /data/hive-ptest/working/apache-svn-trunk-source/build/ivy/lib/default/commons-pool-1.5.4.jar
[datanucleusenhancer] >>  /data/hive-ptest/working/apache-svn-trunk-source/build/ivy/lib/default/datanucleus-api-jdo-3.2.1.jar
[datanucleusenhancer] >>  /data/hive-ptest/working/apache-svn-trunk-source/build/ivy/lib/default/datanucleus-core-3.2.2.jar
[datanucleusenhancer] >>  /data/hive-ptest/working/apache-svn-trunk-source/build/ivy/lib/default/datanucleus-rdbms-3.2.1.jar
[datanucleusenhancer] >>  /data/hive-ptest/working/apache-svn-trunk-source/build/ivy/lib/default/derby-10.4.2.0.jar
[datanucleusenhancer] >>  /data/hive-ptest/working/apache-svn-trunk-source/build/ivy/lib/default/guava-11.0.2.jar
[datanucleusenhancer] >>  /data/hive-ptest/working/apache-svn-trunk-source/build/ivy/lib/default/guava-r08.jar
[datanucleusenhancer] >>  /data/hive-ptest/working/apache-svn-trunk-source/build/ivy/lib/default/hive-common-0.13.0-SNAPSHOT.jar
[datanucleusenhancer] >>  /data/hive-ptest/working/apache-svn-trunk-source/build/ivy/lib/default/hive-serde-0.13.0-SNAPSHOT.jar
[datanucleusenhancer] >>  /data/hive-ptest/working/apache-svn-trunk-source/build/ivy/lib/default/hive-shims-0.13.0-SNAPSHOT.jar
[datanucleusenhancer] >>  /data/hive-ptest/working/apache-svn-trunk-source/build/ivy/lib/default/jackson-core-asl-1.8.8.jar
[datanucleusenhancer] >>  /data/hive-ptest/working/apache-svn-trunk-source/build/ivy/lib/default/jackson-mapper-asl-1.8.8.jar
[datanucleusenhancer] >>  /data/hive-ptest/working/apache-svn-trunk-source/build/ivy/lib/default/jdo-api-3.0.1.jar
[datanucleusenhancer] >>  /data/hive-ptest/working/apache-svn-trunk-source/build/ivy/lib/default/libfb303-0.9.0.jar
[datanucleusenhancer] >>  /data/hive-ptest/working/apache-svn-trunk-source/build/ivy/lib/default/libthrift-0.9.0.jar
[datanucleusenhancer] >>  /data/hive-ptest/working/apache-svn-trunk-source/build/ivy/lib/default/log4j-1.2.16.jar
[datanucleusenhancer] >>  /data/hive-ptest/working/apache-svn-trunk-source/build/ivy/lib/default/mockito-all-1.8.2.jar
[datanucleusenhancer] >>  /data/hive-ptest/working/apache-svn-trunk-source/build/ivy/lib/default/slf4j-api-1.6.1.jar
[datanucleusenhancer] >>  /data/hive-ptest/working/apache-svn-trunk-source/build/ivy/lib/default/slf4j-log4j12-1.6.1.jar
[datanucleusenhancer] >>  /data/hive-ptest/working/apache-svn-trunk-source/build/ivy/lib/default/velocity-1.5.jar
[datanucleusenhancer] >>  /data/hive-ptest/working/apache-svn-trunk-source/build/ivy/lib/default/xz-1.0.jar
[datanucleusenhancer] >>  /data/hive-ptest/working/apache-svn-trunk-source/build/ivy/lib/default/zookeeper-3.4.3.jar
[datanucleusenhancer] ENHANCED (PersistenceCapable) : org.apache.hadoop.hive.metastore.model.MDatabase
[datanucleusenhancer] ENHANCED (PersistenceCapable) : org.apache.hadoop.hive.metastore.model.MFieldSchema
[datanucleusenhancer] ENHANCED (PersistenceCapable) : org.apache.hadoop.hive.metastore.model.MType
[datanucleusenhancer] ENHANCED (PersistenceCapable) : org.apache.hadoop.hive.metastore.model.MTable
[datanucleusenhancer] ENHANCED (PersistenceCapable) : org.apache.hadoop.hive.metastore.model.MSerDeInfo
[datanucleusenhancer] ENHANCED (PersistenceCapable) : org.apache.hadoop.hive.metastore.model.MOrder
[datanucleusenhancer] ENHANCED (PersistenceCapable) : org.apache.hadoop.hive.metastore.model.MColumnDescriptor
[datanucleusenhancer] ENHANCED (PersistenceCapable) : org.apache.hadoop.hive.metastore.model.MStringList
[datanucleusenhancer] ENHANCED (PersistenceCapable) : org.apache.hadoop.hive.metastore.model.MStorageDescriptor
[datanucleusenhancer] ENHANCED (PersistenceCapable) : org.apache.hadoop.hive.metastore.model.MPartition
[datanucleusenhancer] ENHANCED (PersistenceCapable) : org.apache.hadoop.hive.metastore.model.MIndex
[datanucleusenhancer] ENHANCED (PersistenceCapable) : org.apache.hadoop.hive.metastore.model.MRole
[datanucleusenhancer] ENHANCED (PersistenceCapable) : org.apache.hadoop.hive.metastore.model.MRoleMap
[datanucleusenhancer] ENHANCED (PersistenceCapable) : org.apache.hadoop.hive.metastore.model.MGlobalPrivilege
[datanucleusenhancer] ENHANCED (PersistenceCapable) : org.apache.hadoop.hive.metastore.model.MDBPrivilege
[datanucleusenhancer] ENHANCED (PersistenceCapable) : org.apache.hadoop.hive.metastore.model.MTablePrivilege
[datanucleusenhancer] ENHANCED (PersistenceCapable) : org.apache.hadoop.hive.metastore.model.MPartitionPrivilege
[datanucleusenhancer] ENHANCED (PersistenceCapable) : org.apache.hadoop.hive.metastore.model.MTableColumnPrivilege
[datanucleusenhancer] ENHANCED (PersistenceCapable) : org.apache.hadoop.hive.metastore.model.MPartitionColumnPrivilege
[datanucleusenhancer] ENHANCED (PersistenceCapable) : org.apache.hadoop.hive.metastore.model.MPartitionEvent
[datanucleusenhancer] ENHANCED (PersistenceCapable) : org.apache.hadoop.hive.metastore.model.MMasterKey
[datanucleusenhancer] ENHANCED (PersistenceCapable) : org.apache.hadoop.hive.metastore.model.MDelegationToken
[datanucleusenhancer] ENHANCED (PersistenceCapable) : org.apache.hadoop.hive.metastore.model.MTableColumnStatistics
[datanucleusenhancer] ENHANCED (PersistenceCapable) : org.apache.hadoop.hive.metastore.model.MPartitionColumnStatistics
[datanucleusenhancer] DataNucleus Enhancer completed with success for 24 classes. Timings : input=688 ms, enhance=1171 ms, total=1859 ms. Consult the log for full details

compile:
     [echo] Project: metastore

jar:
     [echo] Project: metastore
      [jar] Building jar: /data/hive-ptest/working/apache-svn-trunk-source/build/metastore/hive-metastore-0.13.0-SNAPSHOT.jar
[ivy:publish] :: delivering :: org.apache.hive#hive-metastore;0.13.0-SNAPSHOT :: 0.13.0-SNAPSHOT :: integration :: Fri Sep 06 22:50:18 EDT 2013
[ivy:publish] 	delivering ivy file to /data/hive-ptest/working/apache-svn-trunk-source/build/metastore/ivy-0.13.0-SNAPSHOT.xml
[ivy:publish] :: publishing :: org.apache.hive#hive-metastore
[ivy:publish] 	published hive-metastore to /data/hive-ptest/working/ivy/local/org.apache.hive/hive-metastore/0.13.0-SNAPSHOT/jars/hive-metastore.jar
[ivy:publish] 	published ivy to /data/hive-ptest/working/ivy/local/org.apache.hive/hive-metastore/0.13.0-SNAPSHOT/ivys/ivy.xml

ivy-init-settings:
     [echo] Project: ql

check-ivy:
     [echo] Project: ql

ivy-resolve:
     [echo] Project: ql
[ivy:resolve] :: loading settings :: file = /data/hive-ptest/working/apache-svn-trunk-source/ivy/ivysettings.xml
[ivy:resolve] :: resolving dependencies :: org.apache.hive#hive-exec;0.13.0-SNAPSHOT
[ivy:resolve] 	confs: [default]
[ivy:resolve] 	found org.apache.hive#hive-metastore;0.13.0-SNAPSHOT in local
[ivy:resolve] 	found org.apache.hive#hive-serde;0.13.0-SNAPSHOT in local
[ivy:resolve] 	found org.apache.hive#hive-common;0.13.0-SNAPSHOT in local
[ivy:resolve] 	found org.apache.hive#hive-shims;0.13.0-SNAPSHOT in local
[ivy:resolve] 	found commons-cli#commons-cli;1.2 in maven2
[ivy:resolve] 	found org.apache.commons#commons-compress;1.4.1 in maven2
[ivy:resolve] 	found org.tukaani#xz;1.0 in maven2
[ivy:resolve] 	found commons-lang#commons-lang;2.4 in maven2
[ivy:resolve] 	found log4j#log4j;1.2.16 in maven2
[ivy:resolve] 	found org.slf4j#slf4j-api;1.6.1 in maven2
[ivy:resolve] 	found org.slf4j#slf4j-log4j12;1.6.1 in maven2
[ivy:resolve] 	found org.mockito#mockito-all;1.8.2 in maven2
[ivy:resolve] 	found org.apache.thrift#libfb303;0.9.0 in maven2
[ivy:resolve] 	found commons-codec#commons-codec;1.4 in maven2
[ivy:resolve] 	found org.apache.avro#avro;1.7.1 in maven2
[ivy:resolve] 	found org.apache.avro#avro-mapred;1.7.1 in maven2
[ivy:resolve] 	found org.antlr#antlr;3.4 in maven2
[ivy:resolve] 	found org.antlr#antlr-runtime;3.4 in maven2
[ivy:resolve] 	found org.antlr#ST4;4.0.4 in maven2
[ivy:resolve] 	found com.jolbox#bonecp;0.7.1.RELEASE in maven2
[ivy:resolve] 	found com.google.guava#guava;r08 in maven2
[ivy:resolve] 	found commons-pool#commons-pool;1.5.4 in maven2
[ivy:resolve] 	found org.datanucleus#datanucleus-api-jdo;3.2.1 in maven2
[ivy:resolve] 	found org.datanucleus#datanucleus-core;3.2.2 in maven2
[ivy:resolve] 	found org.datanucleus#datanucleus-rdbms;3.2.1 in maven2
[ivy:resolve] 	found javax.jdo#jdo-api;3.0.1 in maven2
[ivy:resolve] 	found org.apache.derby#derby;10.4.2.0 in maven2
[ivy:resolve] 	found com.google.protobuf#protobuf-java;2.4.1 in maven2
[ivy:resolve] 	found org.iq80.snappy#snappy;0.2 in maven2
[ivy:resolve] 	found org.json#json;20090211 in maven2
[ivy:resolve] 	found commons-collections#commons-collections;3.2.1 in maven2
[ivy:resolve] 	found commons-configuration#commons-configuration;1.6 in maven2
[ivy:resolve] 	found com.googlecode.javaewah#JavaEWAH;0.3.2 in maven2
[ivy:resolve] 	found javolution#javolution;5.5.1 in maven2
[ivy:resolve] 	found jline#jline;0.9.94 in maven2
[ivy:resolve] 	found com.google.guava#guava;11.0.2 in maven2
[ivy:resolve] 	found com.google.code.findbugs#jsr305;1.3.9 in maven2
[ivy:resolve] downloading /data/hive-ptest/working/ivy/local/org.apache.hive/hive-metastore/0.13.0-SNAPSHOT/jars/hive-metastore.jar ...
[ivy:resolve] ..................................................... (3268kB)
[ivy:resolve] .. (0kB)
[ivy:resolve] 	[SUCCESSFUL ] org.apache.hive#hive-metastore;0.13.0-SNAPSHOT!hive-metastore.jar (44ms)
[ivy:resolve] downloading http://repo1.maven.org/maven2/com/google/protobuf/protobuf-java/2.4.1/protobuf-java-2.4.1.jar ...
[ivy:resolve] ........ (439kB)
[ivy:resolve] .. (0kB)
[ivy:resolve] 	[SUCCESSFUL ] com.google.protobuf#protobuf-java;2.4.1!protobuf-java.jar (13ms)
[ivy:resolve] downloading http://repo1.maven.org/maven2/org/iq80/snappy/snappy/0.2/snappy-0.2.jar ...
[ivy:resolve] .. (47kB)
[ivy:resolve] .. (0kB)
[ivy:resolve] 	[SUCCESSFUL ] org.iq80.snappy#snappy;0.2!snappy.jar (6ms)
[ivy:resolve] downloading http://repo1.maven.org/maven2/org/json/json/20090211/json-20090211.jar ...
[ivy:resolve] .. (44kB)
[ivy:resolve] .. (0kB)
[ivy:resolve] 	[SUCCESSFUL ] org.json#json;20090211!json.jar (22ms)
[ivy:resolve] downloading http://repo1.maven.org/maven2/com/googlecode/javaewah/JavaEWAH/0.3.2/JavaEWAH-0.3.2.jar ...
[ivy:resolve] .. (16kB)
[ivy:resolve] .. (0kB)
[ivy:resolve] 	[SUCCESSFUL ] com.googlecode.javaewah#JavaEWAH;0.3.2!JavaEWAH.jar (5ms)
[ivy:resolve] downloading http://repo1.maven.org/maven2/javolution/javolution/5.5.1/javolution-5.5.1.jar ...
[ivy:resolve] ........ (385kB)
[ivy:resolve] .. (0kB)
[ivy:resolve] 	[SUCCESSFUL ] javolution#javolution;5.5.1!javolution.jar(bundle) (11ms)
[ivy:resolve] downloading http://repo1.maven.org/maven2/jline/jline/0.9.94/jline-0.9.94.jar ...
[ivy:resolve] ... (85kB)
[ivy:resolve] .. (0kB)
[ivy:resolve] 	[SUCCESSFUL ] jline#jline;0.9.94!jline.jar (120ms)
[ivy:resolve] :: resolution report :: resolve 10685ms :: artifacts dl 246ms
[ivy:resolve] 	:: evicted modules:
[ivy:resolve] 	com.google.guava#guava;r08 by [com.google.guava#guava;11.0.2] in [default]
[ivy:resolve] 	org.slf4j#slf4j-api;1.5.10 by [org.slf4j#slf4j-api;1.6.1] in [default]
	---------------------------------------------------------------------
	|                  |            modules            ||   artifacts   |
	|       conf       | number| search|dwnlded|evicted|| number|dwnlded|
	---------------------------------------------------------------------
	|      default     |   38  |   7   |   7   |   2   ||   36  |   7   |
	---------------------------------------------------------------------
[ivy:report] Processing /data/hive-ptest/working/apache-svn-trunk-source/build/ivy/resolution-cache/org.apache.hive-hive-exec-default.xml to /data/hive-ptest/working/apache-svn-trunk-source/build/ivy/report/org.apache.hive-hive-exec-default.html

make-pom:
     [echo] Project: ql
     [echo]  Writing POM to /data/hive-ptest/working/apache-svn-trunk-source/build/ql/pom.xml
[ivy:makepom] DEPRECATED: 'ivy.conf.file' is deprecated, use 'ivy.settings.file' instead
[ivy:makepom] :: loading settings :: file = /data/hive-ptest/working/apache-svn-trunk-source/ivy/ivysettings.xml

create-dirs:
     [echo] Project: ql

init:
     [echo] Project: ql

ql-init:
     [echo] Project: ql
    [mkdir] Created dir: /data/hive-ptest/working/apache-svn-trunk-source/build/ql/gen/antlr/gen-java/org/apache/hadoop/hive/ql/parse

ivy-retrieve:
     [echo] Project: ql
[ivy:retrieve] :: retrieving :: org.apache.hive#hive-exec
[ivy:retrieve] 	confs: [default]
[ivy:retrieve] 	10 artifacts copied, 26 already retrieved (5174kB/24ms)

build-grammar:
     [echo] Project: ql
     [echo] Building Grammar /data/hive-ptest/working/apache-svn-trunk-source/ql/src/java/org/apache/hadoop/hive/ql/parse/Hive.g  ....
     [java] warning(200): /data/hive-ptest/working/apache-svn-trunk-source/ql/src/java/org/apache/hadoop/hive/ql/parse/HiveParser.g:866:5: 
     [java] Decision can match input such as "Identifier KW_RENAME KW_TO" using multiple alternatives: 1, 10
     [java] 
     [java] As a result, alternative(s) 10 were disabled for that input
     [java] warning(200): /data/hive-ptest/working/apache-svn-trunk-source/ql/src/java/org/apache/hadoop/hive/ql/parse/HiveParser.g:1167:5: 
     [java] Decision can match input such as "KW_TEXTFILE" using multiple alternatives: 2, 6
     [java] 
     [java] As a result, alternative(s) 6 were disabled for that input
     [java] warning(200): /data/hive-ptest/working/apache-svn-trunk-source/ql/src/java/org/apache/hadoop/hive/ql/parse/HiveParser.g:1167:5: 
     [java] Decision can match input such as "KW_SEQUENCEFILE" using multiple alternatives: 1, 6
     [java] 
     [java] As a result, alternative(s) 6 were disabled for that input
     [java] warning(200): /data/hive-ptest/working/apache-svn-trunk-source/ql/src/java/org/apache/hadoop/hive/ql/parse/HiveParser.g:1167:5: 
     [java] Decision can match input such as "KW_ORCFILE" using multiple alternatives: 4, 6
     [java] 
     [java] As a result, alternative(s) 6 were disabled for that input
     [java] warning(200): /data/hive-ptest/working/apache-svn-trunk-source/ql/src/java/org/apache/hadoop/hive/ql/parse/HiveParser.g:1167:5: 
     [java] Decision can match input such as "KW_RCFILE" using multiple alternatives: 3, 6
     [java] 
     [java] As a result, alternative(s) 6 were disabled for that input
     [java] warning(200): /data/hive-ptest/working/apache-svn-trunk-source/ql/src/java/org/apache/hadoop/hive/ql/parse/HiveParser.g:1180:23: 
     [java] Decision can match input such as "KW_KEY_TYPE" using multiple alternatives: 2, 4
     [java] 
     [java] As a result, alternative(s) 4 were disabled for that input
     [java] warning(200): /data/hive-ptest/working/apache-svn-trunk-source/ql/src/java/org/apache/hadoop/hive/ql/parse/HiveParser.g:1180:23: 
     [java] Decision can match input such as "KW_ELEM_TYPE" using multiple alternatives: 1, 4
     [java] 
     [java] As a result, alternative(s) 4 were disabled for that input
     [java] warning(200): /data/hive-ptest/working/apache-svn-trunk-source/ql/src/java/org/apache/hadoop/hive/ql/parse/HiveParser.g:1180:23: 
     [java] Decision can match input such as "KW_VALUE_TYPE" using multiple alternatives: 3, 4
     [java] 
     [java] As a result, alternative(s) 4 were disabled for that input
     [java] warning(200): /data/hive-ptest/working/apache-svn-trunk-source/ql/src/java/org/apache/hadoop/hive/ql/parse/HiveParser.g:1187:23: 
     [java] Decision can match input such as "KW_VALUE_TYPE" using multiple alternatives: 3, 4
     [java] 
     [java] As a result, alternative(s) 4 were disabled for that input
     [java] warning(200): /data/hive-ptest/working/apache-svn-trunk-source/ql/src/java/org/apache/hadoop/hive/ql/parse/HiveParser.g:1187:23: 
     [java] Decision can match input such as "KW_ELEM_TYPE" using multiple alternatives: 1, 4
     [java] 
     [java] As a result, alternative(s) 4 were disabled for that input
     [java] warning(200): /data/hive-ptest/working/apache-svn-trunk-source/ql/src/java/org/apache/hadoop/hive/ql/parse/HiveParser.g:1187:23: 
     [java] Decision can match input such as "KW_KEY_TYPE" using multiple alternatives: 2, 4
     [java] 
     [java] As a result, alternative(s) 4 were disabled for that input
     [java] warning(200): /data/hive-ptest/working/apache-svn-trunk-source/ql/src/java/org/apache/hadoop/hive/ql/parse/HiveParser.g:1205:29: 
     [java] Decision can match input such as "KW_PRETTY KW_PARTITION" using multiple alternatives: 3, 4
     [java] 
     [java] As a result, alternative(s) 4 were disabled for that input
     [java] warning(200): /data/hive-ptest/working/apache-svn-trunk-source/ql/src/java/org/apache/hadoop/hive/ql/parse/HiveParser.g:1205:29: 
     [java] Decision can match input such as "KW_PRETTY {KW_ADD..KW_AFTER, KW_ALTER..KW_ANALYZE, KW_ARCHIVE..KW_CASCADE, KW_CHANGE..KW_COLLECTION, KW_COLUMNS..KW_CREATE, KW_CUBE, KW_CURSOR..KW_DATA, KW_DATABASES..KW_DISABLE, KW_DISTRIBUTE..KW_ELEM_TYPE, KW_ENABLE, KW_ESCAPED, KW_EXCLUSIVE..KW_EXPORT, KW_EXTERNAL..KW_FLOAT, KW_FOR..KW_FORMATTED, KW_FULL, KW_FUNCTIONS..KW_GROUPING, KW_HOLD_DDLTIME..KW_IDXPROPERTIES, KW_IGNORE..KW_ITEMS, KW_KEYS..KW_LEFT, KW_LIKE..KW_LONG, KW_MAPJOIN..KW_MINUS, KW_MSCK..KW_NOSCAN, KW_NO_DROP..KW_OFFLINE, KW_OPTION, KW_ORCFILE..KW_OUTPUTFORMAT, KW_OVERWRITE, KW_PARTITIONED..KW_PLUS, KW_PRETTY..KW_RECORDWRITER, KW_REGEXP..KW_SCHEMAS, KW_SEMI..KW_TABLES, KW_TBLPROPERTIES..KW_TEXTFILE, KW_TIMESTAMP..KW_TOUCH, KW_TRIGGER..KW_UNARCHIVE, KW_UNDO..KW_UNIONTYPE, KW_UNLOCK..KW_VIEW, KW_WHILE, KW_WITH}" using multiple alternatives: 3, 4
     [java] 
     [java] As a result, alternative(s) 4 were disabled for that input
     [java] warning(200): /data/hive-ptest/working/apache-svn-trunk-source/ql/src/java/org/apache/hadoop/hive/ql/parse/HiveParser.g:1205:29: 
     [java] Decision can match input such as "KW_PRETTY Identifier" using multiple alternatives: 3, 4
     [java] 
     [java] As a result, alternative(s) 4 were disabled for that input
     [java] warning(200): /data/hive-ptest/working/apache-svn-trunk-source/ql/src/java/org/apache/hadoop/hive/ql/parse/HiveParser.g:1205:29: 
     [java] Decision can match input such as "KW_FORMATTED {KW_ADD..KW_AFTER, KW_ALTER..KW_ANALYZE, KW_ARCHIVE..KW_CASCADE, KW_CHANGE..KW_COLLECTION, KW_COLUMNS..KW_CREATE, KW_CUBE, KW_CURSOR..KW_DATA, KW_DATABASES..KW_DISABLE, KW_DISTRIBUTE..KW_ELEM_TYPE, KW_ENABLE, KW_ESCAPED, KW_EXCLUSIVE..KW_EXPORT, KW_EXTERNAL..KW_FLOAT, KW_FOR..KW_FORMATTED, KW_FULL, KW_FUNCTIONS..KW_GROUPING, KW_HOLD_DDLTIME..KW_IDXPROPERTIES, KW_IGNORE..KW_ITEMS, KW_KEYS..KW_LEFT, KW_LIKE..KW_LONG, KW_MAPJOIN..KW_MINUS, KW_MSCK..KW_NOSCAN, KW_NO_DROP..KW_OFFLINE, KW_OPTION, KW_ORCFILE..KW_OUTPUTFORMAT, KW_OVERWRITE, KW_PARTITIONED..KW_PLUS, KW_PRETTY..KW_RECORDWRITER, KW_REGEXP..KW_SCHEMAS, KW_SEMI..KW_TABLES, KW_TBLPROPERTIES..KW_TEXTFILE, KW_TIMESTAMP..KW_TOUCH, KW_TRIGGER..KW_UNARCHIVE, KW_UNDO..KW_UNIONTYPE, KW_UNLOCK..KW_VIEW, KW_WHILE, KW_WITH}" using multiple alternatives: 1, 4
     [java] 
     [java] As a result, alternative(s) 4 were disabled for that input
     [java] warning(200): /data/hive-ptest/working/apache-svn-trunk-source/ql/src/java/org/apache/hadoop/hive/ql/parse/HiveParser.g:1205:29: 
     [java] Decision can match input such as "KW_FORMATTED KW_PARTITION" using multiple alternatives: 1, 4
     [java] 
     [java] As a result, alternative(s) 4 were disabled for that input
     [java] warning(200): /data/hive-ptest/working/apache-svn-trunk-source/ql/src/java/org/apache/hadoop/hive/ql/parse/HiveParser.g:1205:29: 
     [java] Decision can match input such as "KW_FORMATTED Identifier" using multiple alternatives: 1, 4
     [java] 
     [java] As a result, alternative(s) 4 were disabled for that input
     [java] warning(200): /data/hive-ptest/working/apache-svn-trunk-source/ql/src/java/org/apache/hadoop/hive/ql/parse/HiveParser.g:1476:116: 
     [java] Decision can match input such as "KW_STORED KW_AS KW_DIRECTORIES" using multiple alternatives: 1, 2
     [java] 
     [java] As a result, alternative(s) 2 were disabled for that input
     [java] warning(200): /data/hive-ptest/working/apache-svn-trunk-source/ql/src/java/org/apache/hadoop/hive/ql/parse/HiveParser.g:1599:5: 
     [java] Decision can match input such as "KW_STORED KW_AS KW_INPUTFORMAT" using multiple alternatives: 5, 7
     [java] 
     [java] As a result, alternative(s) 7 were disabled for that input
     [java] warning(200): /data/hive-ptest/working/apache-svn-trunk-source/ql/src/java/org/apache/hadoop/hive/ql/parse/HiveParser.g:1599:5: 
     [java] Decision can match input such as "KW_STORED KW_AS KW_SEQUENCEFILE" using multiple alternatives: 1, 7
     [java] 
     [java] As a result, alternative(s) 7 were disabled for that input
     [java] warning(200): /data/hive-ptest/working/apache-svn-trunk-source/ql/src/java/org/apache/hadoop/hive/ql/parse/HiveParser.g:1599:5: 
     [java] Decision can match input such as "KW_STORED KW_AS KW_ORCFILE" using multiple alternatives: 4, 7
     [java] 
     [java] As a result, alternative(s) 7 were disabled for that input
     [java] warning(200): /data/hive-ptest/working/apache-svn-trunk-source/ql/src/java/org/apache/hadoop/hive/ql/parse/HiveParser.g:1599:5: 
     [java] Decision can match input such as "KW_STORED KW_AS KW_RCFILE" using multiple alternatives: 3, 7
     [java] 
     [java] As a result, alternative(s) 7 were disabled for that input
     [java] warning(200): /data/hive-ptest/working/apache-svn-trunk-source/ql/src/java/org/apache/hadoop/hive/ql/parse/HiveParser.g:1599:5: 
     [java] Decision can match input such as "KW_STORED KW_AS KW_TEXTFILE" using multiple alternatives: 2, 7
     [java] 
     [java] As a result, alternative(s) 7 were disabled for that input
     [java] warning(200): SelectClauseParser.g:149:5: 
     [java] Decision can match input such as "KW_NULL DOT {KW_ADD..KW_AFTER, KW_ALTER..KW_ANALYZE, KW_ARCHIVE..KW_CASCADE, KW_CHANGE..KW_COLLECTION, KW_COLUMNS..KW_CREATE, KW_CUBE, KW_CURSOR..KW_DATA, KW_DATABASES..KW_DISABLE, KW_DISTRIBUTE..KW_ELEM_TYPE, KW_ENABLE, KW_ESCAPED, KW_EXCLUSIVE..KW_EXPORT, KW_EXTERNAL..KW_FLOAT, KW_FOR..KW_FORMATTED, KW_FULL, KW_FUNCTIONS..KW_GROUPING, KW_HOLD_DDLTIME..KW_IDXPROPERTIES, KW_IGNORE..KW_ITEMS, KW_KEYS..KW_LEFT, KW_LIKE..KW_LONG, KW_MAPJOIN..KW_MINUS, KW_MSCK..KW_NOSCAN, KW_NO_DROP..KW_OFFLINE, KW_OPTION, KW_ORCFILE..KW_OUTPUTFORMAT, KW_OVERWRITE, KW_PARTITION..KW_PLUS, KW_PRETTY..KW_RECORDWRITER, KW_REGEXP..KW_SCHEMAS, KW_SEMI..KW_TABLES, KW_TBLPROPERTIES..KW_TEXTFILE, KW_TIMESTAMP..KW_TOUCH, KW_TRIGGER..KW_UNARCHIVE, KW_UNDO..KW_UNIONTYPE, KW_UNLOCK..KW_VIEW, KW_WHILE, KW_WITH}" using multiple alternatives: 1, 2
     [java] 
     [java] As a result, alternative(s) 2 were disabled for that input
     [java] warning(200): SelectClauseParser.g:149:5: 
     [java] Decision can match input such as "KW_NULL DOT Identifier" using multiple alternatives: 1, 2
     [java] 
     [java] As a result, alternative(s) 2 were disabled for that input
     [java] warning(200): FromClauseParser.g:127:2: 
     [java] Decision can match input such as "KW_LATERAL KW_VIEW KW_OUTER" using multiple alternatives: 1, 2
     [java] 
     [java] As a result, alternative(s) 2 were disabled for that input
     [java] warning(200): FromClauseParser.g:179:25: 
     [java] Decision can match input such as "LPAREN StringLiteral RPAREN" using multiple alternatives: 1, 2
     [java] 
     [java] As a result, alternative(s) 2 were disabled for that input
     [java] warning(200): FromClauseParser.g:179:25: 
     [java] Decision can match input such as "LPAREN StringLiteral EQUAL" using multiple alternatives: 1, 2
     [java] 
     [java] As a result, alternative(s) 2 were disabled for that input
     [java] warning(200): FromClauseParser.g:179:25: 
     [java] Decision can match input such as "LPAREN StringLiteral COMMA" using multiple alternatives: 1, 2
     [java] 
     [java] As a result, alternative(s) 2 were disabled for that input
     [java] warning(200): FromClauseParser.g:179:68: 
     [java] Decision can match input such as "Identifier LPAREN KW_DATE" using multiple alternatives: 1, 2
     [java] 
     [java] As a result, alternative(s) 2 were disabled for that input
     [java] warning(200): FromClauseParser.g:179:68: 
     [java] Decision can match input such as "Identifier LPAREN BigintLiteral" using multiple alternatives: 1, 2
     [java] 
     [java] As a result, alternative(s) 2 were disabled for that input
     [java] warning(200): FromClauseParser.g:179:68: 
     [java] Decision can match input such as "Identifier LPAREN KW_FALSE" using multiple alternatives: 1, 2
     [java] 
     [java] As a result, alternative(s) 2 were disabled for that input
     [java] warning(200): FromClauseParser.g:179:68: 
     [java] Decision can match input such as "Identifier LPAREN KW_NOT" using multiple alternatives: 1, 2
     [java] 
     [java] As a result, alternative(s) 2 were disabled for that input
     [java] warning(200): FromClauseParser.g:179:68: 
     [java] Decision can match input such as "Identifier LPAREN KW_TRUE" using multiple alternatives: 1, 2
     [java] 
     [java] As a result, alternative(s) 2 were disabled for that input
     [java] warning(200): FromClauseParser.g:179:68: 
     [java] Decision can match input such as "Identifier LPAREN TinyintLiteral" using multiple alternatives: 1, 2
     [java] 
     [java] As a result, alternative(s) 2 were disabled for that input
     [java] warning(200): FromClauseParser.g:179:68: 
     [java] Decision can match input such as "Identifier LPAREN Identifier" using multiple alternatives: 1, 2
     [java] 
     [java] As a result, alternative(s) 2 were disabled for that input
     [java] warning(200): FromClauseParser.g:179:68: 
     [java] Decision can match input such as "Identifier LPAREN KW_UNIONTYPE" using multiple alternatives: 1, 2
     [java] 
     [java] As a result, alternative(s) 2 were disabled for that input
     [java] warning(200): FromClauseParser.g:179:68: 
     [java] Decision can match input such as "Identifier LPAREN SmallintLiteral" using multiple alternatives: 1, 2
     [java] 
     [java] As a result, alternative(s) 2 were disabled for that input
     [java] warning(200): FromClauseParser.g:179:68: 
     [java] Decision can match input such as "Identifier LPAREN KW_CASE" using multiple alternatives: 1, 2
     [java] 
     [java] As a result, alternative(s) 2 were disabled for that input
     [java] warning(200): FromClauseParser.g:179:68: 
     [java] Decision can match input such as "Identifier LPAREN KW_IF" using multiple alternatives: 1, 2
     [java] 
     [java] As a result, alternative(s) 2 were disabled for that input
     [java] warning(200): FromClauseParser.g:179:68: 
     [java] Decision can match input such as "Identifier LPAREN KW_NULL" using multiple alternatives: 1, 2
     [java] 
     [java] As a result, alternative(s) 2 were disabled for that input
     [java] warning(200): FromClauseParser.g:179:68: 
     [java] Decision can match input such as "Identifier LPAREN CharSetName" using multiple alternatives: 1, 2
     [java] 
     [java] As a result, alternative(s) 2 were disabled for that input
     [java] warning(200): FromClauseParser.g:179:68: 
     [java] Decision can match input such as "Identifier LPAREN KW_STRUCT" using multiple alternatives: 1, 2
     [java] 
     [java] As a result, alternative(s) 2 were disabled for that input
     [java] warning(200): FromClauseParser.g:179:68: 
     [java] Decision can match input such as "Identifier LPAREN Number" using multiple alternatives: 1, 2
     [java] 
     [java] As a result, alternative(s) 2 were disabled for that input
     [java] warning(200): FromClauseParser.g:179:68: 
     [java] Decision can match input such as "Identifier LPAREN StringLiteral" using multiple alternatives: 1, 2
     [java] 
     [java] As a result, alternative(s) 2 were disabled for that input
     [java] warning(200): FromClauseParser.g:179:68: 
     [java] Decision can match input such as "Identifier LPAREN DecimalLiteral" using multiple alternatives: 1, 2
     [java] 
     [java] As a result, alternative(s) 2 were disabled for that input
     [java] warning(200): FromClauseParser.g:179:68: 
     [java] Decision can match input such as "Identifier LPAREN LPAREN" using multiple alternatives: 1, 2
     [java] 
     [java] As a result, alternative(s) 2 were disabled for that input
     [java] warning(200): FromClauseParser.g:179:68: 
     [java] Decision can match input such as "Identifier LPAREN KW_CAST" using multiple alternatives: 1, 2
     [java] 
     [java] As a result, alternative(s) 2 were disabled for that input
     [java] warning(200): FromClauseParser.g:179:68: 
     [java] Decision can match input such as "Identifier LPAREN KW_MAP" using multiple alternatives: 1, 2
     [java] 
     [java] As a result, alternative(s) 2 were disabled for that input
     [java] warning(200): FromClauseParser.g:179:68: 
     [java] Decision can match input such as "Identifier LPAREN {MINUS, PLUS, TILDE}" using multiple alternatives: 1, 2
     [java] 
     [java] As a result, alternative(s) 2 were disabled for that input
     [java] warning(200): FromClauseParser.g:179:68: 
     [java] Decision can match input such as "Identifier LPAREN {KW_ADD..KW_AFTER, KW_ALTER..KW_ANALYZE, KW_ARCHIVE, KW_AS..KW_CASCADE, KW_CHANGE..KW_COLLECTION, KW_COLUMNS..KW_CREATE, KW_CUBE, KW_CURSOR..KW_DATA, KW_DATABASES, KW_DATETIME..KW_DISABLE, KW_DISTRIBUTE..KW_ELEM_TYPE, KW_ENABLE, KW_ESCAPED, KW_EXCLUSIVE..KW_EXPORT, KW_EXTERNAL, KW_FETCH..KW_FLOAT, KW_FOR..KW_FORMATTED, KW_FULL, KW_FUNCTIONS..KW_GROUPING, KW_HOLD_DDLTIME..KW_IDXPROPERTIES, KW_IGNORE..KW_ITEMS, KW_KEYS..KW_LEFT, KW_LIKE..KW_LONG, KW_MAPJOIN..KW_MINUS, KW_MSCK..KW_NOSCAN, KW_NO_DROP, KW_OF..KW_OFFLINE, KW_OPTION, KW_ORCFILE..KW_OUTPUTFORMAT, KW_OVERWRITE, KW_PARTITION..KW_PLUS, KW_PRETTY..KW_RECORDWRITER, KW_REGEXP..KW_SCHEMAS, KW_SEMI..KW_STRING, KW_TABLE..KW_TABLES, KW_TBLPROPERTIES..KW_TEXTFILE, KW_TIMESTAMP..KW_TOUCH, KW_TRIGGER, KW_TRUNCATE..KW_UNARCHIVE, KW_UNDO..KW_UNION, KW_UNLOCK..KW_VIEW, KW_WHILE, KW_WITH}" using multiple alternatives: 1, 2
     [java] 
     [java] As a result, alternative(s) 2 were disabled for that input
     [java] warning(200): FromClauseParser.g:179:68: 
     [java] Decision can match input such as "Identifier LPAREN KW_ARRAY" using multiple alternatives: 1, 2
     [java] 
     [java] As a result, alternative(s) 2 were disabled for that input
     [java] warning(200): FromClauseParser.g:237:16: 
     [java] Decision can match input such as "Identifier LPAREN KW_DATE" using multiple alternatives: 1, 2
     [java] 
     [java] As a result, alternative(s) 2 were disabled for that input
     [java] warning(200): FromClauseParser.g:237:16: 
     [java] Decision can match input such as "Identifier LPAREN BigintLiteral" using multiple alternatives: 1, 2
     [java] 
     [java] As a result, alternative(s) 2 were disabled for that input
     [java] warning(200): FromClauseParser.g:237:16: 
     [java] Decision can match input such as "Identifier LPAREN KW_FALSE" using multiple alternatives: 1, 2
     [java] 
     [java] As a result, alternative(s) 2 were disabled for that input
     [java] warning(200): FromClauseParser.g:237:16: 
     [java] Decision can match input such as "Identifier LPAREN KW_NOT" using multiple alternatives: 1, 2
     [java] 
     [java] As a result, alternative(s) 2 were disabled for that input
     [java] warning(200): FromClauseParser.g:237:16: 
     [java] Decision can match input such as "Identifier LPAREN KW_TRUE" using multiple alternatives: 1, 2
     [java] 
     [java] As a result, alternative(s) 2 were disabled for that input
     [java] warning(200): FromClauseParser.g:237:16: 
     [java] Decision can match input such as "Identifier LPAREN TinyintLiteral" using multiple alternatives: 1, 2
     [java] 
     [java] As a result, alternative(s) 2 were disabled for that input
     [java] warning(200): FromClauseParser.g:237:16: 
     [java] Decision can match input such as "Identifier LPAREN Identifier" using multiple alternatives: 1, 2
     [java] 
     [java] As a result, alternative(s) 2 were disabled for that input
     [java] warning(200): FromClauseParser.g:237:16: 
     [java] Decision can match input such as "Identifier LPAREN KW_UNIONTYPE" using multiple alternatives: 1, 2
     [java] 
     [java] As a result, alternative(s) 2 were disabled for that input
     [java] warning(200): FromClauseParser.g:237:16: 
     [java] Decision can match input such as "Identifier LPAREN SmallintLiteral" using multiple alternatives: 1, 2
     [java] 
     [java] As a result, alternative(s) 2 were disabled for that input
     [java] warning(200): FromClauseParser.g:237:16: 
     [java] Decision can match input such as "Identifier LPAREN KW_CASE" using multiple alternatives: 1, 2
     [java] 
     [java] As a result, alternative(s) 2 were disabled for that input
     [java] warning(200): FromClauseParser.g:237:16: 
     [java] Decision can match input such as "Identifier LPAREN KW_IF" using multiple alternatives: 1, 2
     [java] 
     [java] As a result, alternative(s) 2 were disabled for that input
     [java] warning(200): FromClauseParser.g:237:16: 
     [java] Decision can match input such as "Identifier LPAREN KW_NULL" using multiple alternatives: 1, 2
     [java] 
     [java] As a result, alternative(s) 2 were disabled for that input
     [java] warning(200): FromClauseParser.g:237:16: 
     [java] Decision can match input such as "Identifier LPAREN CharSetName" using multiple alternatives: 1, 2
     [java] 
     [java] As a result, alternative(s) 2 were disabled for that input
     [java] warning(200): FromClauseParser.g:237:16: 
     [java] Decision can match input such as "Identifier LPAREN KW_STRUCT" using multiple alternatives: 1, 2
     [java] 
     [java] As a result, alternative(s) 2 were disabled for that input
     [java] warning(200): FromClauseParser.g:237:16: 
     [java] Decision can match input such as "Identifier LPAREN Number" using multiple alternatives: 1, 2
     [java] 
     [java] As a result, alternative(s) 2 were disabled for that input
     [java] warning(200): FromClauseParser.g:237:16: 
     [java] Decision can match input such as "Identifier LPAREN StringLiteral" using multiple alternatives: 1, 2
     [java] 
     [java] As a result, alternative(s) 2 were disabled for that input
     [java] warning(200): FromClauseParser.g:237:16: 
     [java] Decision can match input such as "Identifier LPAREN DecimalLiteral" using multiple alternatives: 1, 2
     [java] 
     [java] As a result, alternative(s) 2 were disabled for that input
     [java] warning(200): FromClauseParser.g:237:16: 
     [java] Decision can match input such as "Identifier LPAREN LPAREN" using multiple alternatives: 1, 2
     [java] 
     [java] As a result, alternative(s) 2 were disabled for that input
     [java] warning(200): FromClauseParser.g:237:16: 
     [java] Decision can match input such as "Identifier LPAREN KW_CAST" using multiple alternatives: 1, 2
     [java] 
     [java] As a result, alternative(s) 2 were disabled for that input
     [java] warning(200): FromClauseParser.g:237:16: 
     [java] Decision can match input such as "Identifier LPAREN KW_MAP" using multiple alternatives: 1, 2
     [java] 
     [java] As a result, alternative(s) 2 were disabled for that input
     [java] warning(200): FromClauseParser.g:237:16: 
     [java] Decision can match input such as "Identifier LPAREN {MINUS, PLUS, TILDE}" using multiple alternatives: 1, 2
     [java] 
     [java] As a result, alternative(s) 2 were disabled for that input
     [java] warning(200): FromClauseParser.g:237:16: 
     [java] Decision can match input such as "Identifier LPAREN {KW_ADD..KW_AFTER, KW_ALTER..KW_ANALYZE, KW_ARCHIVE, KW_AS..KW_CASCADE, KW_CHANGE..KW_COLLECTION, KW_COLUMNS..KW_CREATE, KW_CUBE, KW_CURSOR..KW_DATA, KW_DATABASES, KW_DATETIME..KW_DISABLE, KW_DISTRIBUTE..KW_ELEM_TYPE, KW_ENABLE, KW_ESCAPED, KW_EXCLUSIVE..KW_EXPORT, KW_EXTERNAL, KW_FETCH..KW_FLOAT, KW_FOR..KW_FORMATTED, KW_FULL, KW_FUNCTIONS..KW_GROUPING, KW_HOLD_DDLTIME..KW_IDXPROPERTIES, KW_IGNORE..KW_ITEMS, KW_KEYS..KW_LEFT, KW_LIKE..KW_LONG, KW_MAPJOIN..KW_MINUS, KW_MSCK..KW_NOSCAN, KW_NO_DROP, KW_OF..KW_OFFLINE, KW_OPTION, KW_ORCFILE..KW_OUTPUTFORMAT, KW_OVERWRITE, KW_PARTITION..KW_PLUS, KW_PRETTY..KW_RECORDWRITER, KW_REGEXP..KW_SCHEMAS, KW_SEMI..KW_STRING, KW_TABLE..KW_TABLES, KW_TBLPROPERTIES..KW_TEXTFILE, KW_TIMESTAMP..KW_TOUCH, KW_TRIGGER, KW_TRUNCATE..KW_UNARCHIVE, KW_UNDO..KW_UNION, KW_UNLOCK..KW_VIEW, KW_WHILE, KW_WITH}" using multiple alternatives: 1, 2
     [java] 
     [java] As a result, alternative(s) 2 were disabled for that input
     [java] warning(200): FromClauseParser.g:237:16: 
     [java] Decision can match input such as "Identifier LPAREN KW_ARRAY" using multiple alternatives: 1, 2
     [java] 
     [java] As a result, alternative(s) 2 were disabled for that input
     [java] warning(200): IdentifiersParser.g:68:4: 
     [java] Decision can match input such as "LPAREN LPAREN Number" using multiple alternatives: 1, 2
     [java] 
     [java] As a result, alternative(s) 2 were disabled for that input
     [java] warning(200): IdentifiersParser.g:68:4: 
     [java] Decision can match input such as "LPAREN KW_NULL GREATERTHAN" using multiple alternatives: 1, 2
     [java] 
     [java] As a result, alternative(s) 2 were disabled for that input
     [java] warning(200): IdentifiersParser.g:68:4: 
     [java] Decision can match input such as "LPAREN KW_NOT KW_FALSE" using multiple alternatives: 1, 2
     [java] 
     [java] As a result, alternative(s) 2 were disabled for that input
     [java] warning(200): IdentifiersParser.g:68:4: 
     [java] Decision can match input such as "LPAREN KW_CASE Identifier" using multiple alternatives: 1, 2
     [java] 
     [java] As a result, alternative(s) 2 were disabled for that input
     [java] warning(200): IdentifiersParser.g:68:4: 
     [java] Decision can match input such as "LPAREN KW_NULL GREATERTHANOREQUALTO" using multiple alternatives: 1, 2
     [java] 
     [java] As a result, alternative(s) 2 were disabled for that input
     [java] warning(200): IdentifiersParser.g:68:4: 
     [java] Decision can match input such as "LPAREN KW_NOT KW_TRUE" using multiple alternatives: 1, 2
     [java] 
     [java] As a result, alternative(s) 2 were disabled for that input
     [java] warning(200): IdentifiersParser.g:68:4: 
     [java] Decision can match input such as "LPAREN KW_NULL LESSTHAN" using multiple alternatives: 1, 2
     [java] 
     [java] As a result, alternative(s) 2 were disabled for that input
     [java] warning(200): IdentifiersParser.g:68:4: 
     [java] Decision can match input such as "LPAREN KW_CASE {KW_ADD..KW_AFTER, KW_ALTER..KW_ANALYZE, KW_ARCHIVE, KW_AS..KW_CASCADE, KW_CHANGE..KW_COLLECTION, KW_COLUMNS..KW_CREATE, KW_CUBE, KW_CURSOR..KW_DATA, KW_DATABASES, KW_DATETIME..KW_DISABLE, KW_DISTRIBUTE..KW_ELEM_TYPE, KW_ENABLE, KW_ESCAPED, KW_EXCLUSIVE..KW_EXPORT, KW_EXTERNAL, KW_FETCH..KW_FLOAT, KW_FOR..KW_FORMATTED, KW_FULL, KW_FUNCTIONS..KW_GROUPING, KW_HOLD_DDLTIME..KW_IDXPROPERTIES, KW_IGNORE..KW_ITEMS, KW_KEYS..KW_LEFT, KW_LIKE..KW_LONG, KW_MAPJOIN..KW_MINUS, KW_MSCK..KW_NOSCAN, KW_NO_DROP, KW_OF..KW_OFFLINE, KW_OPTION, KW_ORCFILE..KW_OUTPUTFORMAT, KW_OVERWRITE, KW_PARTITION..KW_PLUS, KW_PRETTY..KW_RECORDWRITER, KW_REGEXP..KW_SCHEMAS, KW_SEMI..KW_STRING, KW_TABLE..KW_TABLES, KW_TBLPROPERTIES..KW_TEXTFILE, KW_TIMESTAMP..KW_TOUCH, KW_TRIGGER, KW_TRUNCATE..KW_UNARCHIVE, KW_UNDO..KW_UNION, KW_UNLOCK..KW_VIEW, KW_WHILE, KW_WITH}" using multiple alternatives: 1, 2
     [java] 
     [java] As a result, alternative(s) 2 were disabled for that input
     [java] warning(200): IdentifiersParser.g:68:4: 
     [java] Decision can match input such as "LPAREN KW_NULL LESSTHANOREQUALTO" using multiple alternatives: 1, 2
     [java] 
     [java] As a result, alternative(s) 2 were disabled for that input
     [java] warning(200): IdentifiersParser.g:68:4: 
     [java] Decision can match input such as "LPAREN KW_NULL DOT" using multiple alternatives: 1, 2
     [java] 
     [java] As a result, alternative(s) 2 were disabled for that input
     [java] warning(200): IdentifiersParser.g:68:4: 
     [java] Decision can match input such as "LPAREN KW_NOT CharSetName" using multiple alternatives: 1, 2
     [java] 
     [java] As a result, alternative(s) 2 were disabled for that input
     [java] warning(200): IdentifiersParser.g:68:4: 
     [java] Decision can match input such as "LPAREN KW_CASE CharSetName" using multiple alternatives: 1, 2
     [java] 
     [java] As a result, alternative(s) 2 were disabled for that input
     [java] warning(200): IdentifiersParser.g:68:4: 
     [java] Decision can match input such as "LPAREN LPAREN CharSetName" using multiple alternatives: 1, 2
     [java] 
     [java] As a result, alternative(s) 2 were disabled for that input
     [java] warning(200): IdentifiersParser.g:68:4: 
     [java] Decision can match input such as "LPAREN KW_CASE KW_ARRAY" using multiple alternatives: 1, 2
     [java] 
     [java] As a result, alternative(s) 2 were disabled for that input
     [java] warning(200): IdentifiersParser.g:68:4: 
     [java] Decision can match input such as "LPAREN KW_NULL NOTEQUAL" using multiple alternatives: 1, 2
     [java] 
     [java] As a result, alternative(s) 2 were disabled for that input
     [java] warning(200): IdentifiersParser.g:68:4: 
     [java] Decision can match input such as "LPAREN KW_NOT StringLiteral" using multiple alternatives: 1, 2
     [java] 
     [java] As a result, alternative(s) 2 were disabled for that input
     [java] warning(200): IdentifiersParser.g:68:4: 
     [java] Decision can match input such as "LPAREN KW_NULL EQUAL_NS" using multiple alternatives: 1, 2
     [java] 
     [java] As a result, alternative(s) 2 were disabled for that input
     [java] warning(200): IdentifiersParser.g:68:4: 
     [java] Decision can match input such as "LPAREN LPAREN Identifier" using multiple alternatives: 1, 2
     [java] 
     [java] As a result, alternative(s) 2 were disabled for that input
     [java] warning(200): IdentifiersParser.g:68:4: 
     [java] Decision can match input such as "LPAREN KW_NULL {DIV..DIVIDE, MOD, STAR}" using multiple alternatives: 1, 2
     [java] 
     [java] As a result, alternative(s) 2 were disabled for that input
     [java] warning(200): IdentifiersParser.g:68:4: 
     [java] Decision can match input such as "LPAREN KW_NULL BITWISEXOR" using multiple alternatives: 1, 2
     [java] 
     [java] As a result, alternative(s) 2 were disabled for that input
     [java] warning(200): IdentifiersParser.g:68:4: 
     [java] Decision can match input such as "LPAREN KW_CASE KW_STRUCT" using multiple alternatives: 1, 2
     [java] 
     [java] As a result, alternative(s) 2 were disabled for that input
     [java] warning(200): IdentifiersParser.g:68:4: 
     [java] Decision can match input such as "LPAREN KW_NULL EQUAL" using multiple alternatives: 1, 2
     [java] 
     [java] As a result, alternative(s) 2 were disabled for that input
     [java] warning(200): IdentifiersParser.g:68:4: 
     [java] Decision can match input such as "LPAREN KW_NOT KW_ARRAY" using multiple alternatives: 1, 2
     [java] 
     [java] As a result, alternative(s) 2 were disabled for that input
     [java] warning(200): IdentifiersParser.g:68:4: 
     [java] Decision can match input such as "LPAREN KW_CASE KW_UNIONTYPE" using multiple alternatives: 1, 2
     [java] 
     [java] As a result, alternative(s) 2 were disabled for that input
     [java] warning(200): IdentifiersParser.g:68:4: 
     [java] Decision can match input such as "LPAREN KW_NOT KW_STRUCT" using multiple alternatives: 1, 2
     [java] 
     [java] As a result, alternative(s) 2 were disabled for that input
     [java] warning(200): IdentifiersParser.g:68:4: 
     [java] Decision can match input such as "LPAREN KW_NOT Identifier" using multiple alternatives: 1, 2
     [java] 
     [java] As a result, alternative(s) 2 were disabled for that input
     [java] warning(200): IdentifiersParser.g:68:4: 
     [java] Decision can match input such as "LPAREN KW_NOT KW_NOT" using multiple alternatives: 1, 2
     [java] 
     [java] As a result, alternative(s) 2 were disabled for that input
     [java] warning(200): IdentifiersParser.g:68:4: 
     [java] Decision can match input such as "LPAREN KW_CASE KW_NOT" using multiple alternatives: 1, 2
     [java] 
     [java] As a result, alternative(s) 2 were disabled for that input
     [java] warning(200): IdentifiersParser.g:68:4: 
     [java] Decision can match input such as "LPAREN LPAREN KW_NOT" using multiple alternatives: 1, 2
     [java] 
     [java] As a result, alternative(s) 2 were disabled for that input
     [java] warning(200): IdentifiersParser.g:68:4: 
     [java] Decision can match input such as "LPAREN KW_NOT KW_DATE" using multiple alternatives: 1, 2
     [java] 
     [java] As a result, alternative(s) 2 were disabled for that input
     [java] warning(200): IdentifiersParser.g:68:4: 
     [java] Decision can match input such as "LPAREN LPAREN TinyintLiteral" using multiple alternatives: 1, 2
     [java] 
     [java] As a result, alternative(s) 2 were disabled for that input
     [java] warning(200): IdentifiersParser.g:68:4: 
     [java] Decision can match input such as "LPAREN KW_NOT KW_UNIONTYPE" using multiple alternatives: 1, 2
     [java] 
     [java] As a result, alternative(s) 2 were disabled for that input
     [java] warning(200): IdentifiersParser.g:68:4: 
     [java] Decision can match input such as "LPAREN KW_NULL RPAREN" using multiple alternatives: 1, 2
     [java] 
     [java] As a result, alternative(s) 2 were disabled for that input
     [java] warning(200): IdentifiersParser.g:68:4: 
     [java] Decision can match input such as "LPAREN LPAREN DecimalLiteral" using multiple alternatives: 1, 2
     [java] 
     [java] As a result, alternative(s) 2 were disabled for that input
     [java] warning(200): IdentifiersParser.g:68:4: 
     [java] Decision can match input such as "LPAREN KW_CASE KW_NULL" using multiple alternatives: 1, 2
     [java] 
     [java] As a result, alternative(s) 2 were disabled for that input
     [java] warning(200): IdentifiersParser.g:68:4: 
     [java] Decision can match input such as "LPAREN LPAREN BigintLiteral" using multiple alternatives: 1, 2
     [java] 
     [java] As a result, alternative(s) 2 were disabled for that input
     [java] warning(200): IdentifiersParser.g:68:4: 
     [java] Decision can match input such as "LPAREN KW_CASE StringLiteral" using multiple alternatives: 1, 2
     [java] 
     [java] As a result, alternative(s) 2 were disabled for that input
     [java] warning(200): IdentifiersParser.g:68:4: 
     [java] Decision can match input such as "LPAREN LPAREN SmallintLiteral" using multiple alternatives: 1, 2
     [java] 
     [java] As a result, alternative(s) 2 were disabled for that input
     [java] warning(200): IdentifiersParser.g:68:4: 
     [java] Decision can match input such as "LPAREN KW_NULL KW_AND" using multiple alternatives: 1, 2
     [java] 
     [java] As a result, alternative(s) 2 were disabled for that input
     [java] warning(200): IdentifiersParser.g:68:4: 
     [java] Decision can match input such as "LPAREN KW_CAST LPAREN" using multiple alternatives: 1, 2
     [java] 
     [java] As a result, alternative(s) 2 were disabled for that input
     [java] warning(200): IdentifiersParser.g:68:4: 
     [java] Decision can match input such as "LPAREN KW_NULL BITWISEOR" using multiple alternatives: 1, 2
     [java] 
     [java] As a result, alternative(s) 2 were disabled for that input
     [java] warning(200): IdentifiersParser.g:68:4: 
     [java] Decision can match input such as "LPAREN KW_NULL KW_BETWEEN" using multiple alternatives: 1, 2
     [java] 
     [java] As a result, alternative(s) 2 were disabled for that input
     [java] warning(200): IdentifiersParser.g:68:4: 
     [java] Decision can match input such as "LPAREN KW_NOT {KW_ADD..KW_AFTER, KW_ALTER..KW_ANALYZE, KW_ARCHIVE, KW_AS..KW_CASCADE, KW_CHANGE..KW_COLLECTION, KW_COLUMNS..KW_CREATE, KW_CUBE, KW_CURSOR..KW_DATA, KW_DATABASES, KW_DATETIME..KW_DISABLE, KW_DISTRIBUTE..KW_ELEM_TYPE, KW_ENABLE, KW_ESCAPED, KW_EXCLUSIVE..KW_EXPORT, KW_EXTERNAL, KW_FETCH..KW_FLOAT, KW_FOR..KW_FORMATTED, KW_FULL, KW_FUNCTIONS..KW_GROUPING, KW_HOLD_DDLTIME..KW_IDXPROPERTIES, KW_IGNORE..KW_ITEMS, KW_KEYS..KW_LEFT, KW_LIKE..KW_LONG, KW_MAPJOIN..KW_MINUS, KW_MSCK..KW_NOSCAN, KW_NO_DROP, KW_OF..KW_OFFLINE, KW_OPTION, KW_ORCFILE..KW_OUTPUTFORMAT, KW_OVERWRITE, KW_PARTITION..KW_PLUS, KW_PRETTY..KW_RECORDWRITER, KW_REGEXP..KW_SCHEMAS, KW_SEMI..KW_STRING, KW_TABLE..KW_TABLES, KW_TBLPROPERTIES..KW_TEXTFILE, KW_TIMESTAMP..KW_TOUCH, KW_TRIGGER, KW_TRUNCATE..KW_UNARCHIVE, KW_UNDO..KW_UNION, KW_UNLOCK..KW_VIEW, KW_WHILE, KW_WITH}" using multiple alternatives: 1, 2
     [java] 
     [java] As a result, alternative(s) 2 were disabled for that input
     [java] warning(200): IdentifiersParser.g:68:4: 
     [java] Decision can match input such as "LPAREN KW_NOT KW_NULL" using multiple alternatives: 1, 2
     [java] 
     [java] As a result, alternative(s) 2 were disabled for that input
     [java] warning(200): IdentifiersParser.g:68:4: 
     [java] Decision can match input such as "LPAREN KW_NOT KW_CASE" using multiple alternatives: 1, 2
     [java] 
     [java] As a result, alternative(s) 2 were disabled for that input
     [java] warning(200): IdentifiersParser.g:68:4: 
     [java] Decision can match input such as "LPAREN KW_CASE KW_CASE" using multiple alternatives: 1, 2
     [java] 
     [java] As a result, alternative(s) 2 were disabled for that input
     [java] warning(200): IdentifiersParser.g:68:4: 
     [java] Decision can match input such as "LPAREN LPAREN KW_CASE" using multiple alternatives: 1, 2
     [java] 
     [java] As a result, alternative(s) 2 were disabled for that input
     [java] warning(200): IdentifiersParser.g:68:4: 
     [java] Decision can match input such as "LPAREN KW_NULL KW_NOT" using multiple alternatives: 1, 2
     [java] 
     [java] As a result, alternative(s) 2 were disabled for that input
     [java] warning(200): IdentifiersParser.g:68:4: 
     [java] Decision can match input such as "LPAREN LPAREN StringLiteral" using multiple alternatives: 1, 2
     [java] 
     [java] As a result, alternative(s) 2 were disabled for that input
     [java] warning(200): IdentifiersParser.g:68:4: 
     [java] Decision can match input such as "LPAREN LPAREN KW_ARRAY" using multiple alternatives: 1, 2
     [java] 
     [java] As a result, alternative(s) 2 were disabled for that input
     [java] warning(200): IdentifiersParser.g:68:4: 
     [java] Decision can match input such as "LPAREN KW_NULL KW_IN" using multiple alternatives: 1, 2
     [java] 
     [java] As a result, alternative(s) 2 were disabled for that input
     [java] warning(200): IdentifiersParser.g:68:4: 
     [java] Decision can match input such as "LPAREN LPAREN KW_FALSE" using multiple alternatives: 1, 2
     [java] 
     [java] As a result, alternative(s) 2 were disabled for that input
     [java] warning(200): IdentifiersParser.g:68:4: 
     [java] Decision can match input such as "LPAREN LPAREN KW_STRUCT" using multiple alternatives: 1, 2
     [java] 
     [java] As a result, alternative(s) 2 were disabled for that input
     [java] warning(200): IdentifiersParser.g:68:4: 
     [java] Decision can match input such as "LPAREN KW_NOT LPAREN" using multiple alternatives: 1, 2
     [java] 
     [java] As a result, alternative(s) 2 were disabled for that input
     [java] warning(200): IdentifiersParser.g:68:4: 
     [java] Decision can match input such as "LPAREN KW_CASE LPAREN" using multiple alternatives: 1, 2
     [java] 
     [java] As a result, alternative(s) 2 were disabled for that input
     [java] warning(200): IdentifiersParser.g:68:4: 
     [java] Decision can match input such as "LPAREN LPAREN KW_NULL" using multiple alternatives: 1, 2
     [java] 
     [java] As a result, alternative(s) 2 were disabled for that input
     [java] warning(200): IdentifiersParser.g:68:4: 
     [java] Decision can match input such as "LPAREN LPAREN LPAREN" using multiple alternatives: 1, 2
     [java] 
     [java] As a result, alternative(s) 2 were disabled for that input
     [java] warning(200): IdentifiersParser.g:68:4: 
     [java] Decision can match input such as "LPAREN LPAREN KW_UNIONTYPE" using multiple alternatives: 1, 2
     [java] 
     [java] As a result, alternative(s) 2 were disabled for that input
     [java] warning(200): IdentifiersParser.g:68:4: 
     [java] Decision can match input such as "LPAREN LPAREN KW_TRUE" using multiple alternatives: 1, 2
     [java] 
     [java] As a result, alternative(s) 2 were disabled for that input
     [java] warning(200): IdentifiersParser.g:68:4: 
     [java] Decision can match input such as "LPAREN LPAREN {KW_ADD..KW_AFTER, KW_ALTER..KW_ANALYZE, KW_ARCHIVE, KW_AS..KW_CASCADE, KW_CHANGE..KW_COLLECTION, KW_COLUMNS..KW_CREATE, KW_CUBE, KW_CURSOR..KW_DATA, KW_DATABASES, KW_DATETIME..KW_DISABLE, KW_DISTRIBUTE..KW_ELEM_TYPE, KW_ENABLE, KW_ESCAPED, KW_EXCLUSIVE..KW_EXPORT, KW_EXTERNAL, KW_FETCH..KW_FLOAT, KW_FOR..KW_FORMATTED, KW_FULL, KW_FUNCTIONS..KW_GROUPING, KW_HOLD_DDLTIME..KW_IDXPROPERTIES, KW_IGNORE..KW_ITEMS, KW_KEYS..KW_LEFT, KW_LIKE..KW_LONG, KW_MAPJOIN..KW_MINUS, KW_MSCK..KW_NOSCAN, KW_NO_DROP, KW_OF..KW_OFFLINE, KW_OPTION, KW_ORCFILE..KW_OUTPUTFORMAT, KW_OVERWRITE, KW_PARTITION..KW_PLUS, KW_PRETTY..KW_RECORDWRITER, KW_REGEXP..KW_SCHEMAS, KW_SEMI..KW_STRING, KW_TABLE..KW_TABLES, KW_TBLPROPERTIES..KW_TEXTFILE, KW_TIMESTAMP..KW_TOUCH, KW_TRIGGER, KW_TRUNCATE..KW_UNARCHIVE, KW_UNDO..KW_UNION, KW_UNLOCK..KW_VIEW, KW_WHILE, KW_WITH}" using multiple alternatives: 1, 2
     [java] 
     [java] As a result, alternative(s) 2 were disabled for that input
     [java] warning(200): IdentifiersParser.g:68:4: 
     [java] Decision can match input such as "LPAREN KW_NOT BigintLiteral" using multiple alternatives: 1, 2
     [java] 
     [java] As a result, alternative(s) 2 were disabled for that input
     [java] warning(200): IdentifiersParser.g:68:4: 
     [java] Decision can match input such as "LPAREN KW_NOT KW_IF" using multiple alternatives: 1, 2
     [java] 
     [java] As a result, alternative(s) 2 were disabled for that input
     [java] warning(200): IdentifiersParser.g:68:4: 
     [java] Decision can match input such as "LPAREN KW_CASE KW_IF" using multiple alternatives: 1, 2
     [java] 
     [java] As a result, alternative(s) 2 were disabled for that input
     [java] warning(200): IdentifiersParser.g:68:4: 
     [java] Decision can match input such as "LPAREN LPAREN KW_IF" using multiple alternatives: 1, 2
     [java] 
     [java] As a result, alternative(s) 2 were disabled for that input
     [java] warning(200): IdentifiersParser.g:68:4: 
     [java] Decision can match input such as "LPAREN KW_NULL AMPERSAND" using multiple alternatives: 1, 2
     [java] 
     [java] As a result, alternative(s) 2 were disabled for that input
     [java] warning(200): IdentifiersParser.g:68:4: 
     [java] Decision can match input such as "LPAREN KW_NULL LSQUARE" using multiple alternatives: 1, 2
     [java] 
     [java] As a result, alternative(s) 2 were disabled for that input
     [java] warning(200): IdentifiersParser.g:68:4: 
     [java] Decision can match input such as "LPAREN KW_NOT KW_MAP" using multiple alternatives: 1, 2
     [java] 
     [java] As a result, alternative(s) 2 were disabled for that input
     [java] warning(200): IdentifiersParser.g:68:4: 
     [java] Decision can match input such as "LPAREN KW_CASE KW_MAP" using multiple alternatives: 1, 2
     [java] 
     [java] As a result, alternative(s) 2 were disabled for that input
     [java] warning(200): IdentifiersParser.g:68:4: 
     [java] Decision can match input such as "LPAREN LPAREN KW_MAP" using multiple alternatives: 1, 2
     [java] 
     [java] As a result, alternative(s) 2 were disabled for that input
     [java] warning(200): IdentifiersParser.g:68:4: 
     [java] Decision can match input such as "LPAREN KW_CASE KW_DATE" using multiple alternatives: 1, 2
     [java] 
     [java] As a result, alternative(s) 2 were disabled for that input
     [java] warning(200): IdentifiersParser.g:68:4: 
     [java] Decision can match input such as "LPAREN KW_NULL {KW_LIKE, KW_REGEXP, KW_RLIKE}" using multiple alternatives: 1, 2
     [java] 
     [java] As a result, alternative(s) 2 were disabled for that input
     [java] warning(200): IdentifiersParser.g:68:4: 
     [java] Decision can match input such as "LPAREN KW_CASE Number" using multiple alternatives: 1, 2
     [java] 
     [java] As a result, alternative(s) 2 were disabled for that input
     [java] warning(200): IdentifiersParser.g:68:4: 
     [java] Decision can match input such as "LPAREN KW_NULL LPAREN" using multiple alternatives: 1, 2
     [java] 
     [java] As a result, alternative(s) 2 were disabled for that input
     [java] warning(200): IdentifiersParser.g:68:4: 
     [java] Decision can match input such as "LPAREN KW_NOT Number" using multiple alternatives: 1, 2
     [java] 
     [java] As a result, alternative(s) 2 were disabled for that input
     [java] warning(200): IdentifiersParser.g:68:4: 
     [java] Decision can match input such as "LPAREN KW_CASE DecimalLiteral" using multiple alternatives: 1, 2
     [java] 
     [java] As a result, alternative(s) 2 were disabled for that input
     [java] warning(200): IdentifiersParser.g:68:4: 
     [java] Decision can match input such as "LPAREN KW_CASE TinyintLiteral" using multiple alternatives: 1, 2
     [java] 
     [java] As a result, alternative(s) 2 were disabled for that input
     [java] warning(200): IdentifiersParser.g:68:4: 
     [java] Decision can match input such as "LPAREN KW_NULL {MINUS, PLUS}" using multiple alternatives: 1, 2
     [java] 
     [java] As a result, alternative(s) 2 were disabled for that input
     [java] warning(200): IdentifiersParser.g:68:4: 
     [java] Decision can match input such as "LPAREN KW_CASE SmallintLiteral" using multiple alternatives: 1, 2
     [java] 
     [java] As a result, alternative(s) 2 were disabled for that input
     [java] warning(200): IdentifiersParser.g:68:4: 
     [java] Decision can match input such as "LPAREN CharSetName CharSetLiteral" using multiple alternatives: 1, 2
     [java] 
     [java] As a result, alternative(s) 2 were disabled for that input
     [java] warning(200): IdentifiersParser.g:68:4: 
     [java] Decision can match input such as "LPAREN KW_CASE BigintLiteral" using multiple alternatives: 1, 2
     [java] 
     [java] As a result, alternative(s) 2 were disabled for that input
     [java] warning(200): IdentifiersParser.g:68:4: 
     [java] Decision can match input such as "LPAREN LPAREN KW_DATE" using multiple alternatives: 1, 2
     [java] 
     [java] As a result, alternative(s) 2 were disabled for that input
     [java] warning(200): IdentifiersParser.g:68:4: 
     [java] Decision can match input such as "LPAREN KW_CASE KW_TRUE" using multiple alternatives: 1, 2
     [java] 
     [java] As a result, alternative(s) 2 were disabled for that input
     [java] warning(200): IdentifiersParser.g:68:4: 
     [java] Decision can match input such as "LPAREN KW_CASE KW_WHEN" using multiple alternatives: 1, 2
     [java] 
     [java] As a result, alternative(s) 2 were disabled for that input
     [java] warning(200): IdentifiersParser.g:68:4: 
     [java] Decision can match input such as "LPAREN KW_CASE KW_FALSE" using multiple alternatives: 1, 2
     [java] 
     [java] As a result, alternative(s) 2 were disabled for that input
     [java] warning(200): IdentifiersParser.g:68:4: 
     [java] Decision can match input such as "LPAREN KW_NULL KW_IS" using multiple alternatives: 1, 2
     [java] 
     [java] As a result, alternative(s) 2 were disabled for that input
     [java] warning(200): IdentifiersParser.g:68:4: 
     [java] Decision can match input such as "LPAREN StringLiteral StringLiteral" using multiple alternatives: 1, 2
     [java] 
     [java] As a result, alternative(s) 2 were disabled for that input
     [java] warning(200): IdentifiersParser.g:68:4: 
     [java] Decision can match input such as "LPAREN KW_NOT {MINUS, PLUS, TILDE}" using multiple alternatives: 1, 2
     [java] 
     [java] As a result, alternative(s) 2 were disabled for that input
     [java] warning(200): IdentifiersParser.g:68:4: 
     [java] Decision can match input such as "LPAREN KW_CASE {MINUS, PLUS, TILDE}" using multiple alternatives: 1, 2
     [java] 
     [java] As a result, alternative(s) 2 were disabled for that input
     [java] warning(200): IdentifiersParser.g:68:4: 
     [java] Decision can match input such as "LPAREN LPAREN {MINUS, PLUS, TILDE}" using multiple alternatives: 1, 2
     [java] 
     [java] As a result, alternative(s) 2 were disabled for that input
     [java] warning(200): IdentifiersParser.g:68:4: 
     [java] Decision can match input such as "LPAREN KW_DATE StringLiteral" using multiple alternatives: 1, 2
     [java] 
     [java] As a result, alternative(s) 2 were disabled for that input
     [java] warning(200): IdentifiersParser.g:68:4: 
     [java] Decision can match input such as "LPAREN KW_NULL KW_OR" using multiple alternatives: 1, 2
     [java] 
     [java] As a result, alternative(s) 2 were disabled for that input
     [java] warning(200): IdentifiersParser.g:68:4: 
     [java] Decision can match input such as "LPAREN KW_NOT TinyintLiteral" using multiple alternatives: 1, 2
     [java] 
     [java] As a result, alternative(s) 2 were disabled for that input
     [java] warning(200): IdentifiersParser.g:68:4: 
     [java] Decision can match input such as "LPAREN KW_NOT SmallintLiteral" using multiple alternatives: 1, 2
     [java] 
     [java] As a result, alternative(s) 2 were disabled for that input
     [java] warning(200): IdentifiersParser.g:68:4: 
     [java] Decision can match input such as "LPAREN KW_NOT KW_CAST" using multiple alternatives: 1, 2
     [java] 
     [java] As a result, alternative(s) 2 were disabled for that input
     [java] warning(200): IdentifiersParser.g:68:4: 
     [java] Decision can match input such as "LPAREN KW_CASE KW_CAST" using multiple alternatives: 1, 2
     [java] 
     [java] As a result, alternative(s) 2 were disabled for that input
     [java] warning(200): IdentifiersParser.g:68:4: 
     [java] Decision can match input such as "LPAREN LPAREN KW_CAST" using multiple alternatives: 1, 2
     [java] 
     [java] As a result, alternative(s) 2 were disabled for that input
     [java] warning(200): IdentifiersParser.g:68:4: 
     [java] Decision can match input such as "LPAREN KW_NOT DecimalLiteral" using multiple alternatives: 1, 2
     [java] 
     [java] As a result, alternative(s) 2 were disabled for that input
     [java] warning(200): IdentifiersParser.g:108:5: 
     [java] Decision can match input such as "KW_ORDER KW_BY LPAREN" using multiple alternatives: 1, 2
     [java] 
     [java] As a result, alternative(s) 2 were disabled for that input
     [java] warning(200): IdentifiersParser.g:121:5: 
     [java] Decision can match input such as "KW_CLUSTER KW_BY LPAREN" using multiple alternatives: 1, 2
     [java] 
     [java] As a result, alternative(s) 2 were disabled for that input
     [java] warning(200): IdentifiersParser.g:133:5: 
     [java] Decision can match input such as "KW_PARTITION KW_BY LPAREN" using multiple alternatives: 1, 2
     [java] 
     [java] As a result, alternative(s) 2 were disabled for that input
     [java] warning(200): IdentifiersParser.g:144:5: 
     [java] Decision can match input such as "KW_DISTRIBUTE KW_BY LPAREN" using multiple alternatives: 1, 2
     [java] 
     [java] As a result, alternative(s) 2 were disabled for that input
     [java] warning(200): IdentifiersParser.g:155:5: 
     [java] Decision can match input such as "KW_SORT KW_BY LPAREN" using multiple alternatives: 1, 2
     [java] 
     [java] As a result, alternative(s) 2 were disabled for that input
     [java] warning(200): IdentifiersParser.g:172:7: 
     [java] Decision can match input such as "STAR" using multiple alternatives: 1, 2
     [java] 
     [java] As a result, alternative(s) 2 were disabled for that input
     [java] warning(200): IdentifiersParser.g:185:5: 
     [java] Decision can match input such as "KW_STRUCT" using multiple alternatives: 4, 6
     [java] 
     [java] As a result, alternative(s) 6 were disabled for that input
     [java] warning(200): IdentifiersParser.g:185:5: 
     [java] Decision can match input such as "KW_UNIONTYPE" using multiple alternatives: 5, 6
     [java] 
     [java] As a result, alternative(s) 6 were disabled for that input
     [java] warning(200): IdentifiersParser.g:185:5: 
     [java] Decision can match input such as "KW_ARRAY" using multiple alternatives: 2, 6
     [java] 
     [java] As a result, alternative(s) 6 were disabled for that input
     [java] warning(200): IdentifiersParser.g:267:5: 
     [java] Decision can match input such as "KW_NULL" using multiple alternatives: 1, 8
     [java] 
     [java] As a result, alternative(s) 8 were disabled for that input
     [java] warning(200): IdentifiersParser.g:267:5: 
     [java] Decision can match input such as "KW_DATE StringLiteral" using multiple alternatives: 2, 3
     [java] 
     [java] As a result, alternative(s) 3 were disabled for that input
     [java] warning(200): IdentifiersParser.g:267:5: 
     [java] Decision can match input such as "KW_TRUE" using multiple alternatives: 3, 8
     [java] 
     [java] As a result, alternative(s) 8 were disabled for that input
     [java] warning(200): IdentifiersParser.g:267:5: 
     [java] Decision can match input such as "KW_FALSE" using multiple alternatives: 3, 8
     [java] 
     [java] As a result, alternative(s) 8 were disabled for that input
     [java] warning(200): IdentifiersParser.g:390:5: 
     [java] Decision can match input such as "{KW_LIKE, KW_REGEXP, KW_RLIKE} KW_SORT KW_BY" using multiple alternatives: 2, 7
     [java] 
     [java] As a result, alternative(s) 7 were disabled for that input
     [java] warning(200): IdentifiersParser.g:390:5: 
     [java] Decision can match input such as "{KW_LIKE, KW_REGEXP, KW_RLIKE} KW_MAP LPAREN" using multiple alternatives: 2, 7
     [java] 
     [java] As a result, alternative(s) 7 were disabled for that input
     [java] warning(200): IdentifiersParser.g:390:5: 
     [java] Decision can match input such as "{KW_LIKE, KW_REGEXP, KW_RLIKE} KW_ORDER KW_BY" using multiple alternatives: 2, 7
     [java] 
     [java] As a result, alternative(s) 7 were disabled for that input
     [java] warning(200): IdentifiersParser.g:390:5: 
     [java] Decision can match input such as "{KW_LIKE, KW_REGEXP, KW_RLIKE} KW_GROUP KW_BY" using multiple alternatives: 2, 7
     [java] 
     [java] As a result, alternative(s) 7 were disabled for that input
     [java] warning(200): IdentifiersParser.g:390:5: 
     [java] Decision can match input such as "KW_BETWEEN KW_MAP LPAREN" using multiple alternatives: 6, 7
     [java] 
     [java] As a result, alternative(s) 7 were disabled for that input
     [java] warning(200): IdentifiersParser.g:390:5: 
     [java] Decision can match input such as "{KW_LIKE, KW_REGEXP, KW_RLIKE} KW_INSERT KW_INTO" using multiple alternatives: 2, 7
     [java] 
     [java] As a result, alternative(s) 7 were disabled for that input
     [java] warning(200): IdentifiersParser.g:390:5: 
     [java] Decision can match input such as "{KW_LIKE, KW_REGEXP, KW_RLIKE} KW_CLUSTER KW_BY" using multiple alternatives: 2, 7
     [java] 
     [java] As a result, alternative(s) 7 were disabled for that input
     [java] warning(200): IdentifiersParser.g:390:5: 
     [java] Decision can match input such as "{KW_LIKE, KW_REGEXP, KW_RLIKE} KW_LATERAL KW_VIEW" using multiple alternatives: 2, 7
     [java] 
     [java] As a result, alternative(s) 7 were disabled for that input
     [java] warning(200): IdentifiersParser.g:390:5: 
     [java] Decision can match input such as "{KW_LIKE, KW_REGEXP, KW_RLIKE} KW_DISTRIBUTE KW_BY" using multiple alternatives: 2, 7
     [java] 
     [java] As a result, alternative(s) 7 were disabled for that input
     [java] warning(200): IdentifiersParser.g:390:5: 
     [java] Decision can match input such as "{KW_LIKE, KW_REGEXP, KW_RLIKE} KW_INSERT KW_OVERWRITE" using multiple alternatives: 2, 7
     [java] 
     [java] As a result, alternative(s) 7 were disabled for that input
     [java] warning(200): IdentifiersParser.g:514:5: 
     [java] Decision can match input such as "{AMPERSAND..BITWISEXOR, DIV..DIVIDE, EQUAL..EQUAL_NS, GREATERTHAN..GREATERTHANOREQUALTO, KW_AND, KW_ARRAY, KW_BETWEEN..KW_BOOLEAN, KW_CASE, KW_DOUBLE, KW_FLOAT, KW_IF, KW_IN, KW_INT, KW_LIKE, KW_MAP, KW_NOT, KW_OR, KW_REGEXP, KW_RLIKE, KW_SMALLINT, KW_STRING..KW_STRUCT, KW_TINYINT, KW_UNIONTYPE, KW_WHEN, LESSTHAN..LESSTHANOREQUALTO, MINUS..NOTEQUAL, PLUS, STAR, TILDE}" using multiple alternatives: 1, 3
     [java] 
     [java] As a result, alternative(s) 3 were disabled for that input

compile:
     [echo] Project: ql
    [javac] Compiling 918 source files to /data/hive-ptest/working/apache-svn-trunk-source/build/ql/classes
    [javac] Note: Some input files use or override a deprecated API.
    [javac] Note: Recompile with -Xlint:deprecation for details.
    [javac] Note: Some input files use unchecked or unsafe operations.
    [javac] Note: Recompile with -Xlint:unchecked for details.
    [javac] Creating empty /data/hive-ptest/working/apache-svn-trunk-source/build/ql/classes/org/apache/hadoop/hive/ql/exec/package-info.class
    [javac] Creating empty /data/hive-ptest/working/apache-svn-trunk-source/build/ql/classes/org/apache/hadoop/hive/ql/io/orc/package-info.class
    [javac] Creating empty /data/hive-ptest/working/apache-svn-trunk-source/build/ql/classes/org/apache/hadoop/hive/ql/udf/generic/package-info.class
    [javac] Creating empty /data/hive-ptest/working/apache-svn-trunk-source/build/ql/classes/org/apache/hadoop/hive/ql/exec/errors/package-info.class
    [javac] Creating empty /data/hive-ptest/working/apache-svn-trunk-source/build/ql/classes/org/apache/hadoop/hive/ql/lockmgr/package-info.class
     [copy] Copying 1 file to /data/hive-ptest/working/apache-svn-trunk-source/build/ql/classes

jar:
     [echo] Project: ql
    [unzip] Expanding: /data/hive-ptest/working/apache-svn-trunk-source/build/ivy/lib/default/libthrift-0.9.0.jar into /data/hive-ptest/working/apache-svn-trunk-source/build/thrift/classes
    [unzip] Expanding: /data/hive-ptest/working/apache-svn-trunk-source/build/ivy/lib/default/commons-lang-2.4.jar into /data/hive-ptest/working/apache-svn-trunk-source/build/commons-lang/classes
    [unzip] Expanding: /data/hive-ptest/working/apache-svn-trunk-source/build/ivy/lib/default/json-20090211.jar into /data/hive-ptest/working/apache-svn-trunk-source/build/json/classes
    [unzip] Expanding: /data/hive-ptest/working/apache-svn-trunk-source/build/ivy/lib/default/JavaEWAH-0.3.2.jar into /data/hive-ptest/working/apache-svn-trunk-source/build/javaewah/classes
    [unzip] Expanding: /data/hive-ptest/working/apache-svn-trunk-source/build/ivy/lib/default/avro-1.7.1.jar into /data/hive-ptest/working/apache-svn-trunk-source/build/avro/classes
    [unzip] Expanding: /data/hive-ptest/working/apache-svn-trunk-source/build/ivy/lib/default/avro-mapred-1.7.1.jar into /data/hive-ptest/working/apache-svn-trunk-source/build/avro-mapred/classes
    [unzip] Expanding: /data/hive-ptest/working/apache-svn-trunk-source/build/ivy/lib/default/javolution-5.5.1.jar into /data/hive-ptest/working/apache-svn-trunk-source/build/javolution/classes
    [unzip] Expanding: /data/hive-ptest/working/apache-svn-trunk-source/build/ivy/lib/default/protobuf-java-2.4.1.jar into /data/hive-ptest/working/apache-svn-trunk-source/build/protobuf-java/classes
    [unzip] Expanding: /data/hive-ptest/working/apache-svn-trunk-source/build/ivy/lib/default/guava-11.0.2.jar into /data/hive-ptest/working/apache-svn-trunk-source/build/guava/classes
    [unzip] Expanding: /data/hive-ptest/working/apache-svn-trunk-source/build/ivy/lib/default/snappy-0.2.jar into /data/hive-ptest/working/apache-svn-trunk-source/build/snappy/classes
    [unzip] Expanding: /data/hive-ptest/working/apache-svn-trunk-source/build/ivy/lib/default/jackson-core-asl-1.8.8.jar into /data/hive-ptest/working/apache-svn-trunk-source/build/jackson-core-asl/classes
    [unzip] Expanding: /data/hive-ptest/working/apache-svn-trunk-source/build/ivy/lib/default/jackson-mapper-asl-1.8.8.jar into /data/hive-ptest/working/apache-svn-trunk-source/build/jackson-mapper-asl/classes
      [jar] Building jar: /data/hive-ptest/working/apache-svn-trunk-source/build/ql/hive-exec-0.13.0-SNAPSHOT.jar
[ivy:publish] :: delivering :: org.apache.hive#hive-exec;0.13.0-SNAPSHOT :: 0.13.0-SNAPSHOT :: integration :: Fri Sep 06 22:51:20 EDT 2013
[ivy:publish] 	delivering ivy file to /data/hive-ptest/working/apache-svn-trunk-source/build/ql/ivy-0.13.0-SNAPSHOT.xml
[ivy:publish] :: publishing :: org.apache.hive#hive-exec
[ivy:publish] 	published hive-exec to /data/hive-ptest/working/ivy/local/org.apache.hive/hive-exec/0.13.0-SNAPSHOT/jars/hive-exec.jar
[ivy:publish] 	published ivy to /data/hive-ptest/working/ivy/local/org.apache.hive/hive-exec/0.13.0-SNAPSHOT/ivys/ivy.xml

ivy-init-settings:
     [echo] Project: contrib

check-ivy:
     [echo] Project: contrib

ivy-resolve:
     [echo] Project: contrib
[ivy:resolve] :: loading settings :: file = /data/hive-ptest/working/apache-svn-trunk-source/ivy/ivysettings.xml
[ivy:resolve] :: resolving dependencies :: org.apache.hive#hive-contrib;0.13.0-SNAPSHOT
[ivy:resolve] 	confs: [default]
[ivy:resolve] 	found org.apache.hive#hive-exec;0.13.0-SNAPSHOT in local
[ivy:resolve] 	found org.apache.hive#hive-metastore;0.13.0-SNAPSHOT in local
[ivy:resolve] 	found org.apache.hive#hive-serde;0.13.0-SNAPSHOT in local
[ivy:resolve] 	found org.apache.hive#hive-common;0.13.0-SNAPSHOT in local
[ivy:resolve] 	found org.apache.hive#hive-shims;0.13.0-SNAPSHOT in local
[ivy:resolve] 	found commons-cli#commons-cli;1.2 in maven2
[ivy:resolve] 	found org.apache.commons#commons-compress;1.4.1 in maven2
[ivy:resolve] 	found org.tukaani#xz;1.0 in maven2
[ivy:resolve] 	found commons-lang#commons-lang;2.4 in maven2
[ivy:resolve] 	found log4j#log4j;1.2.16 in maven2
[ivy:resolve] 	found org.slf4j#slf4j-api;1.6.1 in maven2
[ivy:resolve] 	found org.slf4j#slf4j-log4j12;1.6.1 in maven2
[ivy:resolve] 	found org.mockito#mockito-all;1.8.2 in maven2
[ivy:resolve] 	found org.apache.thrift#libfb303;0.9.0 in maven2
[ivy:resolve] 	found commons-codec#commons-codec;1.4 in maven2
[ivy:resolve] 	found org.apache.avro#avro;1.7.1 in maven2
[ivy:resolve] 	found org.apache.avro#avro-mapred;1.7.1 in maven2
[ivy:resolve] 	found org.antlr#antlr;3.4 in maven2
[ivy:resolve] 	found org.antlr#antlr-runtime;3.4 in maven2
[ivy:resolve] 	found org.antlr#ST4;4.0.4 in maven2
[ivy:resolve] 	found com.jolbox#bonecp;0.7.1.RELEASE in maven2
[ivy:resolve] 	found com.google.guava#guava;r08 in maven2
[ivy:resolve] 	found commons-pool#commons-pool;1.5.4 in maven2
[ivy:resolve] 	found org.datanucleus#datanucleus-api-jdo;3.2.1 in maven2
[ivy:resolve] 	found org.datanucleus#datanucleus-core;3.2.2 in maven2
[ivy:resolve] 	found org.datanucleus#datanucleus-rdbms;3.2.1 in maven2
[ivy:resolve] 	found javax.jdo#jdo-api;3.0.1 in maven2
[ivy:resolve] 	found org.apache.derby#derby;10.4.2.0 in maven2
[ivy:resolve] 	found com.google.protobuf#protobuf-java;2.4.1 in maven2
[ivy:resolve] 	found org.iq80.snappy#snappy;0.2 in maven2
[ivy:resolve] 	found org.json#json;20090211 in maven2
[ivy:resolve] 	found commons-collections#commons-collections;3.2.1 in maven2
[ivy:resolve] 	found commons-configuration#commons-configuration;1.6 in maven2
[ivy:resolve] 	found com.googlecode.javaewah#JavaEWAH;0.3.2 in maven2
[ivy:resolve] 	found javolution#javolution;5.5.1 in maven2
[ivy:resolve] 	found jline#jline;0.9.94 in maven2
[ivy:resolve] 	found com.google.guava#guava;11.0.2 in maven2
[ivy:resolve] 	found com.google.code.findbugs#jsr305;1.3.9 in maven2
[ivy:resolve] downloading /data/hive-ptest/working/ivy/local/org.apache.hive/hive-exec/0.13.0-SNAPSHOT/jars/hive-exec.jar ...
[ivy:resolve] ............................................................................................................................................ (8837kB)
[ivy:resolve] .. (0kB)
[ivy:resolve] 	[SUCCESSFUL ] org.apache.hive#hive-exec;0.13.0-SNAPSHOT!hive-exec.jar (123ms)
[ivy:resolve] :: resolution report :: resolve 7013ms :: artifacts dl 141ms
[ivy:resolve] 	:: evicted modules:
[ivy:resolve] 	com.google.guava#guava;r08 by [com.google.guava#guava;11.0.2] in [default]
[ivy:resolve] 	org.slf4j#slf4j-api;1.5.10 by [org.slf4j#slf4j-api;1.6.1] in [default]
	---------------------------------------------------------------------
	|                  |            modules            ||   artifacts   |
	|       conf       | number| search|dwnlded|evicted|| number|dwnlded|
	---------------------------------------------------------------------
	|      default     |   39  |   1   |   1   |   2   ||   37  |   1   |
	---------------------------------------------------------------------
[ivy:report] Processing /data/hive-ptest/working/apache-svn-trunk-source/build/ivy/resolution-cache/org.apache.hive-hive-contrib-default.xml to /data/hive-ptest/working/apache-svn-trunk-source/build/ivy/report/org.apache.hive-hive-contrib-default.html

make-pom:
     [echo] Project: contrib
     [echo]  Writing POM to /data/hive-ptest/working/apache-svn-trunk-source/build/contrib/pom.xml
[ivy:makepom] DEPRECATED: 'ivy.conf.file' is deprecated, use 'ivy.settings.file' instead
[ivy:makepom] :: loading settings :: file = /data/hive-ptest/working/apache-svn-trunk-source/ivy/ivysettings.xml

create-dirs:
     [echo] Project: contrib
     [copy] Warning: /data/hive-ptest/working/apache-svn-trunk-source/contrib/src/test/resources does not exist.

init:
     [echo] Project: contrib

setup:
     [echo] Project: contrib

ivy-retrieve:
     [echo] Project: contrib
[ivy:retrieve] :: retrieving :: org.apache.hive#hive-contrib
[ivy:retrieve] 	confs: [default]
[ivy:retrieve] 	1 artifacts copied, 36 already retrieved (8837kB/59ms)

compile:
     [echo] Project: contrib
    [javac] Compiling 39 source files to /data/hive-ptest/working/apache-svn-trunk-source/build/contrib/classes
    [javac] Note: /data/hive-ptest/working/apache-svn-trunk-source/contrib/src/java/org/apache/hadoop/hive/contrib/udf/example/UDFExampleStructPrint.java uses unchecked or unsafe operations.
    [javac] Note: Recompile with -Xlint:unchecked for details.
     [copy] Warning: /data/hive-ptest/working/apache-svn-trunk-source/contrib/src/java/conf does not exist.

jar:
     [echo] Project: contrib
      [jar] Building jar: /data/hive-ptest/working/apache-svn-trunk-source/build/contrib/hive-contrib-0.13.0-SNAPSHOT.jar
[ivy:publish] :: delivering :: org.apache.hive#hive-contrib;0.13.0-SNAPSHOT :: 0.13.0-SNAPSHOT :: integration :: Fri Sep 06 22:51:28 EDT 2013
[ivy:publish] 	delivering ivy file to /data/hive-ptest/working/apache-svn-trunk-source/build/contrib/ivy-0.13.0-SNAPSHOT.xml
[ivy:publish] :: publishing :: org.apache.hive#hive-contrib
[ivy:publish] 	published hive-contrib to /data/hive-ptest/working/ivy/local/org.apache.hive/hive-contrib/0.13.0-SNAPSHOT/jars/hive-contrib.jar
[ivy:publish] 	published ivy to /data/hive-ptest/working/ivy/local/org.apache.hive/hive-contrib/0.13.0-SNAPSHOT/ivys/ivy.xml

ivy-init-settings:
     [echo] Project: service

check-ivy:
     [echo] Project: service

ivy-resolve:
     [echo] Project: service
[ivy:resolve] :: loading settings :: file = /data/hive-ptest/working/apache-svn-trunk-source/ivy/ivysettings.xml
[ivy:resolve] :: resolving dependencies :: org.apache.hive#hive-service;0.13.0-SNAPSHOT
[ivy:resolve] 	confs: [default]
[ivy:resolve] 	found org.apache.hive#hive-exec;0.13.0-SNAPSHOT in local
[ivy:resolve] 	found org.apache.hive#hive-metastore;0.13.0-SNAPSHOT in local
[ivy:resolve] 	found org.apache.hive#hive-serde;0.13.0-SNAPSHOT in local
[ivy:resolve] 	found org.apache.hive#hive-common;0.13.0-SNAPSHOT in local
[ivy:resolve] 	found org.apache.hive#hive-shims;0.13.0-SNAPSHOT in local
[ivy:resolve] 	found commons-cli#commons-cli;1.2 in maven2
[ivy:resolve] 	found org.apache.commons#commons-compress;1.4.1 in maven2
[ivy:resolve] 	found org.tukaani#xz;1.0 in maven2
[ivy:resolve] 	found commons-lang#commons-lang;2.4 in maven2
[ivy:resolve] 	found log4j#log4j;1.2.16 in maven2
[ivy:resolve] 	found org.slf4j#slf4j-api;1.6.1 in maven2
[ivy:resolve] 	found org.slf4j#slf4j-log4j12;1.6.1 in maven2
[ivy:resolve] 	found org.mockito#mockito-all;1.8.2 in maven2
[ivy:resolve] 	found org.apache.thrift#libfb303;0.9.0 in maven2
[ivy:resolve] 	found commons-codec#commons-codec;1.4 in maven2
[ivy:resolve] 	found org.apache.avro#avro;1.7.1 in maven2
[ivy:resolve] 	found org.apache.avro#avro-mapred;1.7.1 in maven2
[ivy:resolve] 	found org.antlr#antlr;3.4 in maven2
[ivy:resolve] 	found org.antlr#antlr-runtime;3.4 in maven2
[ivy:resolve] 	found org.antlr#ST4;4.0.4 in maven2
[ivy:resolve] 	found com.jolbox#bonecp;0.7.1.RELEASE in maven2
[ivy:resolve] 	found com.google.guava#guava;r08 in maven2
[ivy:resolve] 	found commons-pool#commons-pool;1.5.4 in maven2
[ivy:resolve] 	found org.datanucleus#datanucleus-api-jdo;3.2.1 in maven2
[ivy:resolve] 	found org.datanucleus#datanucleus-core;3.2.2 in maven2
[ivy:resolve] 	found org.datanucleus#datanucleus-rdbms;3.2.1 in maven2
[ivy:resolve] 	found javax.jdo#jdo-api;3.0.1 in maven2
[ivy:resolve] 	found org.apache.derby#derby;10.4.2.0 in maven2
[ivy:resolve] 	found com.google.protobuf#protobuf-java;2.4.1 in maven2
[ivy:resolve] 	found org.iq80.snappy#snappy;0.2 in maven2
[ivy:resolve] 	found org.json#json;20090211 in maven2
[ivy:resolve] 	found commons-collections#commons-collections;3.2.1 in maven2
[ivy:resolve] 	found commons-configuration#commons-configuration;1.6 in maven2
[ivy:resolve] 	found com.googlecode.javaewah#JavaEWAH;0.3.2 in maven2
[ivy:resolve] 	found javolution#javolution;5.5.1 in maven2
[ivy:resolve] 	found jline#jline;0.9.94 in maven2
[ivy:resolve] 	found com.google.guava#guava;11.0.2 in maven2
[ivy:resolve] 	found com.google.code.findbugs#jsr305;1.3.9 in maven2
[ivy:resolve] :: resolution report :: resolve 6867ms :: artifacts dl 17ms
[ivy:resolve] 	:: evicted modules:
[ivy:resolve] 	com.google.guava#guava;r08 by [com.google.guava#guava;11.0.2] in [default]
[ivy:resolve] 	org.slf4j#slf4j-api;1.5.10 by [org.slf4j#slf4j-api;1.6.1] in [default]
	---------------------------------------------------------------------
	|                  |            modules            ||   artifacts   |
	|       conf       | number| search|dwnlded|evicted|| number|dwnlded|
	---------------------------------------------------------------------
	|      default     |   39  |   0   |   0   |   2   ||   37  |   0   |
	---------------------------------------------------------------------
[ivy:report] Processing /data/hive-ptest/working/apache-svn-trunk-source/build/ivy/resolution-cache/org.apache.hive-hive-service-default.xml to /data/hive-ptest/working/apache-svn-trunk-source/build/ivy/report/org.apache.hive-hive-service-default.html

make-pom:
     [echo] Project: service
     [echo]  Writing POM to /data/hive-ptest/working/apache-svn-trunk-source/build/service/pom.xml
[ivy:makepom] DEPRECATED: 'ivy.conf.file' is deprecated, use 'ivy.settings.file' instead
[ivy:makepom] :: loading settings :: file = /data/hive-ptest/working/apache-svn-trunk-source/ivy/ivysettings.xml

create-dirs:
     [echo] Project: service
     [copy] Warning: /data/hive-ptest/working/apache-svn-trunk-source/service/src/test/resources does not exist.

init:
     [echo] Project: service

ivy-retrieve:
     [echo] Project: service
[ivy:retrieve] :: retrieving :: org.apache.hive#hive-service
[ivy:retrieve] 	confs: [default]
[ivy:retrieve] 	0 artifacts copied, 37 already retrieved (0kB/20ms)

compile:
     [echo] Project: service
    [javac] Compiling 151 source files to /data/hive-ptest/working/apache-svn-trunk-source/build/service/classes
    [javac] Note: /data/hive-ptest/working/apache-svn-trunk-source/service/src/java/org/apache/hive/service/cli/operation/SQLOperation.java uses or overrides a deprecated API.
    [javac] Note: Recompile with -Xlint:deprecation for details.
    [javac] Note: Some input files use unchecked or unsafe operations.
    [javac] Note: Recompile with -Xlint:unchecked for details.

jar:
     [echo] Project: service
      [jar] Building jar: /data/hive-ptest/working/apache-svn-trunk-source/build/service/hive-service-0.13.0-SNAPSHOT.jar
[ivy:publish] :: delivering :: org.apache.hive#hive-service;0.13.0-SNAPSHOT :: 0.13.0-SNAPSHOT :: integration :: Fri Sep 06 22:51:41 EDT 2013
[ivy:publish] 	delivering ivy file to /data/hive-ptest/working/apache-svn-trunk-source/build/service/ivy-0.13.0-SNAPSHOT.xml
[ivy:publish] :: publishing :: org.apache.hive#hive-service
[ivy:publish] 	published hive-service to /data/hive-ptest/working/ivy/local/org.apache.hive/hive-service/0.13.0-SNAPSHOT/jars/hive-service.jar
[ivy:publish] 	published ivy to /data/hive-ptest/working/ivy/local/org.apache.hive/hive-service/0.13.0-SNAPSHOT/ivys/ivy.xml

ivy-init-settings:
     [echo] Project: cli

check-ivy:
     [echo] Project: cli

ivy-resolve:
     [echo] Project: cli
[ivy:resolve] :: loading settings :: file = /data/hive-ptest/working/apache-svn-trunk-source/ivy/ivysettings.xml
[ivy:resolve] :: resolving dependencies :: org.apache.hive#hive-cli;0.13.0-SNAPSHOT
[ivy:resolve] 	confs: [default]
[ivy:resolve] 	found org.apache.hive#hive-service;0.13.0-SNAPSHOT in local
[ivy:resolve] 	found org.apache.hive#hive-exec;0.13.0-SNAPSHOT in local
[ivy:resolve] 	found org.apache.hive#hive-metastore;0.13.0-SNAPSHOT in local
[ivy:resolve] 	found org.apache.hive#hive-serde;0.13.0-SNAPSHOT in local
[ivy:resolve] 	found org.apache.hive#hive-common;0.13.0-SNAPSHOT in local
[ivy:resolve] 	found org.apache.hive#hive-shims;0.13.0-SNAPSHOT in local
[ivy:resolve] 	found commons-cli#commons-cli;1.2 in maven2
[ivy:resolve] 	found org.apache.commons#commons-compress;1.4.1 in maven2
[ivy:resolve] 	found org.tukaani#xz;1.0 in maven2
[ivy:resolve] 	found commons-lang#commons-lang;2.4 in maven2
[ivy:resolve] 	found log4j#log4j;1.2.16 in maven2
[ivy:resolve] 	found org.slf4j#slf4j-api;1.6.1 in maven2
[ivy:resolve] 	found org.slf4j#slf4j-log4j12;1.6.1 in maven2
[ivy:resolve] 	found org.mockito#mockito-all;1.8.2 in maven2
[ivy:resolve] 	found org.apache.thrift#libfb303;0.9.0 in maven2
[ivy:resolve] 	found commons-codec#commons-codec;1.4 in maven2
[ivy:resolve] 	found org.apache.avro#avro;1.7.1 in maven2
[ivy:resolve] 	found org.apache.avro#avro-mapred;1.7.1 in maven2
[ivy:resolve] 	found org.antlr#antlr;3.4 in maven2
[ivy:resolve] 	found org.antlr#antlr-runtime;3.4 in maven2
[ivy:resolve] 	found org.antlr#ST4;4.0.4 in maven2
[ivy:resolve] 	found com.jolbox#bonecp;0.7.1.RELEASE in maven2
[ivy:resolve] 	found com.google.guava#guava;r08 in maven2
[ivy:resolve] 	found commons-pool#commons-pool;1.5.4 in maven2
[ivy:resolve] 	found org.datanucleus#datanucleus-api-jdo;3.2.1 in maven2
[ivy:resolve] 	found org.datanucleus#datanucleus-core;3.2.2 in maven2
[ivy:resolve] 	found org.datanucleus#datanucleus-rdbms;3.2.1 in maven2
[ivy:resolve] 	found javax.jdo#jdo-api;3.0.1 in maven2
[ivy:resolve] 	found org.apache.derby#derby;10.4.2.0 in maven2
[ivy:resolve] 	found com.google.protobuf#protobuf-java;2.4.1 in maven2
[ivy:resolve] 	found org.iq80.snappy#snappy;0.2 in maven2
[ivy:resolve] 	found org.json#json;20090211 in maven2
[ivy:resolve] 	found commons-collections#commons-collections;3.2.1 in maven2
[ivy:resolve] 	found commons-configuration#commons-configuration;1.6 in maven2
[ivy:resolve] 	found com.googlecode.javaewah#JavaEWAH;0.3.2 in maven2
[ivy:resolve] 	found javolution#javolution;5.5.1 in maven2
[ivy:resolve] 	found jline#jline;0.9.94 in maven2
[ivy:resolve] 	found com.google.guava#guava;11.0.2 in maven2
[ivy:resolve] 	found com.google.code.findbugs#jsr305;1.3.9 in maven2
[ivy:resolve] downloading /data/hive-ptest/working/ivy/local/org.apache.hive/hive-service/0.13.0-SNAPSHOT/jars/hive-service.jar ...
[ivy:resolve] ........................ (1469kB)
[ivy:resolve] .. (0kB)
[ivy:resolve] 	[SUCCESSFUL ] org.apache.hive#hive-service;0.13.0-SNAPSHOT!hive-service.jar (21ms)
[ivy:resolve] :: resolution report :: resolve 6800ms :: artifacts dl 39ms
[ivy:resolve] 	:: evicted modules:
[ivy:resolve] 	com.google.guava#guava;r08 by [com.google.guava#guava;11.0.2] in [default]
[ivy:resolve] 	org.slf4j#slf4j-api;1.5.10 by [org.slf4j#slf4j-api;1.6.1] in [default]
	---------------------------------------------------------------------
	|                  |            modules            ||   artifacts   |
	|       conf       | number| search|dwnlded|evicted|| number|dwnlded|
	---------------------------------------------------------------------
	|      default     |   40  |   1   |   1   |   2   ||   38  |   1   |
	---------------------------------------------------------------------
[ivy:report] Processing /data/hive-ptest/working/apache-svn-trunk-source/build/ivy/resolution-cache/org.apache.hive-hive-cli-default.xml to /data/hive-ptest/working/apache-svn-trunk-source/build/ivy/report/org.apache.hive-hive-cli-default.html

make-pom:
     [echo] Project: cli
     [echo]  Writing POM to /data/hive-ptest/working/apache-svn-trunk-source/build/cli/pom.xml
[ivy:makepom] DEPRECATED: 'ivy.conf.file' is deprecated, use 'ivy.settings.file' instead
[ivy:makepom] :: loading settings :: file = /data/hive-ptest/working/apache-svn-trunk-source/ivy/ivysettings.xml

create-dirs:
     [echo] Project: cli
     [copy] Warning: /data/hive-ptest/working/apache-svn-trunk-source/cli/src/test/resources does not exist.

init:
     [echo] Project: cli

setup:
     [echo] Project: cli

ivy-retrieve:
     [echo] Project: cli
[ivy:retrieve] :: retrieving :: org.apache.hive#hive-cli
[ivy:retrieve] 	confs: [default]
[ivy:retrieve] 	1 artifacts copied, 37 already retrieved (1469kB/14ms)

compile:
     [echo] Project: cli
    [javac] Compiling 4 source files to /data/hive-ptest/working/apache-svn-trunk-source/build/cli/classes
    [javac] /data/hive-ptest/working/apache-svn-trunk-source/cli/src/java/org/apache/hadoop/hive/cli/CliDriver.java:71: warning: sun.misc.Signal is Sun proprietary API and may be removed in a future release
    [javac] import sun.misc.Signal;
    [javac]                ^
    [javac] /data/hive-ptest/working/apache-svn-trunk-source/cli/src/java/org/apache/hadoop/hive/cli/CliDriver.java:72: warning: sun.misc.SignalHandler is Sun proprietary API and may be removed in a future release
    [javac] import sun.misc.SignalHandler;
    [javac]                ^
    [javac] /data/hive-ptest/working/apache-svn-trunk-source/cli/src/java/org/apache/hadoop/hive/cli/CliDriver.java:362: warning: sun.misc.SignalHandler is Sun proprietary API and may be removed in a future release
    [javac]     SignalHandler oldSignal = null;
    [javac]     ^
    [javac] /data/hive-ptest/working/apache-svn-trunk-source/cli/src/java/org/apache/hadoop/hive/cli/CliDriver.java:363: warning: sun.misc.Signal is Sun proprietary API and may be removed in a future release
    [javac]     Signal interupSignal = null;
    [javac]     ^
    [javac] /data/hive-ptest/working/apache-svn-trunk-source/cli/src/java/org/apache/hadoop/hive/cli/CliDriver.java:368: warning: sun.misc.Signal is Sun proprietary API and may be removed in a future release
    [javac]       interupSignal = new Signal("INT");
    [javac]                           ^
    [javac] /data/hive-ptest/working/apache-svn-trunk-source/cli/src/java/org/apache/hadoop/hive/cli/CliDriver.java:369: warning: sun.misc.SignalHandler is Sun proprietary API and may be removed in a future release
    [javac]       oldSignal = Signal.handle(interupSignal, new SignalHandler() {
    [javac]                                                    ^
    [javac] /data/hive-ptest/working/apache-svn-trunk-source/cli/src/java/org/apache/hadoop/hive/cli/CliDriver.java:369: warning: sun.misc.SignalHandler is Sun proprietary API and may be removed in a future release
    [javac]       oldSignal = Signal.handle(interupSignal, new SignalHandler() {
    [javac]                                                    ^
    [javac] /data/hive-ptest/working/apache-svn-trunk-source/cli/src/java/org/apache/hadoop/hive/cli/CliDriver.java:374: warning: sun.misc.Signal is Sun proprietary API and may be removed in a future release
    [javac]         public void handle(Signal signal) {
    [javac]                            ^
    [javac] /data/hive-ptest/working/apache-svn-trunk-source/cli/src/java/org/apache/hadoop/hive/cli/CliDriver.java:369: warning: sun.misc.Signal is Sun proprietary API and may be removed in a future release
    [javac]       oldSignal = Signal.handle(interupSignal, new SignalHandler() {
    [javac]                   ^
    [javac] /data/hive-ptest/working/apache-svn-trunk-source/cli/src/java/org/apache/hadoop/hive/cli/CliDriver.java:430: warning: sun.misc.Signal is Sun proprietary API and may be removed in a future release
    [javac]         Signal.handle(interupSignal, oldSignal);
    [javac]         ^
    [javac] Note: /data/hive-ptest/working/apache-svn-trunk-source/cli/src/java/org/apache/hadoop/hive/cli/RCFileCat.java uses or overrides a deprecated API.
    [javac] Note: Recompile with -Xlint:deprecation for details.
    [javac] Note: /data/hive-ptest/working/apache-svn-trunk-source/cli/src/java/org/apache/hadoop/hive/cli/CliDriver.java uses unchecked or unsafe operations.
    [javac] Note: Recompile with -Xlint:unchecked for details.
    [javac] 10 warnings

jar:
     [echo] Project: cli
      [jar] Building jar: /data/hive-ptest/working/apache-svn-trunk-source/build/cli/hive-cli-0.13.0-SNAPSHOT.jar
[ivy:publish] :: delivering :: org.apache.hive#hive-cli;0.13.0-SNAPSHOT :: 0.13.0-SNAPSHOT :: integration :: Fri Sep 06 22:51:48 EDT 2013
[ivy:publish] 	delivering ivy file to /data/hive-ptest/working/apache-svn-trunk-source/build/cli/ivy-0.13.0-SNAPSHOT.xml
[ivy:publish] :: publishing :: org.apache.hive#hive-cli
[ivy:publish] 	published hive-cli to /data/hive-ptest/working/ivy/local/org.apache.hive/hive-cli/0.13.0-SNAPSHOT/jars/hive-cli.jar
[ivy:publish] 	published ivy to /data/hive-ptest/working/ivy/local/org.apache.hive/hive-cli/0.13.0-SNAPSHOT/ivys/ivy.xml

ivy-init-settings:
     [echo] Project: jdbc

check-ivy:
     [echo] Project: jdbc

ivy-resolve:
     [echo] Project: jdbc
[ivy:resolve] :: loading settings :: file = /data/hive-ptest/working/apache-svn-trunk-source/ivy/ivysettings.xml
[ivy:resolve] :: resolving dependencies :: org.apache.hive#hive-jdbc;0.13.0-SNAPSHOT
[ivy:resolve] 	confs: [default]
[ivy:resolve] 	found org.apache.hive#hive-cli;0.13.0-SNAPSHOT in local
[ivy:resolve] 	found org.apache.hive#hive-service;0.13.0-SNAPSHOT in local
[ivy:resolve] 	found org.apache.hive#hive-exec;0.13.0-SNAPSHOT in local
[ivy:resolve] 	found org.apache.hive#hive-metastore;0.13.0-SNAPSHOT in local
[ivy:resolve] 	found org.apache.hive#hive-serde;0.13.0-SNAPSHOT in local
[ivy:resolve] 	found org.apache.hive#hive-common;0.13.0-SNAPSHOT in local
[ivy:resolve] 	found org.apache.hive#hive-shims;0.13.0-SNAPSHOT in local
[ivy:resolve] 	found commons-cli#commons-cli;1.2 in maven2
[ivy:resolve] 	found org.apache.commons#commons-compress;1.4.1 in maven2
[ivy:resolve] 	found org.tukaani#xz;1.0 in maven2
[ivy:resolve] 	found commons-lang#commons-lang;2.4 in maven2
[ivy:resolve] 	found log4j#log4j;1.2.16 in maven2
[ivy:resolve] 	found org.slf4j#slf4j-api;1.6.1 in maven2
[ivy:resolve] 	found org.slf4j#slf4j-log4j12;1.6.1 in maven2
[ivy:resolve] 	found org.mockito#mockito-all;1.8.2 in maven2
[ivy:resolve] 	found org.apache.thrift#libfb303;0.9.0 in maven2
[ivy:resolve] 	found commons-codec#commons-codec;1.4 in maven2
[ivy:resolve] 	found org.apache.avro#avro;1.7.1 in maven2
[ivy:resolve] 	found org.apache.avro#avro-mapred;1.7.1 in maven2
[ivy:resolve] 	found org.antlr#antlr;3.4 in maven2
[ivy:resolve] 	found org.antlr#antlr-runtime;3.4 in maven2
[ivy:resolve] 	found org.antlr#ST4;4.0.4 in maven2
[ivy:resolve] 	found com.jolbox#bonecp;0.7.1.RELEASE in maven2
[ivy:resolve] 	found com.google.guava#guava;r08 in maven2
[ivy:resolve] 	found commons-pool#commons-pool;1.5.4 in maven2
[ivy:resolve] 	found org.datanucleus#datanucleus-api-jdo;3.2.1 in maven2
[ivy:resolve] 	found org.datanucleus#datanucleus-core;3.2.2 in maven2
[ivy:resolve] 	found org.datanucleus#datanucleus-rdbms;3.2.1 in maven2
[ivy:resolve] 	found javax.jdo#jdo-api;3.0.1 in maven2
[ivy:resolve] 	found org.apache.derby#derby;10.4.2.0 in maven2
[ivy:resolve] 	found com.google.protobuf#protobuf-java;2.4.1 in maven2
[ivy:resolve] 	found org.iq80.snappy#snappy;0.2 in maven2
[ivy:resolve] 	found org.json#json;20090211 in maven2
[ivy:resolve] 	found commons-collections#commons-collections;3.2.1 in maven2
[ivy:resolve] 	found commons-configuration#commons-configuration;1.6 in maven2
[ivy:resolve] 	found com.googlecode.javaewah#JavaEWAH;0.3.2 in maven2
[ivy:resolve] 	found javolution#javolution;5.5.1 in maven2
[ivy:resolve] 	found jline#jline;0.9.94 in maven2
[ivy:resolve] 	found com.google.guava#guava;11.0.2 in maven2
[ivy:resolve] 	found com.google.code.findbugs#jsr305;1.3.9 in maven2
[ivy:resolve] downloading /data/hive-ptest/working/ivy/local/org.apache.hive/hive-cli/0.13.0-SNAPSHOT/jars/hive-cli.jar ...
[ivy:resolve] .. (33kB)
[ivy:resolve] .. (0kB)
[ivy:resolve] 	[SUCCESSFUL ] org.apache.hive#hive-cli;0.13.0-SNAPSHOT!hive-cli.jar (3ms)
[ivy:resolve] :: resolution report :: resolve 6738ms :: artifacts dl 21ms
[ivy:resolve] 	:: evicted modules:
[ivy:resolve] 	com.google.guava#guava;r08 by [com.google.guava#guava;11.0.2] in [default]
[ivy:resolve] 	org.slf4j#slf4j-api;1.5.10 by [org.slf4j#slf4j-api;1.6.1] in [default]
	---------------------------------------------------------------------
	|                  |            modules            ||   artifacts   |
	|       conf       | number| search|dwnlded|evicted|| number|dwnlded|
	---------------------------------------------------------------------
	|      default     |   41  |   1   |   1   |   2   ||   39  |   1   |
	---------------------------------------------------------------------
[ivy:report] Processing /data/hive-ptest/working/apache-svn-trunk-source/build/ivy/resolution-cache/org.apache.hive-hive-jdbc-default.xml to /data/hive-ptest/working/apache-svn-trunk-source/build/ivy/report/org.apache.hive-hive-jdbc-default.html

make-pom:
     [echo] Project: jdbc
     [echo]  Writing POM to /data/hive-ptest/working/apache-svn-trunk-source/build/jdbc/pom.xml
[ivy:makepom] DEPRECATED: 'ivy.conf.file' is deprecated, use 'ivy.settings.file' instead
[ivy:makepom] :: loading settings :: file = /data/hive-ptest/working/apache-svn-trunk-source/ivy/ivysettings.xml

create-dirs:
     [echo] Project: jdbc
     [copy] Warning: /data/hive-ptest/working/apache-svn-trunk-source/jdbc/src/test/resources does not exist.

init:
     [echo] Project: jdbc

ivy-retrieve:
     [echo] Project: jdbc
[ivy:retrieve] :: retrieving :: org.apache.hive#hive-jdbc
[ivy:retrieve] 	confs: [default]
[ivy:retrieve] 	1 artifacts copied, 38 already retrieved (33kB/21ms)

compile:
     [echo] Project: jdbc
    [javac] Compiling 28 source files to /data/hive-ptest/working/apache-svn-trunk-source/build/jdbc/classes
    [javac] Note: Some input files use or override a deprecated API.
    [javac] Note: Recompile with -Xlint:deprecation for details.
    [javac] Note: Some input files use unchecked or unsafe operations.
    [javac] Note: Recompile with -Xlint:unchecked for details.

jar:
     [echo] Project: jdbc
      [jar] Building jar: /data/hive-ptest/working/apache-svn-trunk-source/build/jdbc/hive-jdbc-0.13.0-SNAPSHOT.jar
[ivy:publish] :: delivering :: org.apache.hive#hive-jdbc;0.13.0-SNAPSHOT :: 0.13.0-SNAPSHOT :: integration :: Fri Sep 06 22:51:57 EDT 2013
[ivy:publish] 	delivering ivy file to /data/hive-ptest/working/apache-svn-trunk-source/build/jdbc/ivy-0.13.0-SNAPSHOT.xml
[ivy:publish] :: publishing :: org.apache.hive#hive-jdbc
[ivy:publish] 	published hive-jdbc to /data/hive-ptest/working/ivy/local/org.apache.hive/hive-jdbc/0.13.0-SNAPSHOT/jars/hive-jdbc.jar
[ivy:publish] 	published ivy to /data/hive-ptest/working/ivy/local/org.apache.hive/hive-jdbc/0.13.0-SNAPSHOT/ivys/ivy.xml

ivy-init-settings:
     [echo] Project: beeline

check-ivy:
     [echo] Project: beeline

ivy-resolve:
     [echo] Project: beeline
[ivy:resolve] :: loading settings :: file = /data/hive-ptest/working/apache-svn-trunk-source/ivy/ivysettings.xml
[ivy:resolve] :: resolving dependencies :: org.apache.hive#hive-beeline;0.13.0-SNAPSHOT
[ivy:resolve] 	confs: [default]
[ivy:resolve] 	found org.apache.hive#hive-service;0.13.0-SNAPSHOT in local
[ivy:resolve] 	found org.apache.hive#hive-exec;0.13.0-SNAPSHOT in local
[ivy:resolve] 	found org.apache.hive#hive-metastore;0.13.0-SNAPSHOT in local
[ivy:resolve] 	found org.apache.hive#hive-serde;0.13.0-SNAPSHOT in local
[ivy:resolve] 	found org.apache.hive#hive-common;0.13.0-SNAPSHOT in local
[ivy:resolve] 	found org.apache.hive#hive-shims;0.13.0-SNAPSHOT in local
[ivy:resolve] 	found commons-cli#commons-cli;1.2 in maven2
[ivy:resolve] 	found org.apache.commons#commons-compress;1.4.1 in maven2
[ivy:resolve] 	found org.tukaani#xz;1.0 in maven2
[ivy:resolve] 	found commons-lang#commons-lang;2.4 in maven2
[ivy:resolve] 	found log4j#log4j;1.2.16 in maven2
[ivy:resolve] 	found org.slf4j#slf4j-api;1.6.1 in maven2
[ivy:resolve] 	found org.slf4j#slf4j-log4j12;1.6.1 in maven2
[ivy:resolve] 	found org.mockito#mockito-all;1.8.2 in maven2
[ivy:resolve] 	found org.apache.thrift#libfb303;0.9.0 in maven2
[ivy:resolve] 	found commons-codec#commons-codec;1.4 in maven2
[ivy:resolve] 	found org.apache.avro#avro;1.7.1 in maven2
[ivy:resolve] 	found org.apache.avro#avro-mapred;1.7.1 in maven2
[ivy:resolve] 	found org.antlr#antlr;3.4 in maven2
[ivy:resolve] 	found org.antlr#antlr-runtime;3.4 in maven2
[ivy:resolve] 	found org.antlr#ST4;4.0.4 in maven2
[ivy:resolve] 	found com.jolbox#bonecp;0.7.1.RELEASE in maven2
[ivy:resolve] 	found com.google.guava#guava;r08 in maven2
[ivy:resolve] 	found commons-pool#commons-pool;1.5.4 in maven2
[ivy:resolve] 	found org.datanucleus#datanucleus-api-jdo;3.2.1 in maven2
[ivy:resolve] 	found org.datanucleus#datanucleus-core;3.2.2 in maven2
[ivy:resolve] 	found org.datanucleus#datanucleus-rdbms;3.2.1 in maven2
[ivy:resolve] 	found javax.jdo#jdo-api;3.0.1 in maven2
[ivy:resolve] 	found org.apache.derby#derby;10.4.2.0 in maven2
[ivy:resolve] 	found com.google.protobuf#protobuf-java;2.4.1 in maven2
[ivy:resolve] 	found org.iq80.snappy#snappy;0.2 in maven2
[ivy:resolve] 	found org.json#json;20090211 in maven2
[ivy:resolve] 	found commons-collections#commons-collections;3.2.1 in maven2
[ivy:resolve] 	found commons-configuration#commons-configuration;1.6 in maven2
[ivy:resolve] 	found com.googlecode.javaewah#JavaEWAH;0.3.2 in maven2
[ivy:resolve] 	found javolution#javolution;5.5.1 in maven2
[ivy:resolve] 	found jline#jline;0.9.94 in maven2
[ivy:resolve] 	found com.google.guava#guava;11.0.2 in maven2
[ivy:resolve] 	found com.google.code.findbugs#jsr305;1.3.9 in maven2
[ivy:resolve] 	found commons-io#commons-io;2.4 in maven2
[ivy:resolve] 	found commons-logging#commons-logging;1.0.4 in maven2
[ivy:resolve] 	found commons-logging#commons-logging-api;1.0.4 in maven2
[ivy:resolve] 	found org.apache.thrift#libthrift;0.9.0 in maven2
[ivy:resolve] :: resolution report :: resolve 7662ms :: artifacts dl 26ms
[ivy:resolve] 	:: evicted modules:
[ivy:resolve] 	com.google.guava#guava;r08 by [com.google.guava#guava;11.0.2] in [default]
[ivy:resolve] 	org.slf4j#slf4j-api;1.5.10 by [org.slf4j#slf4j-api;1.6.1] in [default]
	---------------------------------------------------------------------
	|                  |            modules            ||   artifacts   |
	|       conf       | number| search|dwnlded|evicted|| number|dwnlded|
	---------------------------------------------------------------------
	|      default     |   44  |   0   |   0   |   2   ||   42  |   0   |
	---------------------------------------------------------------------
[ivy:report] Processing /data/hive-ptest/working/apache-svn-trunk-source/build/ivy/resolution-cache/org.apache.hive-hive-beeline-default.xml to /data/hive-ptest/working/apache-svn-trunk-source/build/ivy/report/org.apache.hive-hive-beeline-default.html

make-pom:
     [echo] Project: beeline
     [echo]  Writing POM to /data/hive-ptest/working/apache-svn-trunk-source/build/beeline/pom.xml
[ivy:makepom] DEPRECATED: 'ivy.conf.file' is deprecated, use 'ivy.settings.file' instead
[ivy:makepom] :: loading settings :: file = /data/hive-ptest/working/apache-svn-trunk-source/ivy/ivysettings.xml

create-dirs:
     [echo] Project: beeline
     [copy] Warning: /data/hive-ptest/working/apache-svn-trunk-source/beeline/src/test/resources does not exist.

init:
     [echo] Project: beeline

setup:
     [echo] Project: beeline

ivy-retrieve:
     [echo] Project: beeline
[ivy:retrieve] :: retrieving :: org.apache.hive#hive-beeline
[ivy:retrieve] 	confs: [default]
[ivy:retrieve] 	0 artifacts copied, 42 already retrieved (0kB/23ms)

compile:
     [echo] Project: beeline
    [javac] Compiling 29 source files to /data/hive-ptest/working/apache-svn-trunk-source/build/beeline/classes
    [javac] /data/hive-ptest/working/apache-svn-trunk-source/beeline/src/java/org/apache/hive/beeline/SunSignalHandler.java:28: warning: sun.misc.Signal is Sun proprietary API and may be removed in a future release
    [javac] import sun.misc.Signal;
    [javac]                ^
    [javac] /data/hive-ptest/working/apache-svn-trunk-source/beeline/src/java/org/apache/hive/beeline/SunSignalHandler.java:29: warning: sun.misc.SignalHandler is Sun proprietary API and may be removed in a future release
    [javac] import sun.misc.SignalHandler;
    [javac]                ^
    [javac] /data/hive-ptest/working/apache-svn-trunk-source/beeline/src/java/org/apache/hive/beeline/SunSignalHandler.java:31: warning: sun.misc.SignalHandler is Sun proprietary API and may be removed in a future release
    [javac] public class SunSignalHandler implements BeeLineSignalHandler, SignalHandler {
    [javac]                                                                ^
    [javac] /data/hive-ptest/working/apache-svn-trunk-source/beeline/src/java/org/apache/hive/beeline/SunSignalHandler.java:44: warning: sun.misc.Signal is Sun proprietary API and may be removed in a future release
    [javac]   public void handle (Signal signal) {
    [javac]                       ^
    [javac] /data/hive-ptest/working/apache-svn-trunk-source/beeline/src/java/org/apache/hive/beeline/SunSignalHandler.java:37: warning: sun.misc.Signal is Sun proprietary API and may be removed in a future release
    [javac]     Signal.handle (new Signal ("INT"), this);
    [javac]                        ^
    [javac] /data/hive-ptest/working/apache-svn-trunk-source/beeline/src/java/org/apache/hive/beeline/SunSignalHandler.java:37: warning: sun.misc.Signal is Sun proprietary API and may be removed in a future release
    [javac]     Signal.handle (new Signal ("INT"), this);
    [javac]     ^
    [javac] Note: Some input files use unchecked or unsafe operations.
    [javac] Note: Recompile with -Xlint:unchecked for details.
    [javac] 6 warnings
     [copy] Copying 2 files to /data/hive-ptest/working/apache-svn-trunk-source/build/beeline/classes

jar:
     [echo] Project: beeline
      [jar] Building jar: /data/hive-ptest/working/apache-svn-trunk-source/build/beeline/hive-beeline-0.13.0-SNAPSHOT.jar
[ivy:publish] :: delivering :: org.apache.hive#hive-beeline;0.13.0-SNAPSHOT :: 0.13.0-SNAPSHOT :: integration :: Fri Sep 06 22:52:05 EDT 2013
[ivy:publish] 	delivering ivy file to /data/hive-ptest/working/apache-svn-trunk-source/build/beeline/ivy-0.13.0-SNAPSHOT.xml
[ivy:publish] :: publishing :: org.apache.hive#hive-beeline
[ivy:publish] 	published hive-beeline to /data/hive-ptest/working/ivy/local/org.apache.hive/hive-beeline/0.13.0-SNAPSHOT/jars/hive-beeline.jar
[ivy:publish] 	published ivy to /data/hive-ptest/working/ivy/local/org.apache.hive/hive-beeline/0.13.0-SNAPSHOT/ivys/ivy.xml

ivy-init-settings:
     [echo] Project: hwi

check-ivy:
     [echo] Project: hwi

ivy-resolve:
     [echo] Project: hwi
[ivy:resolve] :: loading settings :: file = /data/hive-ptest/working/apache-svn-trunk-source/ivy/ivysettings.xml
[ivy:resolve] :: resolving dependencies :: org.apache.hive#hive-hwi;0.13.0-SNAPSHOT
[ivy:resolve] 	confs: [default]
[ivy:resolve] 	found org.apache.hive#hive-cli;0.13.0-SNAPSHOT in local
[ivy:resolve] 	found org.apache.hive#hive-service;0.13.0-SNAPSHOT in local
[ivy:resolve] 	found org.apache.hive#hive-exec;0.13.0-SNAPSHOT in local
[ivy:resolve] 	found org.apache.hive#hive-metastore;0.13.0-SNAPSHOT in local
[ivy:resolve] 	found org.apache.hive#hive-serde;0.13.0-SNAPSHOT in local
[ivy:resolve] 	found org.apache.hive#hive-common;0.13.0-SNAPSHOT in local
[ivy:resolve] 	found org.apache.hive#hive-shims;0.13.0-SNAPSHOT in local
[ivy:resolve] 	found commons-cli#commons-cli;1.2 in maven2
[ivy:resolve] 	found org.apache.commons#commons-compress;1.4.1 in maven2
[ivy:resolve] 	found org.tukaani#xz;1.0 in maven2
[ivy:resolve] 	found commons-lang#commons-lang;2.4 in maven2
[ivy:resolve] 	found log4j#log4j;1.2.16 in maven2
[ivy:resolve] 	found org.slf4j#slf4j-api;1.6.1 in maven2
[ivy:resolve] 	found org.slf4j#slf4j-log4j12;1.6.1 in maven2
[ivy:resolve] 	found org.mockito#mockito-all;1.8.2 in maven2
[ivy:resolve] 	found org.apache.thrift#libfb303;0.9.0 in maven2
[ivy:resolve] 	found commons-codec#commons-codec;1.4 in maven2
[ivy:resolve] 	found org.apache.avro#avro;1.7.1 in maven2
[ivy:resolve] 	found org.apache.avro#avro-mapred;1.7.1 in maven2
[ivy:resolve] 	found org.antlr#antlr;3.4 in maven2
[ivy:resolve] 	found org.antlr#antlr-runtime;3.4 in maven2
[ivy:resolve] 	found org.antlr#ST4;4.0.4 in maven2
[ivy:resolve] 	found com.jolbox#bonecp;0.7.1.RELEASE in maven2
[ivy:resolve] 	found com.google.guava#guava;r08 in maven2
[ivy:resolve] 	found commons-pool#commons-pool;1.5.4 in maven2
[ivy:resolve] 	found org.datanucleus#datanucleus-api-jdo;3.2.1 in maven2
[ivy:resolve] 	found org.datanucleus#datanucleus-core;3.2.2 in maven2
[ivy:resolve] 	found org.datanucleus#datanucleus-rdbms;3.2.1 in maven2
[ivy:resolve] 	found javax.jdo#jdo-api;3.0.1 in maven2
[ivy:resolve] 	found org.apache.derby#derby;10.4.2.0 in maven2
[ivy:resolve] 	found com.google.protobuf#protobuf-java;2.4.1 in maven2
[ivy:resolve] 	found org.iq80.snappy#snappy;0.2 in maven2
[ivy:resolve] 	found org.json#json;20090211 in maven2
[ivy:resolve] 	found commons-collections#commons-collections;3.2.1 in maven2
[ivy:resolve] 	found commons-configuration#commons-configuration;1.6 in maven2
[ivy:resolve] 	found com.googlecode.javaewah#JavaEWAH;0.3.2 in maven2
[ivy:resolve] 	found javolution#javolution;5.5.1 in maven2
[ivy:resolve] 	found jline#jline;0.9.94 in maven2
[ivy:resolve] 	found com.google.guava#guava;11.0.2 in maven2
[ivy:resolve] 	found com.google.code.findbugs#jsr305;1.3.9 in maven2
[ivy:resolve] 	found org.mortbay.jetty#jetty;6.1.26 in maven2
[ivy:resolve] 	found org.mortbay.jetty#jetty-util;6.1.26 in maven2
[ivy:resolve] 	found org.mortbay.jetty#servlet-api;2.5-20081211 in maven2
[ivy:resolve] :: resolution report :: resolve 7125ms :: artifacts dl 19ms
[ivy:resolve] 	:: evicted modules:
[ivy:resolve] 	com.google.guava#guava;r08 by [com.google.guava#guava;11.0.2] in [default]
[ivy:resolve] 	org.slf4j#slf4j-api;1.5.10 by [org.slf4j#slf4j-api;1.6.1] in [default]
	---------------------------------------------------------------------
	|                  |            modules            ||   artifacts   |
	|       conf       | number| search|dwnlded|evicted|| number|dwnlded|
	---------------------------------------------------------------------
	|      default     |   44  |   0   |   0   |   2   ||   42  |   0   |
	---------------------------------------------------------------------
[ivy:report] Processing /data/hive-ptest/working/apache-svn-trunk-source/build/ivy/resolution-cache/org.apache.hive-hive-hwi-default.xml to /data/hive-ptest/working/apache-svn-trunk-source/build/ivy/report/org.apache.hive-hive-hwi-default.html

make-pom:
     [echo] Project: hwi
     [echo]  Writing POM to /data/hive-ptest/working/apache-svn-trunk-source/build/hwi/pom.xml
[ivy:makepom] DEPRECATED: 'ivy.conf.file' is deprecated, use 'ivy.settings.file' instead
[ivy:makepom] :: loading settings :: file = /data/hive-ptest/working/apache-svn-trunk-source/ivy/ivysettings.xml

create-dirs:
     [echo] Project: hwi
     [copy] Warning: /data/hive-ptest/working/apache-svn-trunk-source/hwi/src/test/resources does not exist.

init:
     [echo] Project: hwi

setup:
     [echo] Project: hwi

ivy-retrieve:
     [echo] Project: hwi
[ivy:retrieve] :: retrieving :: org.apache.hive#hive-hwi
[ivy:retrieve] 	confs: [default]
[ivy:retrieve] 	3 artifacts copied, 39 already retrieved (831kB/14ms)

war:
     [echo] Project: hwi
      [jar] Building jar: /data/hive-ptest/working/apache-svn-trunk-source/build/hwi/hive-hwi-0.13.0-SNAPSHOT.war

compile:
     [echo] Project: hwi
    [javac] /data/hive-ptest/working/apache-svn-trunk-source/hwi/build.xml:67: warning: 'includeantruntime' was not set, defaulting to build.sysclasspath=last; set to false for repeatable builds
    [javac] Compiling 6 source files to /data/hive-ptest/working/apache-svn-trunk-source/build/hwi/classes

jar:
     [echo] Project: hwi
      [jar] Building jar: /data/hive-ptest/working/apache-svn-trunk-source/build/hwi/hive-hwi-0.13.0-SNAPSHOT.jar
[ivy:publish] :: delivering :: org.apache.hive#hive-hwi;0.13.0-SNAPSHOT :: 0.13.0-SNAPSHOT :: integration :: Fri Sep 06 22:52:13 EDT 2013
[ivy:publish] 	delivering ivy file to /data/hive-ptest/working/apache-svn-trunk-source/build/hwi/ivy-0.13.0-SNAPSHOT.xml
[ivy:publish] :: publishing :: org.apache.hive#hive-hwi
[ivy:publish] 	published hive-hwi to /data/hive-ptest/working/ivy/local/org.apache.hive/hive-hwi/0.13.0-SNAPSHOT/jars/hive-hwi.jar
[ivy:publish] 	published ivy to /data/hive-ptest/working/ivy/local/org.apache.hive/hive-hwi/0.13.0-SNAPSHOT/ivys/ivy.xml

ivy-init-settings:
     [echo] Project: hbase-handler

check-ivy:
     [echo] Project: hbase-handler

ivy-resolve:
     [echo] Project: hbase-handler
[ivy:resolve] :: loading settings :: file = /data/hive-ptest/working/apache-svn-trunk-source/ivy/ivysettings.xml
[ivy:resolve] :: resolving dependencies :: org.apache.hive#hive-hbase-handler;0.13.0-SNAPSHOT
[ivy:resolve] 	confs: [default]
[ivy:resolve] 	found org.apache.hive#hive-exec;0.13.0-SNAPSHOT in local
[ivy:resolve] 	found org.apache.hive#hive-metastore;0.13.0-SNAPSHOT in local
[ivy:resolve] 	found org.apache.hive#hive-serde;0.13.0-SNAPSHOT in local
[ivy:resolve] 	found org.apache.hive#hive-common;0.13.0-SNAPSHOT in local
[ivy:resolve] 	found org.apache.hive#hive-shims;0.13.0-SNAPSHOT in local
[ivy:resolve] 	found commons-cli#commons-cli;1.2 in maven2
[ivy:resolve] 	found org.apache.commons#commons-compress;1.4.1 in maven2
[ivy:resolve] 	found org.tukaani#xz;1.0 in maven2
[ivy:resolve] 	found commons-lang#commons-lang;2.4 in maven2
[ivy:resolve] 	found log4j#log4j;1.2.16 in maven2
[ivy:resolve] 	found org.slf4j#slf4j-api;1.6.1 in maven2
[ivy:resolve] 	found org.slf4j#slf4j-log4j12;1.6.1 in maven2
[ivy:resolve] 	found org.mockito#mockito-all;1.8.2 in maven2
[ivy:resolve] 	found org.apache.thrift#libfb303;0.9.0 in maven2
[ivy:resolve] 	found commons-codec#commons-codec;1.4 in maven2
[ivy:resolve] 	found org.apache.avro#avro;1.7.1 in maven2
[ivy:resolve] 	found org.apache.avro#avro-mapred;1.7.1 in maven2
[ivy:resolve] 	found org.antlr#antlr;3.4 in maven2
[ivy:resolve] 	found org.antlr#antlr-runtime;3.4 in maven2
[ivy:resolve] 	found org.antlr#ST4;4.0.4 in maven2
[ivy:resolve] 	found com.jolbox#bonecp;0.7.1.RELEASE in maven2
[ivy:resolve] 	found com.google.guava#guava;r08 in maven2
[ivy:resolve] 	found commons-pool#commons-pool;1.5.4 in maven2
[ivy:resolve] 	found org.datanucleus#datanucleus-api-jdo;3.2.1 in maven2
[ivy:resolve] 	found org.datanucleus#datanucleus-core;3.2.2 in maven2
[ivy:resolve] 	found org.datanucleus#datanucleus-rdbms;3.2.1 in maven2
[ivy:resolve] 	found javax.jdo#jdo-api;3.0.1 in maven2
[ivy:resolve] 	found org.apache.derby#derby;10.4.2.0 in maven2
[ivy:resolve] 	found com.google.protobuf#protobuf-java;2.4.1 in maven2
[ivy:resolve] 	found org.iq80.snappy#snappy;0.2 in maven2
[ivy:resolve] 	found org.json#json;20090211 in maven2
[ivy:resolve] 	found commons-collections#commons-collections;3.2.1 in maven2
[ivy:resolve] 	found commons-configuration#commons-configuration;1.6 in maven2
[ivy:resolve] 	found com.googlecode.javaewah#JavaEWAH;0.3.2 in maven2
[ivy:resolve] 	found javolution#javolution;5.5.1 in maven2
[ivy:resolve] 	found jline#jline;0.9.94 in maven2
[ivy:resolve] 	found com.google.guava#guava;11.0.2 in maven2
[ivy:resolve] 	found com.google.code.findbugs#jsr305;1.3.9 in maven2
[ivy:resolve] 	found org.apache.hbase#hbase;0.94.6.1 in maven2
[ivy:resolve] 	found com.github.stephenc.high-scale-lib#high-scale-lib;1.1.1 in maven2
[ivy:resolve] 	found com.yammer.metrics#metrics-core;2.1.2 in maven2
[ivy:resolve] 	found org.codehaus.jackson#jackson-jaxrs;1.8.8 in maven2
[ivy:resolve] 	found org.codehaus.jackson#jackson-core-asl;1.8.8 in maven2
[ivy:resolve] 	found org.codehaus.jackson#jackson-mapper-asl;1.8.8 in maven2
[ivy:resolve] 	found org.codehaus.jackson#jackson-xc;1.8.8 in maven2
[ivy:resolve] downloading http://repo1.maven.org/maven2/org/apache/hbase/hbase/0.94.6.1/hbase-0.94.6.1-tests.jar ...
[ivy:resolve] ........................................ (2360kB)
[ivy:resolve] .. (0kB)
[ivy:resolve] 	[SUCCESSFUL ] org.apache.hbase#hbase;0.94.6.1!hbase.jar(test-jar) (49ms)
[ivy:resolve] downloading http://repo1.maven.org/maven2/org/apache/hbase/hbase/0.94.6.1/hbase-0.94.6.1.jar ...
[ivy:resolve] ......................................................................................................................................................................................................................................................................................................................................................................................................................................................................................................................................................................................................................................................................................................................................................................................................................................................................................................................................................................................................................................................................................................................................................................................................................................................................................................................................................................................................................................................................................................................................................................................................... (4952kB)
[ivy:resolve] .. (0kB)
[ivy:resolve] 	[SUCCESSFUL ] org.apache.hbase#hbase;0.94.6.1!hbase.jar (455ms)
[ivy:resolve] downloading http://repo1.maven.org/maven2/com/github/stephenc/high-scale-lib/high-scale-lib/1.1.1/high-scale-lib-1.1.1.jar ...
[ivy:resolve] ... (93kB)
[ivy:resolve] .. (0kB)
[ivy:resolve] 	[SUCCESSFUL ] com.github.stephenc.high-scale-lib#high-scale-lib;1.1.1!high-scale-lib.jar (22ms)
[ivy:resolve] downloading http://repo1.maven.org/maven2/com/yammer/metrics/metrics-core/2.1.2/metrics-core-2.1.2.jar ...
[ivy:resolve] ... (80kB)
[ivy:resolve] .. (0kB)
[ivy:resolve] 	[SUCCESSFUL ] com.yammer.metrics#metrics-core;2.1.2!metrics-core.jar (6ms)
[ivy:resolve] :: resolution report :: resolve 10622ms :: artifacts dl 557ms
[ivy:resolve] 	:: evicted modules:
[ivy:resolve] 	com.google.guava#guava;r08 by [com.google.guava#guava;11.0.2] in [default]
[ivy:resolve] 	org.slf4j#slf4j-api;1.5.10 by [org.slf4j#slf4j-api;1.6.1] in [default]
	---------------------------------------------------------------------
	|                  |            modules            ||   artifacts   |
	|       conf       | number| search|dwnlded|evicted|| number|dwnlded|
	---------------------------------------------------------------------
	|      default     |   46  |   3   |   3   |   2   ||   45  |   4   |
	---------------------------------------------------------------------
[ivy:report] Processing /data/hive-ptest/working/apache-svn-trunk-source/build/ivy/resolution-cache/org.apache.hive-hive-hbase-handler-default.xml to /data/hive-ptest/working/apache-svn-trunk-source/build/ivy/report/org.apache.hive-hive-hbase-handler-default.html

make-pom:
     [echo] Project: hbase-handler
     [echo]  Writing POM to /data/hive-ptest/working/apache-svn-trunk-source/build/hbase-handler/pom.xml
[ivy:makepom] DEPRECATED: 'ivy.conf.file' is deprecated, use 'ivy.settings.file' instead
[ivy:makepom] :: loading settings :: file = /data/hive-ptest/working/apache-svn-trunk-source/ivy/ivysettings.xml

create-dirs:
     [echo] Project: hbase-handler
     [copy] Warning: /data/hive-ptest/working/apache-svn-trunk-source/hbase-handler/src/test/resources does not exist.

init:
     [echo] Project: hbase-handler

setup:
     [echo] Project: hbase-handler

ivy-retrieve:
     [echo] Project: hbase-handler
[ivy:retrieve] :: retrieving :: org.apache.hive#hive-hbase-handler
[ivy:retrieve] 	confs: [default]
[ivy:retrieve] 	6 artifacts copied, 39 already retrieved (7536kB/44ms)

compile:
     [echo] Project: hbase-handler
    [javac] Compiling 13 source files to /data/hive-ptest/working/apache-svn-trunk-source/build/hbase-handler/classes
    [javac] Note: Some input files use or override a deprecated API.
    [javac] Note: Recompile with -Xlint:deprecation for details.
    [javac] Creating empty /data/hive-ptest/working/apache-svn-trunk-source/build/hbase-handler/classes/org/apache/hadoop/hive/hbase/package-info.class
     [copy] Warning: /data/hive-ptest/working/apache-svn-trunk-source/hbase-handler/src/java/conf does not exist.

jar:
     [echo] Project: hbase-handler
      [jar] Building jar: /data/hive-ptest/working/apache-svn-trunk-source/build/hbase-handler/hive-hbase-handler-0.13.0-SNAPSHOT.jar
[ivy:publish] :: delivering :: org.apache.hive#hive-hbase-handler;0.13.0-SNAPSHOT :: 0.13.0-SNAPSHOT :: integration :: Fri Sep 06 22:52:25 EDT 2013
[ivy:publish] 	delivering ivy file to /data/hive-ptest/working/apache-svn-trunk-source/build/hbase-handler/ivy-0.13.0-SNAPSHOT.xml
[ivy:publish] :: publishing :: org.apache.hive#hive-hbase-handler
[ivy:publish] 	published hive-hbase-handler to /data/hive-ptest/working/ivy/local/org.apache.hive/hive-hbase-handler/0.13.0-SNAPSHOT/jars/hive-hbase-handler.jar
[ivy:publish] 	published ivy to /data/hive-ptest/working/ivy/local/org.apache.hive/hive-hbase-handler/0.13.0-SNAPSHOT/ivys/ivy.xml

ivy-init-settings:
     [echo] Project: testutils

check-ivy:
     [echo] Project: testutils

ivy-resolve:
     [echo] Project: testutils
[ivy:resolve] :: loading settings :: file = /data/hive-ptest/working/apache-svn-trunk-source/ivy/ivysettings.xml
[ivy:resolve] :: resolving dependencies :: org.apache.hive#hive-testutils;0.13.0-SNAPSHOT
[ivy:resolve] 	confs: [default]
[ivy:resolve] 	found junit#junit;4.10 in maven2
[ivy:resolve] 	found org.hamcrest#hamcrest-core;1.1 in maven2
[ivy:resolve] 	found com.google.code.tempus-fugit#tempus-fugit;1.1 in maven2
[ivy:resolve] downloading http://repo1.maven.org/maven2/junit/junit/4.10/junit-4.10.jar ...
[ivy:resolve] ..... (247kB)
[ivy:resolve] .. (0kB)
[ivy:resolve] 	[SUCCESSFUL ] junit#junit;4.10!junit.jar (11ms)
[ivy:resolve] downloading http://repo1.maven.org/maven2/com/google/code/tempus-fugit/tempus-fugit/1.1/tempus-fugit-1.1.jar ...
[ivy:resolve] .. (54kB)
[ivy:resolve] .. (0kB)
[ivy:resolve] 	[SUCCESSFUL ] com.google.code.tempus-fugit#tempus-fugit;1.1!tempus-fugit.jar (6ms)
[ivy:resolve] downloading http://repo1.maven.org/maven2/org/hamcrest/hamcrest-core/1.1/hamcrest-core-1.1.jar ...
[ivy:resolve] ... (74kB)
[ivy:resolve] .. (0kB)
[ivy:resolve] 	[SUCCESSFUL ] org.hamcrest#hamcrest-core;1.1!hamcrest-core.jar (6ms)
[ivy:resolve] :: resolution report :: resolve 2155ms :: artifacts dl 33ms
[ivy:resolve] 	:: evicted modules:
[ivy:resolve] 	junit#junit;4.7 by [junit#junit;4.10] in [default]
	---------------------------------------------------------------------
	|                  |            modules            ||   artifacts   |
	|       conf       | number| search|dwnlded|evicted|| number|dwnlded|
	---------------------------------------------------------------------
	|      default     |   4   |   3   |   3   |   1   ||   3   |   3   |
	---------------------------------------------------------------------
[ivy:report] Processing /data/hive-ptest/working/apache-svn-trunk-source/build/ivy/resolution-cache/org.apache.hive-hive-testutils-default.xml to /data/hive-ptest/working/apache-svn-trunk-source/build/ivy/report/org.apache.hive-hive-testutils-default.html

make-pom:
     [echo] Project: testutils
     [echo]  Writing POM to /data/hive-ptest/working/apache-svn-trunk-source/build/testutils/pom.xml
[ivy:makepom] DEPRECATED: 'ivy.conf.file' is deprecated, use 'ivy.settings.file' instead
[ivy:makepom] :: loading settings :: file = /data/hive-ptest/working/apache-svn-trunk-source/ivy/ivysettings.xml

create-dirs:
     [echo] Project: testutils
     [copy] Warning: /data/hive-ptest/working/apache-svn-trunk-source/testutils/src/test/resources does not exist.

init:
     [echo] Project: testutils

setup:
     [echo] Project: testutils

ivy-retrieve:
     [echo] Project: testutils
[ivy:retrieve] :: retrieving :: org.apache.hive#hive-testutils
[ivy:retrieve] 	confs: [default]
[ivy:retrieve] 	3 artifacts copied, 0 already retrieved (376kB/4ms)

compile:
     [echo] Project: testutils
    [javac] Compiling 2 source files to /data/hive-ptest/working/apache-svn-trunk-source/build/testutils/classes
     [copy] Warning: /data/hive-ptest/working/apache-svn-trunk-source/testutils/src/java/conf does not exist.

jar:
     [echo] Project: testutils
      [jar] Building jar: /data/hive-ptest/working/apache-svn-trunk-source/build/testutils/hive-testutils-0.13.0-SNAPSHOT.jar
[ivy:publish] :: delivering :: org.apache.hive#hive-testutils;0.13.0-SNAPSHOT :: 0.13.0-SNAPSHOT :: integration :: Fri Sep 06 22:52:28 EDT 2013
[ivy:publish] 	delivering ivy file to /data/hive-ptest/working/apache-svn-trunk-source/build/testutils/ivy-0.13.0-SNAPSHOT.xml
[ivy:publish] :: publishing :: org.apache.hive#hive-testutils
[ivy:publish] 	published hive-testutils to /data/hive-ptest/working/ivy/local/org.apache.hive/hive-testutils/0.13.0-SNAPSHOT/jars/hive-testutils.jar
[ivy:publish] 	published ivy to /data/hive-ptest/working/ivy/local/org.apache.hive/hive-testutils/0.13.0-SNAPSHOT/ivys/ivy.xml

init:

jar:

mvn-init:
     [echo] hcatalog-core
      [get] Getting: http://repo2.maven.org/maven2/org/apache/maven/maven-ant-tasks/2.1.3/maven-ant-tasks-2.1.3.jar
      [get] To: /data/hive-ptest/working/apache-svn-trunk-source/hcatalog/build/maven-ant-tasks-2.1.3.jar

hive-mvn-publish:
     [echo] Installing local artifact for maven : shims
[artifact:install] [INFO] Installing /data/hive-ptest/working/apache-svn-trunk-source/build/shims/hive-shims-0.12.0-SNAPSHOT.jar to /data/hive-ptest/working/maven/org/apache/hive/hive-shims/0.13.0-SNAPSHOT/hive-shims-0.13.0-SNAPSHOT.jar
[artifact:install] An error has occurred while processing the Maven artifact tasks.
[artifact:install]  Diagnosis:
[artifact:install] 
[artifact:install] Error installing artifact 'org.apache.hive:hive-shims:jar': Error installing artifact: File /data/hive-ptest/working/apache-svn-trunk-source/build/shims/hive-shims-0.12.0-SNAPSHOT.jar does not exist

BUILD FAILED
/data/hive-ptest/working/apache-svn-trunk-source/build.xml:327: The following error occurred while executing this line:
/data/hive-ptest/working/apache-svn-trunk-source/build.xml:166: The following error occurred while executing this line:
/data/hive-ptest/working/apache-svn-trunk-source/build.xml:168: The following error occurred while executing this line:
/data/hive-ptest/working/apache-svn-trunk-source/hcatalog/build.xml:68: The following error occurred while executing this line:
/data/hive-ptest/working/apache-svn-trunk-source/hcatalog/build-support/ant/deploy.xml:81: The following error occurred while executing this line:
/data/hive-ptest/working/apache-svn-trunk-source/hcatalog/build-support/ant/deploy.xml:57: The following error occurred while executing this line:
/data/hive-ptest/working/apache-svn-trunk-source/hcatalog/build-support/ant/deploy.xml:48: Error installing artifact 'org.apache.hive:hive-shims:jar': Error installing artifact: File /data/hive-ptest/working/apache-svn-trunk-source/build/shims/hive-shims-0.12.0-SNAPSHOT.jar does not exist

Total time: 6 minutes 37 seconds
+ exit 1
'
{noformat}

This message is automatically generated.
                
> Upgrade xerces and xalan for WebHCat
> ------------------------------------
>
>                 Key: HIVE-5127
>                 URL: https://issues.apache.org/jira/browse/HIVE-5127
>             Project: Hive
>          Issue Type: Bug
>          Components: WebHCat
>    Affects Versions: 0.12.0
>            Reporter: Eugene Koifman
>            Assignee: Eugene Koifman
>             Fix For: 0.12.0
>
>         Attachments: HIVE-5127.patch
>
>
> Currently webhcat log files are full of exceptions like this, which obscures the real output and may cause perf issues.
> Upgrading to more recent versions of xerces/xalan fixes this.
> Add the following to hive/hcatalog/webhcat/svr/pom.xml
>         <dependency>
>             <groupId>xerces</groupId>
>             <artifactId>xercesImpl</artifactId>
>             <version>2.9.1</version>
>         </dependency>
>         <dependency>
>             <groupId>xalan</groupId>
>             <artifactId>xalan</artifactId>
>             <version>2.7.1</version>
>         </dependency>
> 13/08/20 16:54:04 ERROR conf.Configuration: Failed to set setXIncludeAware(true) for parser org.apache.xerces.jaxp.DocumentBuilderFactoryImpl@48dbb335:java.lang.UnsupportedOperationException: This parser does not support specification "null" version "null"
> java.lang.UnsupportedOperationException: This parser does not support specification "null" version "null"
>         at javax.xml.parsers.DocumentBuilderFactory.setXIncludeAware(DocumentBuilderFactory.java:590)
>         at org.apache.hadoop.conf.Configuration.loadResource(Configuration.java:1892)
>         at org.apache.hadoop.conf.Configuration.loadResources(Configuration.java:1861)
>         at org.apache.hadoop.conf.Configuration.getProps(Configuration.java:1778)
>         at org.apache.hadoop.conf.Configuration.get(Configuration.java:870)
>         at org.apache.hadoop.fs.FileSystem.getDefaultUri(FileSystem.java:171)
>         at org.apache.hadoop.fs.FileSystem.get(FileSystem.java:305)
>         at org.apache.hadoop.fs.FileSystem.getLocal(FileSystem.java:288)
>         at org.apache.hadoop.util.GenericOptionsParser.validateFiles(GenericOptionsParser.java:383)
>         at org.apache.hadoop.util.GenericOptionsParser.processGeneralOptions(GenericOptionsParser.java:281)
>         at org.apache.hadoop.util.GenericOptionsParser.parseGeneralOptions(GenericOptionsParser.java:422)
>         at org.apache.hadoop.util.GenericOptionsParser.<init>(GenericOptionsParser.java:168)
>         at org.apache.hadoop.util.GenericOptionsParser.<init>(GenericOptionsParser.java:151)
>         at org.apache.hadoop.util.ToolRunner.run(ToolRunner.java:64)
>         at org.apache.hadoop.util.ToolRunner.run(ToolRunner.java:84)
>         at org.apache.hcatalog.templeton.LauncherDelegator$1.run(LauncherDelegator.java:99)
>         at org.apache.hcatalog.templeton.LauncherDelegator$1.run(LauncherDelegator.java:95)
>         at java.security.AccessController.doPrivileged(Native Method)
>         at javax.security.auth.Subject.doAs(Subject.java:396)
>         at org.apache.hadoop.security.UserGroupInformation.doAs(UserGroupInformation.java:1441)
>         at org.apache.hcatalog.templeton.LauncherDelegator.queueAsUser(LauncherDelegator.java:95)
>         at org.apache.hcatalog.templeton.LauncherDelegator.enqueueController(LauncherDelegator.java:77)
>         at org.apache.hcatalog.templeton.JarDelegator.run(JarDelegator.java:52)
>         at org.apache.hcatalog.templeton.StreamingDelegator.run(StreamingDelegator.java:53)
>         at org.apache.hcatalog.templeton.Server.mapReduceStreaming(Server.java:596)
>         at sun.reflect.NativeMethodAccessorImpl.invoke0(Native Method)
>         at sun.reflect.NativeMethodAccessorImpl.invoke(NativeMethodAccessorImpl.java:39)
>         at sun.reflect.DelegatingMethodAccessorImpl.invoke(DelegatingMethodAccessorImpl.java:25)
>         at java.lang.reflect.Method.invoke(Method.java:597)
>         at com.sun.jersey.spi.container.JavaMethodInvokerFactory$1.invoke(JavaMethodInvokerFactory.java:60)
>         at com.sun.jersey.server.impl.model.method.dispatch.AbstractResourceMethodDispatchProvider$TypeOutInvoker._dispatch(AbstractResourceMethodDispatchProvider.java:185)
>         at com.sun.jersey.server.impl.model.method.dispatch.ResourceJavaMethodDispatcher.dispatch(ResourceJavaMethodDispatcher.java:75)
>         at com.sun.jersey.server.impl.uri.rules.HttpMethodRule.accept(HttpMethodRule.java:302)
>         at com.sun.jersey.server.impl.uri.rules.RightHandPathRule.accept(RightHandPathRule.java:147)
>         at com.sun.jersey.server.impl.uri.rules.ResourceClassRule.accept(ResourceClassRule.java:108)
>         at com.sun.jersey.server.impl.uri.rules.RightHandPathRule.accept(RightHandPathRule.java:147)
>         at com.sun.jersey.server.impl.uri.rules.RootResourceClassesRule.accept(RootResourceClassesRule.java:84)
>         at com.sun.jersey.server.impl.application.WebApplicationImpl._handleRequest(WebApplicationImpl.java:1480)
>         at com.sun.jersey.server.impl.application.WebApplicationImpl._handleRequest(WebApplicationImpl.java:1411)
>         at com.sun.jersey.server.impl.application.WebApplicationImpl.handleRequest(WebApplicationImpl.java:1360)
>         at com.sun.jersey.server.impl.application.WebApplicationImpl.handleRequest(WebApplicationImpl.java:1350)
>         at com.sun.jersey.spi.container.servlet.WebComponent.service(WebComponent.java:416)
>         at com.sun.jersey.spi.container.servlet.ServletContainer.service(ServletContainer.java:538)
>         at com.sun.jersey.spi.container.servlet.ServletContainer.service(ServletContainer.java:716)
>         at javax.servlet.http.HttpServlet.service(HttpServlet.java:847)
>         at org.eclipse.jetty.servlet.ServletHolder.handle(ServletHolder.java:565)
>         at org.eclipse.jetty.servlet.ServletHandler$CachedChain.doFilter(ServletHandler.java:1360)
>         at org.apache.hadoop.security.authentication.server.AuthenticationFilter.doFilter(AuthenticationFilter.java:384)
>         at org.apache.hadoop.hdfs.web.AuthFilter.doFilter(AuthFilter.java:85)
>         at org.eclipse.jetty.servlet.ServletHandler$CachedChain.doFilter(ServletHandler.java:1331)
>         at org.eclipse.jetty.servlet.ServletHandler.doHandle(ServletHandler.java:477)
>         at org.eclipse.jetty.server.handler.ContextHandler.doHandle(ContextHandler.java:1031)
>         at org.eclipse.jetty.servlet.ServletHandler.doScope(ServletHandler.java:406)
>         at org.eclipse.jetty.server.handler.ContextHandler.doScope(ContextHandler.java:965)
>         at org.eclipse.jetty.server.handler.ScopedHandler.handle(ScopedHandler.java:117)
>         at org.eclipse.jetty.server.handler.HandlerList.handle(HandlerList.java:47)
>         at org.eclipse.jetty.server.handler.HandlerWrapper.handle(HandlerWrapper.java:111)
>         at org.eclipse.jetty.server.Server.handle(Server.java:349)
>         at org.eclipse.jetty.server.AbstractHttpConnection.handleRequest(AbstractHttpConnection.java:449)
>         at org.eclipse.jetty.server.AbstractHttpConnection$RequestHandler.content(AbstractHttpConnection.java:925)
>         at org.eclipse.jetty.http.HttpParser.parseNext(HttpParser.java:857)
>         at org.eclipse.jetty.http.HttpParser.parseAvailable(HttpParser.java:235)
>         at org.eclipse.jetty.server.AsyncHttpConnection.handle(AsyncHttpConnection.java:76)
>         at org.eclipse.jetty.io.nio.SelectChannelEndPoint.handle(SelectChannelEndPoint.java:609)
>         at org.eclipse.jetty.io.nio.SelectChannelEndPoint$1.run(SelectChannelEndPoint.java:45)
>         at org.eclipse.jetty.util.thread.QueuedThreadPool.runJob(QueuedThreadPool.java:599)
>         at org.eclipse.jetty.util.thread.QueuedThreadPool$3.run(QueuedThreadPool.java:534)
>         at java.lang.Thread.run(Thread.java:680)

--
This message is automatically generated by JIRA.
If you think it was sent incorrectly, please contact your JIRA administrators
For more information on JIRA, see: http://www.atlassian.com/software/jira

Mime
View raw message