hive-dev mailing list archives

Site index · List index
Message view « Date » · « Thread »
Top « Date » · « Thread »
From "Benjamin Jakobus (JIRA)" <j...@apache.org>
Subject [jira] [Commented] (HIVE-5018) Avoiding object instantiation in loops (issue 6)
Date Thu, 15 Aug 2013 19:08:50 GMT

    [ https://issues.apache.org/jira/browse/HIVE-5018?page=com.atlassian.jira.plugin.system.issuetabpanels:comment-tabpanel&focusedCommentId=13741369#comment-13741369 ] 

Benjamin Jakobus commented on HIVE-5018:
----------------------------------------

Mhh, I seem to be getting some exceptions. Are there additional dependencies that I need?
{code}
eckstyle:
     [echo] hcatalog
[checkstyle] log4j:WARN No appenders could be found for logger (org.apache.commons.beanutils.BeanUtils).
[checkstyle] log4j:WARN Please initialize the log4j system properly.
[checkstyle] log4j:WARN See http://logging.apache.org/log4j/1.2/faq.html#noconfig for more info.
[checkstyle] Running Checkstyle 5.5 on 425 files
[checkstyle] Can't find/access AST Node typecom.puppycrawl.tools.checkstyle.api.DetailAST
[checkstyle] Can't find/access AST Node typecom.puppycrawl.tools.checkstyle.api.DetailAST
[checkstyle] Can't find/access AST Node typecom.puppycrawl.tools.checkstyle.api.DetailAST
[checkstyle] Can't find/access AST Node typecom.puppycrawl.tools.checkstyle.api.DetailAST
[checkstyle] Can't find/access AST Node typecom.puppycrawl.tools.checkstyle.api.DetailAST
[checkstyle] Can't find/access AST Node typecom.puppycrawl.tools.checkstyle.api.DetailAST
[checkstyle] Can't find/access AST Node typecom.puppycrawl.tools.checkstyle.api.DetailAST
[checkstyle] Can't find/access AST Node typecom.puppycrawl.tools.checkstyle.api.DetailAST
[checkstyle] Can't find/access AST Node typecom.puppycrawl.tools.checkstyle.api.DetailAST
[checkstyle] Can't find/access AST Node typecom.puppycrawl.tools.checkstyle.api.DetailAST
[checkstyle] Can't find/access AST Node typecom.puppycrawl.tools.checkstyle.api.DetailAST
[checkstyle] Can't find/access AST Node typecom.puppycrawl.tools.checkstyle.api.DetailAST
[checkstyle] Can't find/access AST Node typecom.puppycrawl.tools.checkstyle.api.DetailAST
[checkstyle] Can't find/access AST Node typecom.puppycrawl.tools.checkstyle.api.DetailAST
[checkstyle] Can't find/access AST Node typecom.puppycrawl.tools.checkstyle.api.DetailAST
[checkstyle] Can't find/access AST Node typecom.puppycrawl.tools.checkstyle.api.DetailAST
[checkstyle] Can't find/access AST Node typecom.puppycrawl.tools.checkstyle.api.DetailAST
[checkstyle] Can't find/access AST Node typecom.puppycrawl.tools.checkstyle.api.DetailAST
[checkstyle] Can't find/access AST Node typecom.puppycrawl.tools.checkstyle.api.DetailAST
[checkstyle] Can't find/access AST Node typecom.puppycrawl.tools.checkstyle.api.DetailAST
[checkstyle] Can't find/access AST Node typecom.puppycrawl.tools.checkstyle.api.DetailAST
[checkstyle] Can't find/access AST Node typecom.puppycrawl.tools.checkstyle.api.DetailAST
[checkstyle] Can't find/access AST Node typecom.puppycrawl.tools.checkstyle.api.DetailAST
[checkstyle] Can't find/access AST Node typecom.puppycrawl.tools.checkstyle.api.DetailAST
[checkstyle] Can't find/access AST Node typecom.puppycrawl.tools.checkstyle.api.DetailAST
[checkstyle] Can't find/access AST Node typecom.puppycrawl.tools.checkstyle.api.DetailAST
[checkstyle] Can't find/access AST Node typecom.puppycrawl.tools.checkstyle.api.DetailAST
[checkstyle] Can't find/access AST Node typecom.puppycrawl.tools.checkstyle.api.DetailAST
[checkstyle] Can't find/access AST Node typecom.puppycrawl.tools.checkstyle.api.DetailAST
[checkstyle] Can't find/access AST Node typecom.puppycrawl.tools.checkstyle.api.DetailAST
[checkstyle] Can't find/access AST Node typecom.puppycrawl.tools.checkstyle.api.DetailAST
[checkstyle] Can't find/access AST Node typecom.puppycrawl.tools.checkstyle.api.DetailAST
[checkstyle] Can't find/access AST Node typecom.puppycrawl.tools.checkstyle.api.DetailAST
[checkstyle] Can't find/access AST Node typecom.puppycrawl.tools.checkstyle.api.DetailAST
[checkstyle] Can't find/access AST Node typecom.puppycrawl.tools.checkstyle.api.DetailAST
[checkstyle] Can't find/access AST Node typecom.puppycrawl.tools.checkstyle.api.DetailAST
[checkstyle] Can't find/access AST Node typecom.puppycrawl.tools.checkstyle.api.DetailAST
[checkstyle] Can't find/access AST Node typecom.puppycrawl.tools.checkstyle.api.DetailAST
[checkstyle] Can't find/access AST Node typecom.puppycrawl.tools.checkstyle.api.DetailAST
[checkstyle] Can't find/access AST Node typecom.puppycrawl.tools.checkstyle.api.DetailAST
[checkstyle] Can't find/access AST Node typecom.puppycrawl.tools.checkstyle.api.DetailAST
[checkstyle] Can't find/access AST Node typecom.puppycrawl.tools.checkstyle.api.DetailAST
[checkstyle] Can't find/access AST Node typecom.puppycrawl.tools.checkstyle.api.DetailAST
[checkstyle] Can't find/access AST Node typecom.puppycrawl.tools.checkstyle.api.DetailAST
[checkstyle] Can't find/access AST Node typecom.puppycrawl.tools.checkstyle.api.DetailAST
[checkstyle] Can't find/access AST Node typecom.puppycrawl.tools.checkstyle.api.DetailAST
[checkstyle] Can't find/access AST Node typecom.puppycrawl.tools.checkstyle.api.DetailAST
[checkstyle] Can't find/access AST Node typecom.puppycrawl.tools.checkstyle.api.DetailAST
[checkstyle] Can't find/access AST Node typecom.puppycrawl.tools.checkstyle.api.DetailAST
[checkstyle] Can't find/access AST Node typecom.puppycrawl.tools.checkstyle.api.DetailAST
[checkstyle] Can't find/access AST Node typecom.puppycrawl.tools.checkstyle.api.DetailAST
[checkstyle] Can't find/access AST Node typecom.puppycrawl.tools.checkstyle.api.DetailAST
[checkstyle] Can't find/access AST Node typecom.puppycrawl.tools.checkstyle.api.DetailAST
[checkstyle] Can't find/access AST Node typecom.puppycrawl.tools.checkstyle.api.DetailAST
[checkstyle] Can't find/access AST Node typecom.puppycrawl.tools.checkstyle.api.DetailAST
[checkstyle] Can't find/access AST Node typecom.puppycrawl.tools.checkstyle.api.DetailAST
[checkstyle] Can't find/access AST Node typecom.puppycrawl.tools.checkstyle.api.DetailAST
[checkstyle] Can't find/access AST Node typecom.puppycrawl.tools.checkstyle.api.DetailAST
[checkstyle] Can't find/access AST Node typecom.puppycrawl.tools.checkstyle.api.DetailAST
[checkstyle] /home/benjamin/NetBeansProjects/hive2/hive_stringbuilder_patch/hive/hcatalog/core/src/main/java/org/apache/hadoop/mapred/HCatMapRedUtil.java:0: Got an exception - java.lang.ClassCastException: antlr.CommonAST cannot be cast to com.puppycrawl.tools.checkstyle.api.DetailAST
[checkstyle] /home/benjamin/NetBeansProjects/hive2/hive_stringbuilder_patch/hive/hcatalog/core/src/main/java/org/apache/hcatalog/cli/HCatCli.java:0: Got an exception - java.lang.ClassCastException: antlr.CommonAST cannot be cast to com.puppycrawl.tools.checkstyle.api.DetailAST
[checkstyle] /home/benjamin/NetBeansProjects/hive2/hive_stringbuilder_patch/hive/hcatalog/core/src/main/java/org/apache/hcatalog/cli/HCatDriver.java:0: Got an exception - java.lang.ClassCastException: antlr.CommonAST cannot be cast to com.puppycrawl.tools.checkstyle.api.DetailAST
[checkstyle] /home/benjamin/NetBeansProjects/hive2/hive_stringbuilder_patch/hive/hcatalog/core/src/main/java/org/apache/hcatalog/cli/SemanticAnalysis/CreateDatabaseHook.java:0: Got an exception - java.lang.ClassCastException: antlr.CommonAST cannot be cast to com.puppycrawl.tools.checkstyle.api.DetailAST
[checkstyle] /home/benjamin/NetBeansProjects/hive2/hive_stringbuilder_patch/hive/hcatalog/core/src/main/java/org/apache/hcatalog/cli/SemanticAnalysis/CreateTableHook.java:0: Got an exception - java.lang.ClassCastException: antlr.CommonAST cannot be cast to com.puppycrawl.tools.checkstyle.api.DetailAST
[checkstyle] /home/benjamin/NetBeansProjects/hive2/hive_stringbuilder_patch/hive/hcatalog/core/src/main/java/org/apache/hcatalog/cli/SemanticAnalysis/HCatSemanticAnalyzer.java:0: Got an exception - java.lang.ClassCastException: antlr.CommonAST cannot be cast to com.puppycrawl.tools.checkstyle.api.DetailAST
[checkstyle] /home/benjamin/NetBeansProjects/hive2/hive_stringbuilder_patch/hive/hcatalog/core/src/main/java/org/apache/hcatalog/cli/SemanticAnalysis/HCatSemanticAnalyzerBase.java:0: Got an exception - java.lang.ClassCastException: antlr.CommonAST cannot be cast to com.puppycrawl.tools.checkstyle.api.DetailAST
[checkstyle] /home/benjamin/NetBeansProjects/hive2/hive_stringbuilder_patch/hive/hcatalog/core/src/main/java/org/apache/hcatalog/common/ErrorType.java:0: Got an exception - java.lang.ClassCastException: antlr.CommonAST cannot be cast to com.puppycrawl.tools.checkstyle.api.DetailAST
[checkstyle] /home/benjamin/NetBeansProjects/hive2/hive_stringbuilder_patch/hive/hcatalog/core/src/main/java/org/apache/hcatalog/common/HCatConstants.java:0: Got an exception - java.lang.ClassCastException: antlr.CommonAST cannot be cast to com.puppycrawl.tools.checkstyle.api.DetailAST
[checkstyle] /home/benjamin/NetBeansProjects/hive2/hive_stringbuilder_patch/hive/hcatalog/core/src/main/java/org/apache/hcatalog/common/HCatContext.java:0: Got an exception - java.lang.ClassCastException: antlr.CommonAST cannot be cast to com.puppycrawl.tools.checkstyle.api.DetailAST
[checkstyle] /home/benjamin/NetBeansProjects/hive2/hive_stringbuilder_patch/hive/hcatalog/core/src/main/java/org/apache/hcatalog/common/HCatException.java:0: Got an exception - java.lang.ClassCastException: antlr.CommonAST cannot be cast to com.puppycrawl.tools.checkstyle.api.DetailAST
[checkstyle] /home/benjamin/NetBeansProjects/hive2/hive_stringbuilder_patch/hive/hcatalog/core/src/main/java/org/apache/hcatalog/common/HCatUtil.java:0: Got an exception - java.lang.ClassCastException: antlr.CommonAST cannot be cast to com.puppycrawl.tools.checkstyle.api.DetailAST
[checkstyle] /home/benjamin/NetBeansProjects/hive2/hive_stringbuilder_patch/hive/hcatalog/core/src/main/java/org/apache/hcatalog/common/HiveClientCache.java:0: Got an exception - java.lang.ClassCastException: antlr.CommonAST cannot be cast to com.puppycrawl.tools.checkstyle.api.DetailAST
[checkstyle] /home/benjamin/NetBeansProjects/hive2/hive_stringbuilder_patch/hive/hcatalog/core/src/main/java/org/apache/hcatalog/data/DataType.java:0: Got an exception - java.lang.ClassCastException: antlr.CommonAST cannot be cast to com.puppycrawl.tools.checkstyle.api.DetailAST
[checkstyle] /home/benjamin/NetBeansProjects/hive2/hive_stringbuilder_patch/hive/hcatalog/core/src/main/java/org/apache/hcatalog/data/DefaultHCatRecord.java:0: Got an exception - java.lang.ClassCastException: antlr.CommonAST cannot be cast to com.puppycrawl.tools.checkstyle.api.DetailAST
[checkstyle] /home/benjamin/NetBeansProjects/hive2/hive_stringbuilder_patch/hive/hcatalog/core/src/main/java/org/apache/hcatalog/data/HCatRecord.java:0: Got an exception - java.lang.ClassCastException: antlr.CommonAST cannot be cast to com.puppycrawl.tools.checkstyle.api.DetailAST
[checkstyle] /home/benjamin/NetBeansProjects/hive2/hive_stringbuilder_patch/hive/hcatalog/core/src/main/java/org/apache/hcatalog/data/HCatRecordObjectInspector.java:0: Got an exception - java.lang.ClassCastException: antlr.CommonAST cannot be cast to com.puppycrawl.tools.checkstyle.api.DetailAST
[checkstyle] /home/benjamin/NetBeansProjects/hive2/hive_stringbuilder_patch/hive/hcatalog/core/src/main/java/org/apache/hcatalog/data/HCatRecordObjectInspectorFactory.java:0: Got an exception - java.lang.ClassCastException: antlr.CommonAST cannot be cast to com.puppycrawl.tools.checkstyle.api.DetailAST
[checkstyle] /home/benjamin/NetBeansProjects/hive2/hive_stringbuilder_patch/hive/hcatalog/core/src/main/java/org/apache/hcatalog/data/HCatRecordSerDe.java:0: Got an exception - java.lang.ClassCastException: antlr.CommonAST cannot be cast to com.puppycrawl.tools.checkstyle.api.DetailAST
[checkstyle] /home/benjamin/NetBeansProjects/hive2/hive_stringbuilder_patch/hive/hcatalog/core/src/main/java/org/apache/hcatalog/data/HCatRecordable.java:0: Got an exception - java.lang.ClassCastException: antlr.CommonAST cannot be cast to com.puppycrawl.tools.checkstyle.api.DetailAST
[checkstyle] /home/benjamin/NetBeansProjects/hive2/hive_stringbuilder_patch/hive/hcatalog/core/src/main/java/org/apache/hcatalog/data/JsonSerDe.java:0: Got an exception - java.lang.ClassCastException: antlr.CommonAST cannot be cast to com.puppycrawl.tools.checkstyle.api.DetailAST
[checkstyle] /home/benjamin/NetBeansProjects/hive2/hive_stringbuilder_patch/hive/hcatalog/core/src/main/java/org/apache/hcatalog/data/LazyHCatRecord.java:0: Got an exception - java.lang.ClassCastException: antlr.CommonAST cannot be cast to com.puppycrawl.tools.checkstyle.api.DetailAST
[checkstyle] /home/benjamin/NetBeansProjects/hive2/hive_stringbuilder_patch/hive/hcatalog/core/src/main/java/org/apache/hcatalog/data/Pair.java:0: Got an exception - java.lang.ClassCastException: antlr.CommonAST cannot be cast to com.puppycrawl.tools.checkstyle.api.DetailAST
[checkstyle] /home/benjamin/NetBeansProjects/hive2/hive_stringbuilder_patch/hive/hcatalog/core/src/main/java/org/apache/hcatalog/data/ReaderWriter.java:0: Got an exception - java.lang.ClassCastException: antlr.CommonAST cannot be cast to com.puppycrawl.tools.checkstyle.api.DetailAST
[checkstyle] /home/benjamin/NetBeansProjects/hive2/hive_stringbuilder_patch/hive/hcatalog/core/src/main/java/org/apache/hcatalog/data/schema/HCatFieldSchema.java:0: Got an exception - java.lang.ClassCastException: antlr.CommonAST cannot be cast to com.puppycrawl.tools.checkstyle.api.DetailAST
[checkstyle] /home/benjamin/NetBeansProjects/hive2/hive_stringbuilder_patch/hive/hcatalog/core/src/main/java/org/apache/hcatalog/data/schema/HCatSchema.java:0: Got an exception - java.lang.ClassCastException: antlr.CommonAST cannot be cast to com.puppycrawl.tools.checkstyle.api.DetailAST
[checkstyle] /home/benjamin/NetBeansProjects/hive2/hive_stringbuilder_patch/hive/hcatalog/core/src/main/java/org/apache/hcatalog/data/schema/HCatSchemaUtils.java:0: Got an exception - java.lang.ClassCastException: antlr.CommonAST cannot be cast to com.puppycrawl.tools.checkstyle.api.DetailAST
[checkstyle] /home/benjamin/NetBeansProjects/hive2/hive_stringbuilder_patch/hive/hcatalog/core/src/main/java/org/apache/hcatalog/data/transfer/DataTransferFactory.java:0: Got an exception - java.lang.ClassCastException: antlr.CommonAST cannot be cast to com.puppycrawl.tools.checkstyle.api.DetailAST
[checkstyle] /home/benjamin/NetBeansProjects/hive2/hive_stringbuilder_patch/hive/hcatalog/core/src/main/java/org/apache/hcatalog/data/transfer/EntityBase.java:0: Got an exception - java.lang.ClassCastException: antlr.CommonAST cannot be cast to com.puppycrawl.tools.checkstyle.api.DetailAST
[checkstyle] Can't find/access AST Node typecom.puppycrawl.tools.checkstyle.api.DetailAST
[checkstyle] Can't find/access AST Node typecom.puppycrawl.tools.checkstyle.api.DetailAST
[checkstyle] Can't find/access AST Node typecom.puppycrawl.tools.checkstyle.api.DetailAST
[checkstyle] Can't find/access AST Node typecom.puppycrawl.tools.checkstyle.api.DetailAST
[checkstyle] Can't find/access AST Node typecom.puppycrawl.tools.checkstyle.api.DetailAST
[checkstyle] Can't find/access AST Node typecom.puppycrawl.tools.checkstyle.api.DetailAST
[checkstyle] Can't find/access AST Node typecom.puppycrawl.tools.checkstyle.api.DetailAST
[checkstyle] Can't find/access AST Node typecom.puppycrawl.tools.checkstyle.api.DetailAST
[checkstyle] Can't find/access AST Node typecom.puppycrawl.tools.checkstyle.api.DetailAST
[checkstyle] Can't find/access AST Node typecom.puppycrawl.tools.checkstyle.api.DetailAST
[checkstyle] Can't find/access AST Node typecom.puppycrawl.tools.checkstyle.api.DetailAST
[checkstyle] Can't find/access AST Node typecom.puppycrawl.tools.checkstyle.api.DetailAST
[checkstyle] Can't find/access AST Node typecom.puppycrawl.tools.checkstyle.api.DetailAST
[checkstyle] Can't find/access AST Node typecom.puppycrawl.tools.checkstyle.api.DetailAST
[checkstyle] Can't find/access AST Node typecom.puppycrawl.tools.checkstyle.api.DetailAST
[checkstyle] Can't find/access AST Node typecom.puppycrawl.tools.checkstyle.api.DetailAST
[checkstyle] Can't find/access AST Node typecom.puppycrawl.tools.checkstyle.api.DetailAST
[checkstyle] Can't find/access AST Node typecom.puppycrawl.tools.checkstyle.api.DetailAST
[checkstyle] Can't find/access AST Node typecom.puppycrawl.tools.checkstyle.api.DetailAST
[checkstyle] Can't find/access AST Node typecom.puppycrawl.tools.checkstyle.api.DetailAST
[checkstyle] Can't find/access AST Node typecom.puppycrawl.tools.checkstyle.api.DetailAST
[checkstyle] Can't find/access AST Node typecom.puppycrawl.tools.checkstyle.api.DetailAST
[checkstyle] Can't find/access AST Node typecom.puppycrawl.tools.checkstyle.api.DetailAST
[checkstyle] Can't find/access AST Node typecom.puppycrawl.tools.checkstyle.api.DetailAST
[checkstyle] Can't find/access AST Node typecom.puppycrawl.tools.checkstyle.api.DetailAST
[checkstyle] Can't find/access AST Node typecom.puppycrawl.tools.checkstyle.api.DetailAST
[checkstyle] Can't find/access AST Node typecom.puppycrawl.tools.checkstyle.api.DetailAST
[checkstyle] Can't find/access AST Node typecom.puppycrawl.tools.checkstyle.api.DetailAST
[checkstyle] Can't find/access AST Node typecom.puppycrawl.tools.checkstyle.api.DetailAST
[checkstyle] /home/benjamin/NetBeansProjects/hive2/hive_stringbuilder_patch/hive/hcatalog/core/src/main/java/org/apache/hcatalog/data/transfer/HCatReader.java:0: Got an exception - java.lang.ClassCastException: antlr.CommonAST cannot be cast to com.puppycrawl.tools.checkstyle.api.DetailAST
[checkstyle] /home/benjamin/NetBeansProjects/hive2/hive_stringbuilder_patch/hive/hcatalog/core/src/main/java/org/apache/hcatalog/data/transfer/HCatWriter.java:0: Got an exception - java.lang.ClassCastException: antlr.CommonAST cannot be cast to com.puppycrawl.tools.checkstyle.api.DetailAST
[checkstyle] /home/benjamin/NetBeansProjects/hive2/hive_stringbuilder_patch/hive/hcatalog/core/src/main/java/org/apache/hcatalog/data/transfer/ReadEntity.java:0: Got an exception - java.lang.ClassCastException: antlr.CommonAST cannot be cast to com.puppycrawl.tools.checkstyle.api.DetailAST
[checkstyle] /home/benjamin/NetBeansProjects/hive2/hive_stringbuilder_patch/hive/hcatalog/core/src/main/java/org/apache/hcatalog/data/transfer/ReaderContext.java:0: Got an exception - java.lang.ClassCastException: antlr.CommonAST cannot be cast to com.puppycrawl.tools.checkstyle.api.DetailAST
[checkstyle] /home/benjamin/NetBeansProjects/hive2/hive_stringbuilder_patch/hive/hcatalog/core/src/main/java/org/apache/hcatalog/data/transfer/WriteEntity.java:0: Got an exception - java.lang.ClassCastException: antlr.CommonAST cannot be cast to com.puppycrawl.tools.checkstyle.api.DetailAST
[checkstyle] /home/benjamin/NetBeansProjects/hive2/hive_stringbuilder_patch/hive/hcatalog/core/src/main/java/org/apache/hcatalog/data/transfer/WriterContext.java:0: Got an exception - java.lang.ClassCastException: antlr.CommonAST cannot be cast to com.puppycrawl.tools.checkstyle.api.DetailAST
[checkstyle] /home/benjamin/NetBeansProjects/hive2/hive_stringbuilder_patch/hive/hcatalog/core/src/main/java/org/apache/hcatalog/data/transfer/impl/HCatInputFormatReader.java:0: Got an exception - java.lang.ClassCastException: antlr.CommonAST cannot be cast to com.puppycrawl.tools.checkstyle.api.DetailAST
[checkstyle] /home/benjamin/NetBeansProjects/hive2/hive_stringbuilder_patch/hive/hcatalog/core/src/main/java/org/apache/hcatalog/data/transfer/impl/HCatOutputFormatWriter.java:0: Got an exception - java.lang.ClassCastException: antlr.CommonAST cannot be cast to com.puppycrawl.tools.checkstyle.api.DetailAST
[checkstyle] /home/benjamin/NetBeansProjects/hive2/hive_stringbuilder_patch/hive/hcatalog/core/src/main/java/org/apache/hcatalog/data/transfer/state/DefaultStateProvider.java:0: Got an exception - java.lang.ClassCastException: antlr.CommonAST cannot be cast to com.puppycrawl.tools.checkstyle.api.DetailAST
[checkstyle] /home/benjamin/NetBeansProjects/hive2/hive_stringbuilder_patch/hive/hcatalog/core/src/main/java/org/apache/hcatalog/data/transfer/state/StateProvider.java:0: Got an exception - java.lang.ClassCastException: antlr.CommonAST cannot be cast to com.puppycrawl.tools.checkstyle.api.DetailAST
[checkstyle] /home/benjamin/NetBeansProjects/hive2/hive_stringbuilder_patch/hive/hcatalog/core/src/main/java/org/apache/hcatalog/har/HarOutputCommitterPostProcessor.java:0: Got an exception - java.lang.ClassCastException: antlr.CommonAST cannot be cast to com.puppycrawl.tools.checkstyle.api.DetailAST
[checkstyle] /home/benjamin/NetBeansProjects/hive2/hive_stringbuilder_patch/hive/hcatalog/core/src/main/java/org/apache/hcatalog/mapreduce/DefaultOutputCommitterContainer.java:0: Got an exception - java.lang.ClassCastException: antlr.CommonAST cannot be cast to com.puppycrawl.tools.checkstyle.api.DetailAST
[checkstyle] /home/benjamin/NetBeansProjects/hive2/hive_stringbuilder_patch/hive/hcatalog/core/src/main/java/org/apache/hcatalog/mapreduce/DefaultOutputFormatContainer.java:0: Got an exception - java.lang.ClassCastException: antlr.CommonAST cannot be cast to com.puppycrawl.tools.checkstyle.api.DetailAST
[checkstyle] /home/benjamin/NetBeansProjects/hive2/hive_stringbuilder_patch/hive/hcatalog/core/src/main/java/org/apache/hcatalog/mapreduce/DefaultRecordWriterContainer.java:0: Got an exception - java.lang.ClassCastException: antlr.CommonAST cannot be cast to com.puppycrawl.tools.checkstyle.api.DetailAST
[checkstyle] /home/benjamin/NetBeansProjects/hive2/hive_stringbuilder_patch/hive/hcatalog/core/src/main/java/org/apache/hcatalog/mapreduce/FileOutputCommitterContainer.java:0: Got an exception - java.lang.ClassCastException: antlr.CommonAST cannot be cast to com.puppycrawl.tools.checkstyle.api.DetailAST
[checkstyle] /home/benjamin/NetBeansProjects/hive2/hive_stringbuilder_patch/hive/hcatalog/core/src/main/java/org/apache/hcatalog/mapreduce/FileOutputFormatContainer.java:0: Got an exception - java.lang.ClassCastException: antlr.CommonAST cannot be cast to com.puppycrawl.tools.checkstyle.api.DetailAST
[checkstyle] /home/benjamin/NetBeansProjects/hive2/hive_stringbuilder_patch/hive/hcatalog/core/src/main/java/org/apache/hcatalog/mapreduce/FileRecordWriterContainer.java:0: Got an exception - java.lang.ClassCastException: antlr.CommonAST cannot be cast to com.puppycrawl.tools.checkstyle.api.DetailAST
[checkstyle] /home/benjamin/NetBeansProjects/hive2/hive_stringbuilder_patch/hive/hcatalog/core/src/main/java/org/apache/hcatalog/mapreduce/FosterStorageHandler.java:0: Got an exception - java.lang.ClassCastException: antlr.CommonAST cannot be cast to com.puppycrawl.tools.checkstyle.api.DetailAST
[checkstyle] /home/benjamin/NetBeansProjects/hive2/hive_stringbuilder_patch/hive/hcatalog/core/src/main/java/org/apache/hcatalog/mapreduce/HCatBaseInputFormat.java:0: Got an exception - java.lang.ClassCastException: antlr.CommonAST cannot be cast to com.puppycrawl.tools.checkstyle.api.DetailAST
[checkstyle] /home/benjamin/NetBeansProjects/hive2/hive_stringbuilder_patch/hive/hcatalog/core/src/main/java/org/apache/hcatalog/mapreduce/HCatBaseOutputFormat.java:0: Got an exception - java.lang.ClassCastException: antlr.CommonAST cannot be cast to com.puppycrawl.tools.checkstyle.api.DetailAST
[checkstyle] /home/benjamin/NetBeansProjects/hive2/hive_stringbuilder_patch/hive/hcatalog/core/src/main/java/org/apache/hcatalog/mapreduce/HCatInputFormat.java:0: Got an exception - java.lang.ClassCastException: antlr.CommonAST cannot be cast to com.puppycrawl.tools.checkstyle.api.DetailAST
[checkstyle] /home/benjamin/NetBeansProjects/hive2/hive_stringbuilder_patch/hive/hcatalog/core/src/main/java/org/apache/hcatalog/mapreduce/HCatOutputFormat.java:0: Got an exception - java.lang.ClassCastException: antlr.CommonAST cannot be cast to com.puppycrawl.tools.checkstyle.api.DetailAST
[checkstyle] /home/benjamin/NetBeansProjects/hive2/hive_stringbuilder_patch/hive/hcatalog/core/src/main/java/org/apache/hcatalog/mapreduce/HCatRecordReader.java:0: Got an exception - java.lang.ClassCastException: antlr.CommonAST cannot be cast to com.puppycrawl.tools.checkstyle.api.DetailAST
[checkstyle] /home/benjamin/NetBeansProjects/hive2/hive_stringbuilder_patch/hive/hcatalog/core/src/main/java/org/apache/hcatalog/mapreduce/HCatSplit.java:0: Got an exception - java.lang.ClassCastException: antlr.CommonAST cannot be cast to com.puppycrawl.tools.checkstyle.api.DetailAST
[checkstyle] /home/benjamin/NetBeansProjects/hive2/hive_stringbuilder_patch/hive/hcatalog/core/src/main/java/org/apache/hcatalog/mapreduce/HCatStorageHandler.java:0: Got an exception - java.lang.ClassCastException: antlr.CommonAST cannot be cast to com.puppycrawl.tools.checkstyle.api.DetailAST
[checkstyle] /home/benjamin/NetBeansProjects/hive2/hive_stringbuilder_patch/hive/hcatalog/core/src/main/java/org/apache/hcatalog/mapreduce/HCatTableInfo.java:0: Got an exception - java.lang.ClassCastException: antlr.CommonAST cannot be cast to com.puppycrawl.tools.checkstyle.api.DetailAST
[checkstyle] /home/benjamin/NetBeansProjects/hive2/hive_stringbuilder_patch/hive/hcatalog/core/src/main/java/org/apache/hcatalog/mapreduce/InitializeInput.java:0: Got an exception - java.lang.ClassCastException: antlr.CommonAST cannot be cast to com.puppycrawl.tools.checkstyle.api.DetailAST
[checkstyle] /home/benjamin/NetBeansProjects/hive2/hive_stringbuilder_patch/hive/hcatalog/core/src/main/java/org/apache/hcatalog/mapreduce/InputJobInfo.java:0: Got an exception - java.lang.ClassCastException: antlr.CommonAST cannot be cast to com.puppycrawl.tools.checkstyle.api.DetailAST
[checkstyle] /home/benjamin/NetBeansProjects/hive2/hive_stringbuilder_patch/hive/hcatalog/core/src/main/java/org/apache/hcatalog/mapreduce/InternalUtil.java:0: Got an exception - java.lang.ClassCastException: antlr.CommonAST cannot be cast to com.puppycrawl.tools.checkstyle.api.DetailAST
[checkstyle] Can't find/access AST Node typecom.puppycrawl.tools.checkstyle.api.DetailAST
[checkstyle] Can't find/access AST Node typecom.puppycrawl.tools.checkstyle.api.DetailAST
[checkstyle] Can't find/access AST Node typecom.puppycrawl.tools.checkstyle.api.DetailAST
[checkstyle] Can't find/access AST Node typecom.puppycrawl.tools.checkstyle.api.DetailAST
[checkstyle] Can't find/access AST Node typecom.puppycrawl.tools.checkstyle.api.DetailAST
[checkstyle] Can't find/access AST Node typecom.puppycrawl.tools.checkstyle.api.DetailAST
[checkstyle] Can't find/access AST Node typecom.puppycrawl.tools.checkstyle.api.DetailAST
[checkstyle] Can't find/access AST Node typecom.puppycrawl.tools.checkstyle.api.DetailAST
[checkstyle] Can't find/access AST Node typecom.puppycrawl.tools.checkstyle.api.DetailAST
[checkstyle] Can't find/access AST Node typecom.puppycrawl.tools.checkstyle.api.DetailAST
[checkstyle] Can't find/access AST Node typecom.puppycrawl.tools.checkstyle.api.DetailAST
[checkstyle] Can't find/access AST Node typecom.puppycrawl.tools.checkstyle.api.DetailAST
[checkstyle] Can't find/access AST Node typecom.puppycrawl.tools.checkstyle.api.DetailAST
[checkstyle] Can't find/access AST Node typecom.puppycrawl.tools.checkstyle.api.DetailAST
[checkstyle] Can't find/access AST Node typecom.puppycrawl.tools.checkstyle.api.DetailAST
[checkstyle] Can't find/access AST Node typecom.puppycrawl.tools.checkstyle.api.DetailAST
[checkstyle] Can't find/access AST Node typecom.puppycrawl.tools.checkstyle.api.DetailAST
[checkstyle] Can't find/access AST Node typecom.puppycrawl.tools.checkstyle.api.DetailAST
[checkstyle] Can't find/access AST Node typecom.puppycrawl.tools.checkstyle.api.DetailAST
[checkstyle] Can't find/access AST Node typecom.puppycrawl.tools.checkstyle.api.DetailAST
[checkstyle] Can't find/access AST Node typecom.puppycrawl.tools.checkstyle.api.DetailAST
[checkstyle] Can't find/access AST Node typecom.puppycrawl.tools.checkstyle.api.DetailAST
[checkstyle] Can't find/access AST Node typecom.puppycrawl.tools.checkstyle.api.DetailAST
[checkstyle] Can't find/access AST Node typecom.puppycrawl.tools.checkstyle.api.DetailAST
[checkstyle] Can't find/access AST Node typecom.puppycrawl.tools.checkstyle.api.DetailAST
[checkstyle] Can't find/access AST Node typecom.puppycrawl.tools.checkstyle.api.DetailAST
[checkstyle] Can't find/access AST Node typecom.puppycrawl.tools.checkstyle.api.DetailAST
[checkstyle] Can't find/access AST Node typecom.puppycrawl.tools.checkstyle.api.DetailAST
[checkstyle] Can't find/access AST Node typecom.puppycrawl.tools.checkstyle.api.DetailAST
[checkstyle] /home/benjamin/NetBeansProjects/hive2/hive_stringbuilder_patch/hive/hcatalog/core/src/main/java/org/apache/hcatalog/mapreduce/MultiOutputFormat.java:0: Got an exception - java.lang.ClassCastException: antlr.CommonAST cannot be cast to com.puppycrawl.tools.checkstyle.api.DetailAST
[checkstyle] /home/benjamin/NetBeansProjects/hive2/hive_stringbuilder_patch/hive/hcatalog/core/src/main/java/org/apache/hcatalog/mapreduce/OutputCommitterContainer.java:0: Got an exception - java.lang.ClassCastException: antlr.CommonAST cannot be cast to com.puppycrawl.tools.checkstyle.api.DetailAST
[checkstyle] /home/benjamin/NetBeansProjects/hive2/hive_stringbuilder_patch/hive/hcatalog/core/src/main/java/org/apache/hcatalog/mapreduce/OutputFormatContainer.java:0: Got an exception - java.lang.ClassCastException: antlr.CommonAST cannot be cast to com.puppycrawl.tools.checkstyle.api.DetailAST
[checkstyle] /home/benjamin/NetBeansProjects/hive2/hive_stringbuilder_patch/hive/hcatalog/core/src/main/java/org/apache/hcatalog/mapreduce/OutputJobInfo.java:0: Got an exception - java.lang.ClassCastException: antlr.CommonAST cannot be cast to com.puppycrawl.tools.checkstyle.api.DetailAST
[checkstyle] /home/benjamin/NetBeansProjects/hive2/hive_stringbuilder_patch/hive/hcatalog/core/src/main/java/org/apache/hcatalog/mapreduce/PartInfo.java:0: Got an exception - java.lang.ClassCastException: antlr.CommonAST cannot be cast to com.puppycrawl.tools.checkstyle.api.DetailAST
[checkstyle] /home/benjamin/NetBeansProjects/hive2/hive_stringbuilder_patch/hive/hcatalog/core/src/main/java/org/apache/hcatalog/mapreduce/ProgressReporter.java:0: Got an exception - java.lang.ClassCastException: antlr.CommonAST cannot be cast to com.puppycrawl.tools.checkstyle.api.DetailAST
[checkstyle] /home/benjamin/NetBeansProjects/hive2/hive_stringbuilder_patch/hive/hcatalog/core/src/main/java/org/apache/hcatalog/mapreduce/RecordWriterContainer.java:0: Got an exception - java.lang.ClassCastException: antlr.CommonAST cannot be cast to com.puppycrawl.tools.checkstyle.api.DetailAST
[checkstyle] /home/benjamin/NetBeansProjects/hive2/hive_stringbuilder_patch/hive/hcatalog/core/src/main/java/org/apache/hcatalog/mapreduce/Security.java:0: Got an exception - java.lang.ClassCastException: antlr.CommonAST cannot be cast to com.puppycrawl.tools.checkstyle.api.DetailAST
[checkstyle] /home/benjamin/NetBeansProjects/hive2/hive_stringbuilder_patch/hive/hcatalog/core/src/main/java/org/apache/hcatalog/mapreduce/StorerInfo.java:0: Got an exception - java.lang.ClassCastException: antlr.CommonAST cannot be cast to com.puppycrawl.tools.checkstyle.api.DetailAST
[checkstyle] /home/benjamin/NetBeansProjects/hive2/hive_stringbuilder_patch/hive/hcatalog/core/src/main/java/org/apache/hcatalog/oozie/JavaAction.java:0: Got an exception - java.lang.ClassCastException: antlr.CommonAST cannot be cast to com.puppycrawl.tools.checkstyle.api.DetailAST
[checkstyle] /home/benjamin/NetBeansProjects/hive2/hive_stringbuilder_patch/hive/hcatalog/core/src/main/java/org/apache/hcatalog/rcfile/RCFileMapReduceInputFormat.java:0: Got an exception - java.lang.ClassCastException: antlr.CommonAST cannot be cast to com.puppycrawl.tools.checkstyle.api.DetailAST
[checkstyle] /home/benjamin/NetBeansProjects/hive2/hive_stringbuilder_patch/hive/hcatalog/core/src/main/java/org/apache/hcatalog/rcfile/RCFileMapReduceOutputFormat.java:0: Got an exception - java.lang.ClassCastException: antlr.CommonAST cannot be cast to com.puppycrawl.tools.checkstyle.api.DetailAST
[checkstyle] /home/benjamin/NetBeansProjects/hive2/hive_stringbuilder_patch/hive/hcatalog/core/src/main/java/org/apache/hcatalog/rcfile/RCFileMapReduceRecordReader.java:0: Got an exception - java.lang.ClassCastException: antlr.CommonAST cannot be cast to com.puppycrawl.tools.checkstyle.api.DetailAST
[checkstyle] /home/benjamin/NetBeansProjects/hive2/hive_stringbuilder_patch/hive/hcatalog/core/src/main/java/org/apache/hcatalog/security/HdfsAuthorizationProvider.java:0: Got an exception - java.lang.ClassCastException: antlr.CommonAST cannot be cast to com.puppycrawl.tools.checkstyle.api.DetailAST
[checkstyle] /home/benjamin/NetBeansProjects/hive2/hive_stringbuilder_patch/hive/hcatalog/core/src/main/java/org/apache/hcatalog/security/StorageDelegationAuthorizationProvider.java:0: Got an exception - java.lang.ClassCastException: antlr.CommonAST cannot be cast to com.puppycrawl.tools.checkstyle.api.DetailAST
[checkstyle] /home/benjamin/NetBeansProjects/hive2/hive_stringbuilder_patch/hive/hcatalog/core/src/main/java/org/apache/hcatalog/shims/HCatHadoopShims.java:0: Got an exception - java.lang.ClassCastException: antlr.CommonAST cannot be cast to com.puppycrawl.tools.checkstyle.api.DetailAST
[checkstyle] /home/benjamin/NetBeansProjects/hive2/hive_stringbuilder_patch/hive/hcatalog/core/src/main/java/org/apache/hcatalog/storagehandler/DummyHCatAuthProvider.java:0: Got an exception - java.lang.ClassCastException: antlr.CommonAST cannot be cast to com.puppycrawl.tools.checkstyle.api.DetailAST
[checkstyle] /home/benjamin/NetBeansProjects/hive2/hive_stringbuilder_patch/hive/hcatalog/core/src/test/java/org/apache/hcatalog/ExitException.java:0: Got an exception - java.lang.ClassCastException: antlr.CommonAST cannot be cast to com.puppycrawl.tools.checkstyle.api.DetailAST
[checkstyle] /home/benjamin/NetBeansProjects/hive2/hive_stringbuilder_patch/hive/hcatalog/core/src/test/java/org/apache/hcatalog/HcatTestUtils.java:0: Got an exception - java.lang.ClassCastException: antlr.CommonAST cannot be cast to com.puppycrawl.tools.checkstyle.api.DetailAST
[checkstyle] /home/benjamin/NetBeansProjects/hive2/hive_stringbuilder_patch/hive/hcatalog/core/src/test/java/org/apache/hcatalog/MiniCluster.java:0: Got an exception - java.lang.ClassCastException: antlr.CommonAST cannot be cast to com.puppycrawl.tools.checkstyle.api.DetailAST
[checkstyle] /home/benjamin/NetBeansProjects/hive2/hive_stringbuilder_patch/hive/hcatalog/core/src/test/java/org/apache/hcatalog/NoExitSecurityManager.java:0: Got an exception - java.lang.ClassCastException: antlr.CommonAST cannot be cast to com.puppycrawl.tools.checkstyle.api.DetailAST
[checkstyle] /home/benjamin/NetBeansProjects/hive2/hive_stringbuilder_patch/hive/hcatalog/core/src/test/java/org/apache/hcatalog/cli/DummyStorageHandler.java:0: Got an exception - java.lang.ClassCastException: antlr.CommonAST cannot be cast to com.puppycrawl.tools.checkstyle.api.DetailAST
[checkstyle] /home/benjamin/NetBeansProjects/hive2/hive_stringbuilder_patch/hive/hcatalog/core/src/test/java/org/apache/hcatalog/cli/TestPermsGrp.java:0: Got an exception - java.lang.ClassCastException: antlr.CommonAST cannot be cast to com.puppycrawl.tools.checkstyle.api.DetailAST
[checkstyle] /home/benjamin/NetBeansProjects/hive2/hive_stringbuilder_patch/hive/hcatalog/core/src/test/java/org/apache/hcatalog/cli/TestSemanticAnalysis.java:0: Got an exception - java.lang.ClassCastException: antlr.CommonAST cannot be cast to com.puppycrawl.tools.checkstyle.api.DetailAST
[checkstyle] /home/benjamin/NetBeansProjects/hive2/hive_stringbuilder_patch/hive/hcatalog/core/src/test/java/org/apache/hcatalog/cli/TestUseDatabase.java:0: Got an exception - java.lang.ClassCastException: antlr.CommonAST cannot be cast to com.puppycrawl.tools.checkstyle.api.DetailAST
[checkstyle] /home/benjamin/NetBeansProjects/hive2/hive_stringbuilder_patch/hive/hcatalog/core/src/test/java/org/apache/hcatalog/common/TestHCatUtil.java:0: Got an exception - java.lang.ClassCastException: antlr.CommonAST cannot be cast to com.puppycrawl.tools.checkstyle.api.DetailAST
[checkstyle] /home/benjamin/NetBeansProjects/hive2/hive_stringbuilder_patch/hive/hcatalog/core/src/test/java/org/apache/hcatalog/common/TestHiveClientCache.java:0: Got an exception - java.lang.ClassCastException: antlr.CommonAST cannot be cast to com.puppycrawl.tools.checkstyle.api.DetailAST
[checkstyle] /home/benjamin/NetBeansProjects/hive2/hive_stringbuilder_patch/hive/hcatalog/core/src/test/java/org/apache/hcatalog/data/HCatDataCheckUtil.java:0: Got an exception - java.lang.ClassCastException: antlr.CommonAST cannot be cast to com.puppycrawl.tools.checkstyle.api.DetailAST
[checkstyle] /home/benjamin/NetBeansProjects/hive2/hive_stringbuilder_patch/hive/hcatalog/core/src/test/java/org/apache/hcatalog/data/TestDefaultHCatRecord.java:0: Got an exception - java.lang.ClassCastException: antlr.CommonAST cannot be cast to com.puppycrawl.tools.checkstyle.api.DetailAST
[checkstyle] Can't find/access AST Node typecom.puppycrawl.tools.checkstyle.api.DetailAST
[checkstyle] Can't find/access AST Node typecom.puppycrawl.tools.checkstyle.api.DetailAST
[checkstyle] Can't find/access AST Node typecom.puppycrawl.tools.checkstyle.api.DetailAST
[checkstyle] Can't find/access AST Node typecom.puppycrawl.tools.checkstyle.api.DetailAST
[checkstyle] Can't find/access AST Node typecom.puppycrawl.tools.checkstyle.api.DetailAST
[checkstyle] Can't find/access AST Node typecom.puppycrawl.tools.checkstyle.api.DetailAST
[checkstyle] Can't find/access AST Node typecom.puppycrawl.tools.checkstyle.api.DetailAST
[checkstyle] Can't find/access AST Node typecom.puppycrawl.tools.checkstyle.api.DetailAST
[checkstyle] Can't find/access AST Node typecom.puppycrawl.tools.checkstyle.api.DetailAST
[checkstyle] Can't find/access AST Node typecom.puppycrawl.tools.checkstyle.api.DetailAST
[checkstyle] Can't find/access AST Node typecom.puppycrawl.tools.checkstyle.api.DetailAST
[checkstyle] Can't find/access AST Node typecom.puppycrawl.tools.checkstyle.api.DetailAST
[checkstyle] Can't find/access AST Node typecom.puppycrawl.tools.checkstyle.api.DetailAST
[checkstyle] Can't find/access AST Node typecom.puppycrawl.tools.checkstyle.api.DetailAST
[checkstyle] Can't find/access AST Node typecom.puppycrawl.tools.checkstyle.api.DetailAST
[checkstyle] Can't find/access AST Node typecom.puppycrawl.tools.checkstyle.api.DetailAST
[checkstyle] Can't find/access AST Node typecom.puppycrawl.tools.checkstyle.api.DetailAST
[checkstyle] Can't find/access AST Node typecom.puppycrawl.tools.checkstyle.api.DetailAST
[checkstyle] Can't find/access AST Node typecom.puppycrawl.tools.checkstyle.api.DetailAST
[checkstyle] Can't find/access AST Node typecom.puppycrawl.tools.checkstyle.api.DetailAST
[checkstyle] Can't find/access AST Node typecom.puppycrawl.tools.checkstyle.api.DetailAST
[checkstyle] Can't find/access AST Node typecom.puppycrawl.tools.checkstyle.api.DetailAST
[checkstyle] Can't find/access AST Node typecom.puppycrawl.tools.checkstyle.api.DetailAST
[checkstyle] Can't find/access AST Node typecom.puppycrawl.tools.checkstyle.api.DetailAST
[checkstyle] Can't find/access AST Node typecom.puppycrawl.tools.checkstyle.api.DetailAST
[checkstyle] Can't find/access AST Node typecom.puppycrawl.tools.checkstyle.api.DetailAST
[checkstyle] Can't find/access AST Node typecom.puppycrawl.tools.checkstyle.api.DetailAST
[checkstyle] Can't find/access AST Node typecom.puppycrawl.tools.checkstyle.api.DetailAST
[checkstyle] /home/benjamin/NetBeansProjects/hive2/hive_stringbuilder_patch/hive/hcatalog/core/src/test/java/org/apache/hcatalog/data/TestHCatRecordSerDe.java:0: Got an exception - java.lang.ClassCastException: antlr.CommonAST cannot be cast to com.puppycrawl.tools.checkstyle.api.DetailAST
[checkstyle] /home/benjamin/NetBeansProjects/hive2/hive_stringbuilder_patch/hive/hcatalog/core/src/test/java/org/apache/hcatalog/data/TestJsonSerDe.java:0: Got an exception - java.lang.ClassCastException: antlr.CommonAST cannot be cast to com.puppycrawl.tools.checkstyle.api.DetailAST
[checkstyle] /home/benjamin/NetBeansProjects/hive2/hive_stringbuilder_patch/hive/hcatalog/core/src/test/java/org/apache/hcatalog/data/TestLazyHCatRecord.java:0: Got an exception - java.lang.ClassCastException: antlr.CommonAST cannot be cast to com.puppycrawl.tools.checkstyle.api.DetailAST
[checkstyle] /home/benjamin/NetBeansProjects/hive2/hive_stringbuilder_patch/hive/hcatalog/core/src/test/java/org/apache/hcatalog/data/TestReaderWriter.java:0: Got an exception - java.lang.ClassCastException: antlr.CommonAST cannot be cast to com.puppycrawl.tools.checkstyle.api.DetailAST
[checkstyle] /home/benjamin/NetBeansProjects/hive2/hive_stringbuilder_patch/hive/hcatalog/core/src/test/java/org/apache/hcatalog/data/schema/TestHCatSchema.java:0: Got an exception - java.lang.ClassCastException: antlr.CommonAST cannot be cast to com.puppycrawl.tools.checkstyle.api.DetailAST
[checkstyle] /home/benjamin/NetBeansProjects/hive2/hive_stringbuilder_patch/hive/hcatalog/core/src/test/java/org/apache/hcatalog/data/schema/TestHCatSchemaUtils.java:0: Got an exception - java.lang.ClassCastException: antlr.CommonAST cannot be cast to com.puppycrawl.tools.checkstyle.api.DetailAST
[checkstyle] /home/benjamin/NetBeansProjects/hive2/hive_stringbuilder_patch/hive/hcatalog/core/src/test/java/org/apache/hcatalog/fileformats/TestOrcDynamicPartitioned.java:0: Got an exception - java.lang.ClassCastException: antlr.CommonAST cannot be cast to com.puppycrawl.tools.checkstyle.api.DetailAST
[checkstyle] /home/benjamin/NetBeansProjects/hive2/hive_stringbuilder_patch/hive/hcatalog/core/src/test/java/org/apache/hcatalog/mapreduce/HCatBaseTest.java:0: Got an exception - java.lang.ClassCastException: antlr.CommonAST cannot be cast to com.puppycrawl.tools.checkstyle.api.DetailAST
[checkstyle] /home/benjamin/NetBeansProjects/hive2/hive_stringbuilder_patch/hive/hcatalog/core/src/test/java/org/apache/hcatalog/mapreduce/HCatMapReduceTest.java:0: Got an exception - java.lang.ClassCastException: antlr.CommonAST cannot be cast to com.puppycrawl.tools.checkstyle.api.DetailAST
[checkstyle] /home/benjamin/NetBeansProjects/hive2/hive_stringbuilder_patch/hive/hcatalog/core/src/test/java/org/apache/hcatalog/mapreduce/TestHCatDynamicPartitioned.java:0: Got an exception - java.lang.ClassCastException: antlr.CommonAST cannot be cast to com.puppycrawl.tools.checkstyle.api.DetailAST
[checkstyle] /home/benjamin/NetBeansProjects/hive2/hive_stringbuilder_patch/hive/hcatalog/core/src/test/java/org/apache/hcatalog/mapreduce/TestHCatExternalDynamicPartitioned.java:0: Got an exception - java.lang.ClassCastException: antlr.CommonAST cannot be cast to com.puppycrawl.tools.checkstyle.api.DetailAST
[checkstyle] /home/benjamin/NetBeansProjects/hive2/hive_stringbuilder_patch/hive/hcatalog/core/src/test/java/org/apache/hcatalog/mapreduce/TestHCatExternalHCatNonPartitioned.java:0: Got an exception - java.lang.ClassCastException: antlr.CommonAST cannot be cast to com.puppycrawl.tools.checkstyle.api.DetailAST
[checkstyle] /home/benjamin/NetBeansProjects/hive2/hive_stringbuilder_patch/hive/hcatalog/core/src/test/java/org/apache/hcatalog/mapreduce/TestHCatExternalPartitioned.java:0: Got an exception - java.lang.ClassCastException: antlr.CommonAST cannot be cast to com.puppycrawl.tools.checkstyle.api.DetailAST
[checkstyle] /home/benjamin/NetBeansProjects/hive2/hive_stringbuilder_patch/hive/hcatalog/core/src/test/java/org/apache/hcatalog/mapreduce/TestHCatHiveCompatibility.java:0: Got an exception - java.lang.ClassCastException: antlr.CommonAST cannot be cast to com.puppycrawl.tools.checkstyle.api.DetailAST
[checkstyle] /home/benjamin/NetBeansProjects/hive2/hive_stringbuilder_patch/hive/hcatalog/core/src/test/java/org/apache/hcatalog/mapreduce/TestHCatHiveThriftCompatibility.java:0: Got an exception - java.lang.ClassCastException: antlr.CommonAST cannot be cast to com.puppycrawl.tools.checkstyle.api.DetailAST
[checkstyle] /home/benjamin/NetBeansProjects/hive2/hive_stringbuilder_patch/hive/hcatalog/core/src/test/java/org/apache/hcatalog/mapreduce/TestHCatInputFormat.java:0: Got an exception - java.lang.ClassCastException: antlr.CommonAST cannot be cast to com.puppycrawl.tools.checkstyle.api.DetailAST
[checkstyle] /home/benjamin/NetBeansProjects/hive2/hive_stringbuilder_patch/hive/hcatalog/core/src/test/java/org/apache/hcatalog/mapreduce/TestHCatMultiOutputFormat.java:0: Got an exception - java.lang.ClassCastException: antlr.CommonAST cannot be cast to com.puppycrawl.tools.checkstyle.api.DetailAST
[checkstyle] /home/benjamin/NetBeansProjects/hive2/hive_stringbuilder_patch/hive/hcatalog/core/src/test/java/org/apache/hcatalog/mapreduce/TestHCatNonPartitioned.java:0: Got an exception - java.lang.ClassCastException: antlr.CommonAST cannot be cast to com.puppycrawl.tools.checkstyle.api.DetailAST
[checkstyle] /home/benjamin/NetBeansProjects/hive2/hive_stringbuilder_patch/hive/hcatalog/core/src/test/java/org/apache/hcatalog/mapreduce/TestHCatOutputFormat.java:0: Got an exception - java.lang.ClassCastException: antlr.CommonAST cannot be cast to com.puppycrawl.tools.checkstyle.api.DetailAST
[checkstyle] /home/benjamin/NetBeansProjects/hive2/hive_stringbuilder_patch/hive/hcatalog/core/src/test/java/org/apache/hcatalog/mapreduce/TestHCatPartitionPublish.java:0: Got an exception - java.lang.ClassCastException: antlr.CommonAST cannot be cast to com.puppycrawl.tools.checkstyle.api.DetailAST
[checkstyle] /home/benjamin/NetBeansProjects/hive2/hive_stringbuilder_patch/hive/hcatalog/core/src/test/java/org/apache/hcatalog/mapreduce/TestHCatPartitioned.java:0: Got an exception - java.lang.ClassCastException: antlr.CommonAST cannot be cast to com.puppycrawl.tools.checkstyle.api.DetailAST
[checkstyle] /home/benjamin/NetBeansProjects/hive2/hive_stringbuilder_patch/hive/hcatalog/core/src/test/java/org/apache/hcatalog/mapreduce/TestInputJobInfo.java:0: Got an exception - java.lang.ClassCastException: antlr.CommonAST cannot be cast to com.puppycrawl.tools.checkstyle.api.DetailAST
[checkstyle] /home/benjamin/NetBeansProjects/hive2/hive_stringbuilder_patch/hive/hcatalog/core/src/test/java/org/apache/hcatalog/mapreduce/TestMultiOutputFormat.java:0: Got an exception - java.lang.ClassCastException: antlr.CommonAST cannot be cast to com.puppycrawl.tools.checkstyle.api.DetailAST
[checkstyle] /home/benjamin/NetBeansProjects/hive2/hive_stringbuilder_patch/hive/hcatalog/core/src/test/java/org/apache/hcatalog/mapreduce/TestPassProperties.java:0: Got an exception - java.lang.ClassCastException: antlr.CommonAST cannot be cast to com.puppycrawl.tools.checkstyle.api.DetailAST
[checkstyle] /home/benjamin/NetBeansProjects/hive2/hive_stringbuilder_patch/hive/hcatalog/core/src/test/java/org/apache/hcatalog/mapreduce/TestSequenceFileReadWrite.java:0: Got an exception - java.lang.ClassCastException: antlr.CommonAST cannot be cast to com.puppycrawl.tools.checkstyle.api.DetailAST
[checkstyle] /home/benjamin/NetBeansProjects/hive2/hive_stringbuilder_patch/hive/hcatalog/core/src/test/java/org/apache/hcatalog/rcfile/TestRCFileMapReduceInputFormat.java:0: Got an exception - java.lang.ClassCastException: antlr.CommonAST cannot be cast to com.puppycrawl.tools.checkstyle.api.DetailAST
[checkstyle] /home/benjamin/NetBeansProjects/hive2/hive_stringbuilder_patch/hive/hcatalog/core/src/test/java/org/apache/hcatalog/security/TestHdfsAuthorizationProvider.java:0: Got an exception - java.lang.ClassCastException: antlr.CommonAST cannot be cast to com.puppycrawl.tools.checkstyle.api.DetailAST
[checkstyle] /home/benjamin/NetBeansProjects/hive2/hive_stringbuilder_patch/hive/hcatalog/hcatalog-pig-adapter/src/main/java/org/apache/hcatalog/pig/HCatBaseLoader.java:0: Got an exception - java.lang.ClassCastException: antlr.CommonAST cannot be cast to com.puppycrawl.tools.checkstyle.api.DetailAST
[checkstyle] /home/benjamin/NetBeansProjects/hive2/hive_stringbuilder_patch/hive/hcatalog/hcatalog-pig-adapter/src/main/java/org/apache/hcatalog/pig/HCatBaseStorer.java:0: Got an exception - java.lang.ClassCastException: antlr.CommonAST cannot be cast to com.puppycrawl.tools.checkstyle.api.DetailAST
[checkstyle] Can't find/access AST Node typecom.puppycrawl.tools.checkstyle.api.DetailAST
[checkstyle] Can't find/access AST Node typecom.puppycrawl.tools.checkstyle.api.DetailAST
[checkstyle] Can't find/access AST Node typecom.puppycrawl.tools.checkstyle.api.DetailAST
[checkstyle] Can't find/access AST Node typecom.puppycrawl.tools.checkstyle.api.DetailAST
[checkstyle] Can't find/access AST Node typecom.puppycrawl.tools.checkstyle.api.DetailAST
[checkstyle] Can't find/access AST Node typecom.puppycrawl.tools.checkstyle.api.DetailAST
[checkstyle] Can't find/access AST Node typecom.puppycrawl.tools.checkstyle.api.DetailAST
[checkstyle] Can't find/access AST Node typecom.puppycrawl.tools.checkstyle.api.DetailAST
[checkstyle] Can't find/access AST Node typecom.puppycrawl.tools.checkstyle.api.DetailAST
[checkstyle] Can't find/access AST Node typecom.puppycrawl.tools.checkstyle.api.DetailAST
[checkstyle] Can't find/access AST Node typecom.puppycrawl.tools.checkstyle.api.DetailAST
[checkstyle] Can't find/access AST Node typecom.puppycrawl.tools.checkstyle.api.DetailAST
[checkstyle] Can't find/access AST Node typecom.puppycrawl.tools.checkstyle.api.DetailAST
[checkstyle] Can't find/access AST Node typecom.puppycrawl.tools.checkstyle.api.DetailAST
[checkstyle] Can't find/access AST Node typecom.puppycrawl.tools.checkstyle.api.DetailAST
[checkstyle] Can't find/access AST Node typecom.puppycrawl.tools.checkstyle.api.DetailAST
[checkstyle] Can't find/access AST Node typecom.puppycrawl.tools.checkstyle.api.DetailAST
[checkstyle] Can't find/access AST Node typecom.puppycrawl.tools.checkstyle.api.DetailAST
[checkstyle] Can't find/access AST Node typecom.puppycrawl.tools.checkstyle.api.DetailAST
[checkstyle] Can't find/access AST Node typecom.puppycrawl.tools.checkstyle.api.DetailAST
[checkstyle] Can't find/access AST Node typecom.puppycrawl.tools.checkstyle.api.DetailAST
[checkstyle] Can't find/access AST Node typecom.puppycrawl.tools.checkstyle.api.DetailAST
[checkstyle] Can't find/access AST Node typecom.puppycrawl.tools.checkstyle.api.DetailAST
[checkstyle] Can't find/access AST Node typecom.puppycrawl.tools.checkstyle.api.DetailAST
[checkstyle] Can't find/access AST Node typecom.puppycrawl.tools.checkstyle.api.DetailAST
[checkstyle] Can't find/access AST Node typecom.puppycrawl.tools.checkstyle.api.DetailAST
[checkstyle] Can't find/access AST Node typecom.puppycrawl.tools.checkstyle.api.DetailAST
[checkstyle] Can't find/access AST Node typecom.puppycrawl.tools.checkstyle.api.DetailAST
[checkstyle] /home/benjamin/NetBeansProjects/hive2/hive_stringbuilder_patch/hive/hcatalog/hcatalog-pig-adapter/src/main/java/org/apache/hcatalog/pig/HCatLoader.java:0: Got an exception - java.lang.ClassCastException: antlr.CommonAST cannot be cast to com.puppycrawl.tools.checkstyle.api.DetailAST
[checkstyle] /home/benjamin/NetBeansProjects/hive2/hive_stringbuilder_patch/hive/hcatalog/hcatalog-pig-adapter/src/main/java/org/apache/hcatalog/pig/HCatStorer.java:0: Got an exception - java.lang.ClassCastException: antlr.CommonAST cannot be cast to com.puppycrawl.tools.checkstyle.api.DetailAST
[checkstyle] /home/benjamin/NetBeansProjects/hive2/hive_stringbuilder_patch/hive/hcatalog/hcatalog-pig-adapter/src/main/java/org/apache/hcatalog/pig/PigHCatUtil.java:0: Got an exception - java.lang.ClassCastException: antlr.CommonAST cannot be cast to com.puppycrawl.tools.checkstyle.api.DetailAST
[checkstyle] /home/benjamin/NetBeansProjects/hive2/hive_stringbuilder_patch/hive/hcatalog/hcatalog-pig-adapter/src/test/java/org/apache/hcatalog/pig/HCatStorerWrapper.java:0: Got an exception - java.lang.ClassCastException: antlr.CommonAST cannot be cast to com.puppycrawl.tools.checkstyle.api.DetailAST
[checkstyle] /home/benjamin/NetBeansProjects/hive2/hive_stringbuilder_patch/hive/hcatalog/hcatalog-pig-adapter/src/test/java/org/apache/hcatalog/pig/MockLoader.java:0: Got an exception - java.lang.ClassCastException: antlr.CommonAST cannot be cast to com.puppycrawl.tools.checkstyle.api.DetailAST
[checkstyle] /home/benjamin/NetBeansProjects/hive2/hive_stringbuilder_patch/hive/hcatalog/hcatalog-pig-adapter/src/test/java/org/apache/hcatalog/pig/MyPigStorage.java:0: Got an exception - java.lang.ClassCastException: antlr.CommonAST cannot be cast to com.puppycrawl.tools.checkstyle.api.DetailAST
[checkstyle] /home/benjamin/NetBeansProjects/hive2/hive_stringbuilder_patch/hive/hcatalog/hcatalog-pig-adapter/src/test/java/org/apache/hcatalog/pig/TestE2EScenarios.java:0: Got an exception - java.lang.ClassCastException: antlr.CommonAST cannot be cast to com.puppycrawl.tools.checkstyle.api.DetailAST
[checkstyle] /home/benjamin/NetBeansProjects/hive2/hive_stringbuilder_patch/hive/hcatalog/hcatalog-pig-adapter/src/test/java/org/apache/hcatalog/pig/TestHCatLoader.java:0: Got an exception - java.lang.ClassCastException: antlr.CommonAST cannot be cast to com.puppycrawl.tools.checkstyle.api.DetailAST
[checkstyle] /home/benjamin/NetBeansProjects/hive2/hive_stringbuilder_patch/hive/hcatalog/hcatalog-pig-adapter/src/test/java/org/apache/hcatalog/pig/TestHCatLoaderComplexSchema.java:0: Got an exception - java.lang.ClassCastException: antlr.CommonAST cannot be cast to com.puppycrawl.tools.checkstyle.api.DetailAST
[checkstyle] /home/benjamin/NetBeansProjects/hive2/hive_stringbuilder_patch/hive/hcatalog/hcatalog-pig-adapter/src/test/java/org/apache/hcatalog/pig/TestHCatLoaderStorer.java:0: Got an exception - java.lang.ClassCastException: antlr.CommonAST cannot be cast to com.puppycrawl.tools.checkstyle.api.DetailAST
[checkstyle] /home/benjamin/NetBeansProjects/hive2/hive_stringbuilder_patch/hive/hcatalog/hcatalog-pig-adapter/src/test/java/org/apache/hcatalog/pig/TestHCatStorer.java:0: Got an exception - java.lang.ClassCastException: antlr.CommonAST cannot be cast to com.puppycrawl.tools.checkstyle.api.DetailAST
[checkstyle] /home/benjamin/NetBeansProjects/hive2/hive_stringbuilder_patch/hive/hcatalog/hcatalog-pig-adapter/src/test/java/org/apache/hcatalog/pig/TestHCatStorerMulti.java:0: Got an exception - java.lang.ClassCastException: antlr.CommonAST cannot be cast to com.puppycrawl.tools.checkstyle.api.DetailAST
[checkstyle] /home/benjamin/NetBeansProjects/hive2/hive_stringbuilder_patch/hive/hcatalog/hcatalog-pig-adapter/src/test/java/org/apache/hcatalog/pig/TestHCatStorerWrapper.java:0: Got an exception - java.lang.ClassCastException: antlr.CommonAST cannot be cast to com.puppycrawl.tools.checkstyle.api.DetailAST
[checkstyle] /home/benjamin/NetBeansProjects/hive2/hive_stringbuilder_patch/hive/hcatalog/hcatalog-pig-adapter/src/test/java/org/apache/hcatalog/pig/TestOrcHCatLoader.java:0: Got an exception - java.lang.ClassCastException: antlr.CommonAST cannot be cast to com.puppycrawl.tools.checkstyle.api.DetailAST
[checkstyle] /home/benjamin/NetBeansProjects/hive2/hive_stringbuilder_patch/hive/hcatalog/hcatalog-pig-adapter/src/test/java/org/apache/hcatalog/pig/TestOrcHCatLoaderComplexSchema.java:0: Got an exception - java.lang.ClassCastException: antlr.CommonAST cannot be cast to com.puppycrawl.tools.checkstyle.api.DetailAST
[checkstyle] /home/benjamin/NetBeansProjects/hive2/hive_stringbuilder_patch/hive/hcatalog/hcatalog-pig-adapter/src/test/java/org/apache/hcatalog/pig/TestOrcHCatStorer.java:0: Got an exception - java.lang.ClassCastException: antlr.CommonAST cannot be cast to com.puppycrawl.tools.checkstyle.api.DetailAST
[checkstyle] /home/benjamin/NetBeansProjects/hive2/hive_stringbuilder_patch/hive/hcatalog/hcatalog-pig-adapter/src/test/java/org/apache/hcatalog/pig/TestPigHCatUtil.java:0: Got an exception - java.lang.ClassCastException: antlr.CommonAST cannot be cast to com.puppycrawl.tools.checkstyle.api.DetailAST
[checkstyle] /home/benjamin/NetBeansProjects/hive2/hive_stringbuilder_patch/hive/hcatalog/server-extensions/src/main/java/org/apache/hcatalog/listener/NotificationListener.java:0: Got an exception - java.lang.ClassCastException: antlr.CommonAST cannot be cast to com.puppycrawl.tools.checkstyle.api.DetailAST
[checkstyle] /home/benjamin/NetBeansProjects/hive2/hive_stringbuilder_patch/hive/hcatalog/server-extensions/src/main/java/org/apache/hcatalog/messaging/AddPartitionMessage.java:0: Got an exception - java.lang.ClassCastException: antlr.CommonAST cannot be cast to com.puppycrawl.tools.checkstyle.api.DetailAST
[checkstyle] /home/benjamin/NetBeansProjects/hive2/hive_stringbuilder_patch/hive/hcatalog/server-extensions/src/main/java/org/apache/hcatalog/messaging/CreateDatabaseMessage.java:0: Got an exception - java.lang.ClassCastException: antlr.CommonAST cannot be cast to com.puppycrawl.tools.checkstyle.api.DetailAST
[checkstyle] /home/benjamin/NetBeansProjects/hive2/hive_stringbuilder_patch/hive/hcatalog/server-extensions/src/main/java/org/apache/hcatalog/messaging/CreateTableMessage.java:0: Got an exception - java.lang.ClassCastException: antlr.CommonAST cannot be cast to com.puppycrawl.tools.checkstyle.api.DetailAST
[checkstyle] /home/benjamin/NetBeansProjects/hive2/hive_stringbuilder_patch/hive/hcatalog/server-extensions/src/main/java/org/apache/hcatalog/messaging/DropDatabaseMessage.java:0: Got an exception - java.lang.ClassCastException: antlr.CommonAST cannot be cast to com.puppycrawl.tools.checkstyle.api.DetailAST
[checkstyle] /home/benjamin/NetBeansProjects/hive2/hive_stringbuilder_patch/hive/hcatalog/server-extensions/src/main/java/org/apache/hcatalog/messaging/DropPartitionMessage.java:0: Got an exception - java.lang.ClassCastException: antlr.CommonAST cannot be cast to com.puppycrawl.tools.checkstyle.api.DetailAST
[checkstyle] /home/benjamin/NetBeansProjects/hive2/hive_stringbuilder_patch/hive/hcatalog/server-extensions/src/main/java/org/apache/hcatalog/messaging/DropTableMessage.java:0: Got an exception - java.lang.ClassCastException: antlr.CommonAST cannot be cast to com.puppycrawl.tools.checkstyle.api.DetailAST
[checkstyle] /home/benjamin/NetBeansProjects/hive2/hive_stringbuilder_patch/hive/hcatalog/server-extensions/src/main/java/org/apache/hcatalog/messaging/HCatEventMessage.java:0: Got an exception - java.lang.ClassCastException: antlr.CommonAST cannot be cast to com.puppycrawl.tools.checkstyle.api.DetailAST
[checkstyle] /home/benjamin/NetBeansProjects/hive2/hive_stringbuilder_patch/hive/hcatalog/server-extensions/src/main/java/org/apache/hcatalog/messaging/MessageDeserializer.java:0: Got an exception - java.lang.ClassCastException: antlr.CommonAST cannot be cast to com.puppycrawl.tools.checkstyle.api.DetailAST
[checkstyle] /home/benjamin/NetBeansProjects/hive2/hive_stringbuilder_patch/hive/hcatalog/server-extensions/src/main/java/org/apache/hcatalog/messaging/MessageFactory.java:0: Got an exception - java.lang.ClassCastException: antlr.CommonAST cannot be cast to com.puppycrawl.tools.checkstyle.api.DetailAST
[checkstyle] /home/benjamin/NetBeansProjects/hive2/hive_stringbuilder_patch/hive/hcatalog/server-extensions/src/main/java/org/apache/hcatalog/messaging/jms/MessagingUtils.java:0: Got an exception - java.lang.ClassCastException: antlr.CommonAST cannot be cast to com.puppycrawl.tools.checkstyle.api.DetailAST
[checkstyle] Can't find/access AST Node typecom.puppycrawl.tools.checkstyle.api.DetailAST
[checkstyle] Can't find/access AST Node typecom.puppycrawl.tools.checkstyle.api.DetailAST
[checkstyle] Can't find/access AST Node typecom.puppycrawl.tools.checkstyle.api.DetailAST
[checkstyle] Can't find/access AST Node typecom.puppycrawl.tools.checkstyle.api.DetailAST
[checkstyle] Can't find/access AST Node typecom.puppycrawl.tools.checkstyle.api.DetailAST
[checkstyle] Can't find/access AST Node typecom.puppycrawl.tools.checkstyle.api.DetailAST
[checkstyle] Can't find/access AST Node typecom.puppycrawl.tools.checkstyle.api.DetailAST
[checkstyle] Can't find/access AST Node typecom.puppycrawl.tools.checkstyle.api.DetailAST
[checkstyle] Can't find/access AST Node typecom.puppycrawl.tools.checkstyle.api.DetailAST
[checkstyle] Can't find/access AST Node typecom.puppycrawl.tools.checkstyle.api.DetailAST
[checkstyle] Can't find/access AST Node typecom.puppycrawl.tools.checkstyle.api.DetailAST
[checkstyle] Can't find/access AST Node typecom.puppycrawl.tools.checkstyle.api.DetailAST
[checkstyle] Can't find/access AST Node typecom.puppycrawl.tools.checkstyle.api.DetailAST
[checkstyle] Can't find/access AST Node typecom.puppycrawl.tools.checkstyle.api.DetailAST
[checkstyle] Can't find/access AST Node typecom.puppycrawl.tools.checkstyle.api.DetailAST
[checkstyle] Can't find/access AST Node typecom.puppycrawl.tools.checkstyle.api.DetailAST
[checkstyle] Can't find/access AST Node typecom.puppycrawl.tools.checkstyle.api.DetailAST
[checkstyle] Can't find/access AST Node typecom.puppycrawl.tools.checkstyle.api.DetailAST
[checkstyle] Can't find/access AST Node typecom.puppycrawl.tools.checkstyle.api.DetailAST
[checkstyle] Can't find/access AST Node typecom.puppycrawl.tools.checkstyle.api.DetailAST
[checkstyle] Can't find/access AST Node typecom.puppycrawl.tools.checkstyle.api.DetailAST
[checkstyle] Can't find/access AST Node typecom.puppycrawl.tools.checkstyle.api.DetailAST
[checkstyle] Can't find/access AST Node typecom.puppycrawl.tools.checkstyle.api.DetailAST
[checkstyle] Can't find/access AST Node typecom.puppycrawl.tools.checkstyle.api.DetailAST
[checkstyle] Can't find/access AST Node typecom.puppycrawl.tools.checkstyle.api.DetailAST
[checkstyle] Can't find/access AST Node typecom.puppycrawl.tools.checkstyle.api.DetailAST
[checkstyle] Can't find/access AST Node typecom.puppycrawl.tools.checkstyle.api.DetailAST
[checkstyle] Can't find/access AST Node typecom.puppycrawl.tools.checkstyle.api.DetailAST
[checkstyle] Can't find/access AST Node typecom.puppycrawl.tools.checkstyle.api.DetailAST
[checkstyle] /home/benjamin/NetBeansProjects/hive2/hive_stringbuilder_patch/hive/hcatalog/server-extensions/src/main/java/org/apache/hcatalog/messaging/json/JSONAddPartitionMessage.java:0: Got an exception - java.lang.ClassCastException: antlr.CommonAST cannot be cast to com.puppycrawl.tools.checkstyle.api.DetailAST
[checkstyle] /home/benjamin/NetBeansProjects/hive2/hive_stringbuilder_patch/hive/hcatalog/server-extensions/src/main/java/org/apache/hcatalog/messaging/json/JSONCreateDatabaseMessage.java:0: Got an exception - java.lang.ClassCastException: antlr.CommonAST cannot be cast to com.puppycrawl.tools.checkstyle.api.DetailAST
[checkstyle] /home/benjamin/NetBeansProjects/hive2/hive_stringbuilder_patch/hive/hcatalog/server-extensions/src/main/java/org/apache/hcatalog/messaging/json/JSONCreateTableMessage.java:0: Got an exception - java.lang.ClassCastException: antlr.CommonAST cannot be cast to com.puppycrawl.tools.checkstyle.api.DetailAST
[checkstyle] /home/benjamin/NetBeansProjects/hive2/hive_stringbuilder_patch/hive/hcatalog/server-extensions/src/main/java/org/apache/hcatalog/messaging/json/JSONDropDatabaseMessage.java:0: Got an exception - java.lang.ClassCastException: antlr.CommonAST cannot be cast to com.puppycrawl.tools.checkstyle.api.DetailAST
[checkstyle] /home/benjamin/NetBeansProjects/hive2/hive_stringbuilder_patch/hive/hcatalog/server-extensions/src/main/java/org/apache/hcatalog/messaging/json/JSONDropPartitionMessage.java:0: Got an exception - java.lang.ClassCastException: antlr.CommonAST cannot be cast to com.puppycrawl.tools.checkstyle.api.DetailAST
[checkstyle] /home/benjamin/NetBeansProjects/hive2/hive_stringbuilder_patch/hive/hcatalog/server-extensions/src/main/java/org/apache/hcatalog/messaging/json/JSONDropTableMessage.java:0: Got an exception - java.lang.ClassCastException: antlr.CommonAST cannot be cast to com.puppycrawl.tools.checkstyle.api.DetailAST
[checkstyle] /home/benjamin/NetBeansProjects/hive2/hive_stringbuilder_patch/hive/hcatalog/server-extensions/src/main/java/org/apache/hcatalog/messaging/json/JSONMessageDeserializer.java:0: Got an exception - java.lang.ClassCastException: antlr.CommonAST cannot be cast to com.puppycrawl.tools.checkstyle.api.DetailAST
[checkstyle] /home/benjamin/NetBeansProjects/hive2/hive_stringbuilder_patch/hive/hcatalog/server-extensions/src/main/java/org/apache/hcatalog/messaging/json/JSONMessageFactory.java:0: Got an exception - java.lang.ClassCastException: antlr.CommonAST cannot be cast to com.puppycrawl.tools.checkstyle.api.DetailAST
[checkstyle] /home/benjamin/NetBeansProjects/hive2/hive_stringbuilder_patch/hive/hcatalog/server-extensions/src/test/java/org/apache/hcatalog/listener/TestMsgBusConnection.java:0: Got an exception - java.lang.ClassCastException: antlr.CommonAST cannot be cast to com.puppycrawl.tools.checkstyle.api.DetailAST
[checkstyle] /home/benjamin/NetBeansProjects/hive2/hive_stringbuilder_patch/hive/hcatalog/server-extensions/src/test/java/org/apache/hcatalog/listener/TestNotificationListener.java:0: Got an exception - java.lang.ClassCastException: antlr.CommonAST cannot be cast to com.puppycrawl.tools.checkstyle.api.DetailAST
[checkstyle] /home/benjamin/NetBeansProjects/hive2/hive_stringbuilder_patch/hive/hcatalog/shims/src/20/java/org/apache/hadoop/mapred/TempletonJobTracker.java:0: Got an exception - java.lang.ClassCastException: antlr.CommonAST cannot be cast to com.puppycrawl.tools.checkstyle.api.DetailAST
[checkstyle] /home/benjamin/NetBeansProjects/hive2/hive_stringbuilder_patch/hive/hcatalog/shims/src/20/java/org/apache/hcatalog/shims/HCatHadoopShims20S.java:0: Got an exception - java.lang.ClassCastException: antlr.CommonAST cannot be cast to com.puppycrawl.tools.checkstyle.api.DetailAST
[checkstyle] /home/benjamin/NetBeansProjects/hive2/hive_stringbuilder_patch/hive/hcatalog/shims/src/23/java/org/apache/hadoop/mapred/TempletonJobTracker.java:0: Got an exception - java.lang.ClassCastException: antlr.CommonAST cannot be cast to com.puppycrawl.tools.checkstyle.api.DetailAST
[checkstyle] /home/benjamin/NetBeansProjects/hive2/hive_stringbuilder_patch/hive/hcatalog/shims/src/23/java/org/apache/hcatalog/shims/HCatHadoopShims23.java:0: Got an exception - java.lang.ClassCastException: antlr.CommonAST cannot be cast to com.puppycrawl.tools.checkstyle.api.DetailAST
[checkstyle] /home/benjamin/NetBeansProjects/hive2/hive_stringbuilder_patch/hive/hcatalog/src/java/org/apache/hive/hcatalog/package-info.java:0: Got an exception - java.lang.ClassCastException: antlr.CommonAST cannot be cast to com.puppycrawl.tools.checkstyle.api.DetailAST
[checkstyle] /home/benjamin/NetBeansProjects/hive2/hive_stringbuilder_patch/hive/hcatalog/src/test/e2e/hcatalog/tools/generate/java/org/apache/hadoop/hive/tools/generate/RCFileGenerator.java:0: Got an exception - java.lang.ClassCastException: antlr.CommonAST cannot be cast to com.puppycrawl.tools.checkstyle.api.DetailAST
[checkstyle] /home/benjamin/NetBeansProjects/hive2/hive_stringbuilder_patch/hive/hcatalog/src/test/e2e/hcatalog/udfs/java/org/apache/hcatalog/utils/DataReaderMaster.java:0: Got an exception - java.lang.ClassCastException: antlr.CommonAST cannot be cast to com.puppycrawl.tools.checkstyle.api.DetailAST
[checkstyle] /home/benjamin/NetBeansProjects/hive2/hive_stringbuilder_patch/hive/hcatalog/src/test/e2e/hcatalog/udfs/java/org/apache/hcatalog/utils/DataReaderSlave.java:0: Got an exception - java.lang.ClassCastException: antlr.CommonAST cannot be cast to com.puppycrawl.tools.checkstyle.api.DetailAST
[checkstyle] /home/benjamin/NetBeansProjects/hive2/hive_stringbuilder_patch/hive/hcatalog/src/test/e2e/hcatalog/udfs/java/org/apache/hcatalog/utils/DataWriterMaster.java:0: Got an exception - java.lang.ClassCastException: antlr.CommonAST cannot be cast to com.puppycrawl.tools.checkstyle.api.DetailAST
[checkstyle] /home/benjamin/NetBeansProjects/hive2/hive_stringbuilder_patch/hive/hcatalog/src/test/e2e/hcatalog/udfs/java/org/apache/hcatalog/utils/DataWriterSlave.java:0: Got an exception - java.lang.ClassCastException: antlr.CommonAST cannot be cast to com.puppycrawl.tools.checkstyle.api.DetailAST
[checkstyle] /home/benjamin/NetBeansProjects/hive2/hive_stringbuilder_patch/hive/hcatalog/src/test/e2e/hcatalog/udfs/java/org/apache/hcatalog/utils/GroupByAge.java:0: Got an exception - java.lang.ClassCastException: antlr.CommonAST cannot be cast to com.puppycrawl.tools.checkstyle.api.DetailAST
[checkstyle] /home/benjamin/NetBeansProjects/hive2/hive_stringbuilder_patch/hive/hcatalog/src/test/e2e/hcatalog/udfs/java/org/apache/hcatalog/utils/HBaseReadWrite.java:0: Got an exception - java.lang.ClassCastException: antlr.CommonAST cannot be cast to com.puppycrawl.tools.checkstyle.api.DetailAST
[checkstyle] /home/benjamin/NetBeansProjects/hive2/hive_stringbuilder_patch/hive/hcatalog/src/test/e2e/hcatalog/udfs/java/org/apache/hcatalog/utils/HCatTestDriver.java:0: Got an exception - java.lang.ClassCastException: antlr.CommonAST cannot be cast to com.puppycrawl.tools.checkstyle.api.DetailAST
[checkstyle] /home/benjamin/NetBeansProjects/hive2/hive_stringbuilder_patch/hive/hcatalog/src/test/e2e/hcatalog/udfs/java/org/apache/hcatalog/utils/HCatTypeCheck.java:0: Got an exception - java.lang.ClassCastException: antlr.CommonAST cannot be cast to com.puppycrawl.tools.checkstyle.api.DetailAST
[checkstyle] /home/benjamin/NetBeansProjects/hive2/hive_stringbuilder_patch/hive/hcatalog/src/test/e2e/hcatalog/udfs/java/org/apache/hcatalog/utils/HCatTypeCheckHive.java:0: Got an exception - java.lang.ClassCastException: antlr.CommonAST cannot be cast to com.puppycrawl.tools.checkstyle.api.DetailAST
[checkstyle] /home/benjamin/NetBeansProjects/hive2/hive_stringbuilder_patch/hive/hcatalog/src/test/e2e/hcatalog/udfs/java/org/apache/hcatalog/utils/ReadJson.java:0: Got an exception - java.lang.ClassCastException: antlr.CommonAST cannot be cast to com.puppycrawl.tools.checkstyle.api.DetailAST
[checkstyle] /home/benjamin/NetBeansProjects/hive2/hive_stringbuilder_patch/hive/hcatalog/src/test/e2e/hcatalog/udfs/java/org/apache/hcatalog/utils/ReadRC.java:0: Got an exception - java.lang.ClassCastException: antlr.CommonAST cannot be cast to com.puppycrawl.tools.checkstyle.api.DetailAST
[checkstyle] /home/benjamin/NetBeansProjects/hive2/hive_stringbuilder_patch/hive/hcatalog/src/test/e2e/hcatalog/udfs/java/org/apache/hcatalog/utils/ReadText.java:0: Got an exception - java.lang.ClassCastException: antlr.CommonAST cannot be cast to com.puppycrawl.tools.checkstyle.api.DetailAST
[checkstyle] Can't find/access AST Node typecom.puppycrawl.tools.checkstyle.api.DetailAST
[checkstyle] Can't find/access AST Node typecom.puppycrawl.tools.checkstyle.api.DetailAST
[checkstyle] Can't find/access AST Node typecom.puppycrawl.tools.checkstyle.api.DetailAST
[checkstyle] Can't find/access AST Node typecom.puppycrawl.tools.checkstyle.api.DetailAST
[checkstyle] Can't find/access AST Node typecom.puppycrawl.tools.checkstyle.api.DetailAST
[checkstyle] Can't find/access AST Node typecom.puppycrawl.tools.checkstyle.api.DetailAST
[checkstyle] Can't find/access AST Node typecom.puppycrawl.tools.checkstyle.api.DetailAST
[checkstyle] Can't find/access AST Node typecom.puppycrawl.tools.checkstyle.api.DetailAST
[checkstyle] Can't find/access AST Node typecom.puppycrawl.tools.checkstyle.api.DetailAST
[checkstyle] Can't find/access AST Node typecom.puppycrawl.tools.checkstyle.api.DetailAST
[checkstyle] Can't find/access AST Node typecom.puppycrawl.tools.checkstyle.api.DetailAST
[checkstyle] Can't find/access AST Node typecom.puppycrawl.tools.checkstyle.api.DetailAST
[checkstyle] Can't find/access AST Node typecom.puppycrawl.tools.checkstyle.api.DetailAST
[checkstyle] Can't find/access AST Node typecom.puppycrawl.tools.checkstyle.api.DetailAST
[checkstyle] Can't find/access AST Node typecom.puppycrawl.tools.checkstyle.api.DetailAST
[checkstyle] Can't find/access AST Node typecom.puppycrawl.tools.checkstyle.api.DetailAST
[checkstyle] Can't find/access AST Node typecom.puppycrawl.tools.checkstyle.api.DetailAST
[checkstyle] Can't find/access AST Node typecom.puppycrawl.tools.checkstyle.api.DetailAST
[checkstyle] Can't find/access AST Node typecom.puppycrawl.tools.checkstyle.api.DetailAST
[checkstyle] Can't find/access AST Node typecom.puppycrawl.tools.checkstyle.api.DetailAST
[checkstyle] Can't find/access AST Node typecom.puppycrawl.tools.checkstyle.api.DetailAST
[checkstyle] Can't find/access AST Node typecom.puppycrawl.tools.checkstyle.api.DetailAST
[checkstyle] Can't find/access AST Node typecom.puppycrawl.tools.checkstyle.api.DetailAST
[checkstyle] Can't find/access AST Node typecom.puppycrawl.tools.checkstyle.api.DetailAST
[checkstyle] Can't find/access AST Node typecom.puppycrawl.tools.checkstyle.api.DetailAST
[checkstyle] Can't find/access AST Node typecom.puppycrawl.tools.checkstyle.api.DetailAST
[checkstyle] Can't find/access AST Node typecom.puppycrawl.tools.checkstyle.api.DetailAST
[checkstyle] /home/benjamin/NetBeansProjects/hive2/hive_stringbuilder_patch/hive/hcatalog/src/test/e2e/hcatalog/udfs/java/org/apache/hcatalog/utils/ReadWrite.java:0: Got an exception - java.lang.ClassCastException: antlr.CommonAST cannot be cast to com.puppycrawl.tools.checkstyle.api.DetailAST
[checkstyle] /home/benjamin/NetBeansProjects/hive2/hive_stringbuilder_patch/hive/hcatalog/src/test/e2e/hcatalog/udfs/java/org/apache/hcatalog/utils/SimpleRead.java:0: Got an exception - java.lang.ClassCastException: antlr.CommonAST cannot be cast to com.puppycrawl.tools.checkstyle.api.DetailAST
[checkstyle] /home/benjamin/NetBeansProjects/hive2/hive_stringbuilder_patch/hive/hcatalog/src/test/e2e/hcatalog/udfs/java/org/apache/hcatalog/utils/StoreComplex.java:0: Got an exception - java.lang.ClassCastException: antlr.CommonAST cannot be cast to com.puppycrawl.tools.checkstyle.api.DetailAST
[checkstyle] /home/benjamin/NetBeansProjects/hive2/hive_stringbuilder_patch/hive/hcatalog/src/test/e2e/hcatalog/udfs/java/org/apache/hcatalog/utils/StoreDemo.java:0: Got an exception - java.lang.ClassCastException: antlr.CommonAST cannot be cast to com.puppycrawl.tools.checkstyle.api.DetailAST
[checkstyle] /home/benjamin/NetBeansProjects/hive2/hive_stringbuilder_patch/hive/hcatalog/src/test/e2e/hcatalog/udfs/java/org/apache/hcatalog/utils/StoreNumbers.java:0: Got an exception - java.lang.ClassCastException: antlr.CommonAST cannot be cast to com.puppycrawl.tools.checkstyle.api.DetailAST
[checkstyle] /home/benjamin/NetBeansProjects/hive2/hive_stringbuilder_patch/hive/hcatalog/src/test/e2e/hcatalog/udfs/java/org/apache/hcatalog/utils/SumNumbers.java:0: Got an exception - java.lang.ClassCastException: antlr.CommonAST cannot be cast to com.puppycrawl.tools.checkstyle.api.DetailAST
[checkstyle] /home/benjamin/NetBeansProjects/hive2/hive_stringbuilder_patch/hive/hcatalog/src/test/e2e/hcatalog/udfs/java/org/apache/hcatalog/utils/TypeDataCheck.java:0: Got an exception - java.lang.ClassCastException: antlr.CommonAST cannot be cast to com.puppycrawl.tools.checkstyle.api.DetailAST
[checkstyle] /home/benjamin/NetBeansProjects/hive2/hive_stringbuilder_patch/hive/hcatalog/src/test/e2e/hcatalog/udfs/java/org/apache/hcatalog/utils/Util.java:0: Got an exception - java.lang.ClassCastException: antlr.CommonAST cannot be cast to com.puppycrawl.tools.checkstyle.api.DetailAST
[checkstyle] /home/benjamin/NetBeansProjects/hive2/hive_stringbuilder_patch/hive/hcatalog/src/test/e2e/hcatalog/udfs/java/org/apache/hcatalog/utils/WriteJson.java:0: Got an exception - java.lang.ClassCastException: antlr.CommonAST cannot be cast to com.puppycrawl.tools.checkstyle.api.DetailAST
[checkstyle] /home/benjamin/NetBeansProjects/hive2/hive_stringbuilder_patch/hive/hcatalog/src/test/e2e/hcatalog/udfs/java/org/apache/hcatalog/utils/WriteRC.java:0: Got an exception - java.lang.ClassCastException: antlr.CommonAST cannot be cast to com.puppycrawl.tools.checkstyle.api.DetailAST
[checkstyle] /home/benjamin/NetBeansProjects/hive2/hive_stringbuilder_patch/hive/hcatalog/src/test/e2e/hcatalog/udfs/java/org/apache/hcatalog/utils/WriteText.java:0: Got an exception - java.lang.ClassCastException: antlr.CommonAST cannot be cast to com.puppycrawl.tools.checkstyle.api.DetailAST
[checkstyle] /home/benjamin/NetBeansProjects/hive2/hive_stringbuilder_patch/hive/hcatalog/src/test/e2e/hcatalog/udfs/java/org/apache/hcatalog/utils/WriteTextPartitioned.java:0: Got an exception - java.lang.ClassCastException: antlr.CommonAST cannot be cast to com.puppycrawl.tools.checkstyle.api.DetailAST
[checkstyle] /home/benjamin/NetBeansProjects/hive2/hive_stringbuilder_patch/hive/hcatalog/storage-handlers/hbase/src/java/org/apache/hcatalog/hbase/HBaseAuthorizationProvider.java:0: Got an exception - java.lang.ClassCastException: antlr.CommonAST cannot be cast to com.puppycrawl.tools.checkstyle.api.DetailAST
[checkstyle] /home/benjamin/NetBeansProjects/hive2/hive_stringbuilder_patch/hive/hcatalog/storage-handlers/hbase/src/java/org/apache/hcatalog/hbase/HBaseBaseOutputFormat.java:0: Got an exception - java.lang.ClassCastException: antlr.CommonAST cannot be cast to com.puppycrawl.tools.checkstyle.api.DetailAST
[checkstyle] /home/benjamin/NetBeansProjects/hive2/hive_stringbuilder_patch/hive/hcatalog/storage-handlers/hbase/src/java/org/apache/hcatalog/hbase/HBaseBulkOutputFormat.java:0: Got an exception - java.lang.ClassCastException: antlr.CommonAST cannot be cast to com.puppycrawl.tools.checkstyle.api.DetailAST
[checkstyle] /home/benjamin/NetBeansProjects/hive2/hive_stringbuilder_patch/hive/hcatalog/storage-handlers/hbase/src/java/org/apache/hcatalog/hbase/HBaseConstants.java:0: Got an exception - java.lang.ClassCastException: antlr.CommonAST cannot be cast to com.puppycrawl.tools.checkstyle.api.DetailAST
[checkstyle] /home/benjamin/NetBeansProjects/hive2/hive_stringbuilder_patch/hive/hcatalog/storage-handlers/hbase/src/java/org/apache/hcatalog/hbase/HBaseDirectOutputFormat.java:0: Got an exception - java.lang.ClassCastException: antlr.CommonAST cannot be cast to com.puppycrawl.tools.checkstyle.api.DetailAST
[checkstyle] /home/benjamin/NetBeansProjects/hive2/hive_stringbuilder_patch/hive/hcatalog/storage-handlers/hbase/src/java/org/apache/hcatalog/hbase/HBaseHCatStorageHandler.java:0: Got an exception - java.lang.ClassCastException: antlr.CommonAST cannot be cast to com.puppycrawl.tools.checkstyle.api.DetailAST
[checkstyle] /home/benjamin/NetBeansProjects/hive2/hive_stringbuilder_patch/hive/hcatalog/storage-handlers/hbase/src/java/org/apache/hcatalog/hbase/HBaseInputFormat.java:0: Got an exception - java.lang.ClassCastException: antlr.CommonAST cannot be cast to com.puppycrawl.tools.checkstyle.api.DetailAST
[checkstyle] /home/benjamin/NetBeansProjects/hive2/hive_stringbuilder_patch/hive/hcatalog/storage-handlers/hbase/src/java/org/apache/hcatalog/hbase/HBaseRevisionManagerUtil.java:0: Got an exception - java.lang.ClassCastException: antlr.CommonAST cannot be cast to com.puppycrawl.tools.checkstyle.api.DetailAST
[checkstyle] /home/benjamin/NetBeansProjects/hive2/hive_stringbuilder_patch/hive/hcatalog/storage-handlers/hbase/src/java/org/apache/hcatalog/hbase/HBaseUtil.java:0: Got an exception - java.lang.ClassCastException: antlr.CommonAST cannot be cast to com.puppycrawl.tools.checkstyle.api.DetailAST
[checkstyle] /home/benjamin/NetBeansProjects/hive2/hive_stringbuilder_patch/hive/hcatalog/storage-handlers/hbase/src/java/org/apache/hcatalog/hbase/HCatTableSnapshot.java:0: Got an exception - java.lang.ClassCastException: antlr.CommonAST cannot be cast to com.puppycrawl.tools.checkstyle.api.DetailAST
[checkstyle] /home/benjamin/NetBeansProjects/hive2/hive_stringbuilder_patch/hive/hcatalog/storage-handlers/hbase/src/java/org/apache/hcatalog/hbase/HbaseSnapshotRecordReader.java:0: Got an exception - java.lang.ClassCastException: antlr.CommonAST cannot be cast to com.puppycrawl.tools.checkstyle.api.DetailAST
[checkstyle] /home/benjamin/NetBeansProjects/hive2/hive_stringbuilder_patch/hive/hcatalog/storage-handlers/hbase/src/java/org/apache/hcatalog/hbase/ImportSequenceFile.java:0: Got an exception - java.lang.ClassCastException: antlr.CommonAST cannot be cast to com.puppycrawl.tools.checkstyle.api.DetailAST
[checkstyle] /home/benjamin/NetBeansProjects/hive2/hive_stringbuilder_patch/hive/hcatalog/storage-handlers/hbase/src/java/org/apache/hcatalog/hbase/ResultConverter.java:0: Got an exception - java.lang.ClassCastException: antlr.CommonAST cannot be cast to com.puppycrawl.tools.checkstyle.api.DetailAST
[checkstyle] /home/benjamin/NetBeansProjects/hive2/hive_stringbuilder_patch/hive/hcatalog/storage-handlers/hbase/src/java/org/apache/hcatalog/hbase/snapshot/FamilyRevision.java:0: Got an exception - java.lang.ClassCastException: antlr.CommonAST cannot be cast to com.puppycrawl.tools.checkstyle.api.DetailAST
[checkstyle] /home/benjamin/NetBeansProjects/hive2/hive_stringbuilder_patch/hive/hcatalog/storage-handlers/hbase/src/java/org/apache/hcatalog/hbase/snapshot/IDGenerator.java:0: Got an exception - java.lang.ClassCastException: antlr.CommonAST cannot be cast to com.puppycrawl.tools.checkstyle.api.DetailAST
[checkstyle] /home/benjamin/NetBeansProjects/hive2/hive_stringbuilder_patch/hive/hcatalog/storage-handlers/hbase/src/java/org/apache/hcatalog/hbase/snapshot/PathUtil.java:0: Got an exception - java.lang.ClassCastException: antlr.CommonAST cannot be cast to com.puppycrawl.tools.checkstyle.api.DetailAST
[checkstyle] /home/benjamin/NetBeansProjects/hive2/hive_stringbuilder_patch/hive/hcatalog/storage-handlers/hbase/src/java/org/apache/hcatalog/hbase/snapshot/RMConstants.java:0: Got an exception - java.lang.ClassCastException: antlr.CommonAST cannot be cast to com.puppycrawl.tools.checkstyle.api.DetailAST
[checkstyle] Can't find/access AST Node typecom.puppycrawl.tools.checkstyle.api.DetailAST
[checkstyle] Can't find/access AST Node typecom.puppycrawl.tools.checkstyle.api.DetailAST
[checkstyle] Can't find/access AST Node typecom.puppycrawl.tools.checkstyle.api.DetailAST
[checkstyle] Can't find/access AST Node typecom.puppycrawl.tools.checkstyle.api.DetailAST
[checkstyle] Can't find/access AST Node typecom.puppycrawl.tools.checkstyle.api.DetailAST
[checkstyle] Can't find/access AST Node typecom.puppycrawl.tools.checkstyle.api.DetailAST
[checkstyle] Can't find/access AST Node typecom.puppycrawl.tools.checkstyle.api.DetailAST
[checkstyle] Can't find/access AST Node typecom.puppycrawl.tools.checkstyle.api.DetailAST
[checkstyle] Can't find/access AST Node typecom.puppycrawl.tools.checkstyle.api.DetailAST
[checkstyle] Can't find/access AST Node typecom.puppycrawl.tools.checkstyle.api.DetailAST
[checkstyle] Can't find/access AST Node typecom.puppycrawl.tools.checkstyle.api.DetailAST
[checkstyle] Can't find/access AST Node typecom.puppycrawl.tools.checkstyle.api.DetailAST
[checkstyle] Can't find/access AST Node typecom.puppycrawl.tools.checkstyle.api.DetailAST
[checkstyle] Can't find/access AST Node typecom.puppycrawl.tools.checkstyle.api.DetailAST
[checkstyle] Can't find/access AST Node typecom.puppycrawl.tools.checkstyle.api.DetailAST
[checkstyle] Can't find/access AST Node typecom.puppycrawl.tools.checkstyle.api.DetailAST
[checkstyle] Can't find/access AST Node typecom.puppycrawl.tools.checkstyle.api.DetailAST
[checkstyle] Can't find/access AST Node typecom.puppycrawl.tools.checkstyle.api.DetailAST
[checkstyle] Can't find/access AST Node typecom.puppycrawl.tools.checkstyle.api.DetailAST
[checkstyle] Can't find/access AST Node typecom.puppycrawl.tools.checkstyle.api.DetailAST
[checkstyle] Can't find/access AST Node typecom.puppycrawl.tools.checkstyle.api.DetailAST
[checkstyle] Can't find/access AST Node typecom.puppycrawl.tools.checkstyle.api.DetailAST
[checkstyle] Can't find/access AST Node typecom.puppycrawl.tools.checkstyle.api.DetailAST
[checkstyle] Can't find/access AST Node typecom.puppycrawl.tools.checkstyle.api.DetailAST
[checkstyle] Can't find/access AST Node typecom.puppycrawl.tools.checkstyle.api.DetailAST
[checkstyle] Can't find/access AST Node typecom.puppycrawl.tools.checkstyle.api.DetailAST
[checkstyle] Can't find/access AST Node typecom.puppycrawl.tools.checkstyle.api.DetailAST
[checkstyle] Can't find/access AST Node typecom.puppycrawl.tools.checkstyle.api.DetailAST
[checkstyle] /home/benjamin/NetBeansProjects/hive2/hive_stringbuilder_patch/hive/hcatalog/storage-handlers/hbase/src/java/org/apache/hcatalog/hbase/snapshot/RevisionManager.java:0: Got an exception - java.lang.ClassCastException: antlr.CommonAST cannot be cast to com.puppycrawl.tools.checkstyle.api.DetailAST
[checkstyle] /home/benjamin/NetBeansProjects/hive2/hive_stringbuilder_patch/hive/hcatalog/storage-handlers/hbase/src/java/org/apache/hcatalog/hbase/snapshot/RevisionManagerConfiguration.java:0: Got an exception - java.lang.ClassCastException: antlr.CommonAST cannot be cast to com.puppycrawl.tools.checkstyle.api.DetailAST
[checkstyle] /home/benjamin/NetBeansProjects/hive2/hive_stringbuilder_patch/hive/hcatalog/storage-handlers/hbase/src/java/org/apache/hcatalog/hbase/snapshot/RevisionManagerEndpoint.java:0: Got an exception - java.lang.ClassCastException: antlr.CommonAST cannot be cast to com.puppycrawl.tools.checkstyle.api.DetailAST
[checkstyle] /home/benjamin/NetBeansProjects/hive2/hive_stringbuilder_patch/hive/hcatalog/storage-handlers/hbase/src/java/org/apache/hcatalog/hbase/snapshot/RevisionManagerEndpointClient.java:0: Got an exception - java.lang.ClassCastException: antlr.CommonAST cannot be cast to com.puppycrawl.tools.checkstyle.api.DetailAST
[checkstyle] /home/benjamin/NetBeansProjects/hive2/hive_stringbuilder_patch/hive/hcatalog/storage-handlers/hbase/src/java/org/apache/hcatalog/hbase/snapshot/RevisionManagerFactory.java:0: Got an exception - java.lang.ClassCastException: antlr.CommonAST cannot be cast to com.puppycrawl.tools.checkstyle.api.DetailAST
[checkstyle] /home/benjamin/NetBeansProjects/hive2/hive_stringbuilder_patch/hive/hcatalog/storage-handlers/hbase/src/java/org/apache/hcatalog/hbase/snapshot/RevisionManagerProtocol.java:0: Got an exception - java.lang.ClassCastException: antlr.CommonAST cannot be cast to com.puppycrawl.tools.checkstyle.api.DetailAST
[checkstyle] /home/benjamin/NetBeansProjects/hive2/hive_stringbuilder_patch/hive/hcatalog/storage-handlers/hbase/src/java/org/apache/hcatalog/hbase/snapshot/TableSnapshot.java:0: Got an exception - java.lang.ClassCastException: antlr.CommonAST cannot be cast to com.puppycrawl.tools.checkstyle.api.DetailAST
[checkstyle] /home/benjamin/NetBeansProjects/hive2/hive_stringbuilder_patch/hive/hcatalog/storage-handlers/hbase/src/java/org/apache/hcatalog/hbase/snapshot/Transaction.java:0: Got an exception - java.lang.ClassCastException: antlr.CommonAST cannot be cast to com.puppycrawl.tools.checkstyle.api.DetailAST
[checkstyle] /home/benjamin/NetBeansProjects/hive2/hive_stringbuilder_patch/hive/hcatalog/storage-handlers/hbase/src/java/org/apache/hcatalog/hbase/snapshot/ZKBasedRevisionManager.java:0: Got an exception - java.lang.ClassCastException: antlr.CommonAST cannot be cast to com.puppycrawl.tools.checkstyle.api.DetailAST
[checkstyle] /home/benjamin/NetBeansProjects/hive2/hive_stringbuilder_patch/hive/hcatalog/storage-handlers/hbase/src/java/org/apache/hcatalog/hbase/snapshot/ZKUtil.java:0: Got an exception - java.lang.ClassCastException: antlr.CommonAST cannot be cast to com.puppycrawl.tools.checkstyle.api.DetailAST
[checkstyle] /home/benjamin/NetBeansProjects/hive2/hive_stringbuilder_patch/hive/hcatalog/storage-handlers/hbase/src/java/org/apache/hcatalog/hbase/snapshot/lock/LockListener.java:0: Got an exception - java.lang.ClassCastException: antlr.CommonAST cannot be cast to com.puppycrawl.tools.checkstyle.api.DetailAST
[checkstyle] /home/benjamin/NetBeansProjects/hive2/hive_stringbuilder_patch/hive/hcatalog/storage-handlers/hbase/src/java/org/apache/hcatalog/hbase/snapshot/lock/ProtocolSupport.java:0: Got an exception - java.lang.ClassCastException: antlr.CommonAST cannot be cast to com.puppycrawl.tools.checkstyle.api.DetailAST
[checkstyle] /home/benjamin/NetBeansProjects/hive2/hive_stringbuilder_patch/hive/hcatalog/storage-handlers/hbase/src/java/org/apache/hcatalog/hbase/snapshot/lock/WriteLock.java:0: Got an exception - java.lang.ClassCastException: antlr.CommonAST cannot be cast to com.puppycrawl.tools.checkstyle.api.DetailAST
[checkstyle] /home/benjamin/NetBeansProjects/hive2/hive_stringbuilder_patch/hive/hcatalog/storage-handlers/hbase/src/java/org/apache/hcatalog/hbase/snapshot/lock/ZNodeName.java:0: Got an exception - java.lang.ClassCastException: antlr.CommonAST cannot be cast to com.puppycrawl.tools.checkstyle.api.DetailAST
[checkstyle] /home/benjamin/NetBeansProjects/hive2/hive_stringbuilder_patch/hive/hcatalog/storage-handlers/hbase/src/java/org/apache/hcatalog/hbase/snapshot/lock/ZooKeeperOperation.java:0: Got an exception - java.lang.ClassCastException: antlr.CommonAST cannot be cast to com.puppycrawl.tools.checkstyle.api.DetailAST
[checkstyle] /home/benjamin/NetBeansProjects/hive2/hive_stringbuilder_patch/hive/hcatalog/storage-handlers/hbase/src/java/org/apache/hcatalog/hbase/snapshot/package-info.java:0: Got an exception - java.lang.ClassCastException: antlr.CommonAST cannot be cast to com.puppycrawl.tools.checkstyle.api.DetailAST
[checkstyle] /home/benjamin/NetBeansProjects/hive2/hive_stringbuilder_patch/hive/hcatalog/storage-handlers/hbase/src/test/org/apache/hcatalog/hbase/ManyMiniCluster.java:0: Got an exception - java.lang.ClassCastException: antlr.CommonAST cannot be cast to com.puppycrawl.tools.checkstyle.api.DetailAST
[checkstyle] /home/benjamin/NetBeansProjects/hive2/hive_stringbuilder_patch/hive/hcatalog/storage-handlers/hbase/src/test/org/apache/hcatalog/hbase/SkeletonHBaseTest.java:0: Got an exception - java.lang.ClassCastException: antlr.CommonAST cannot be cast to com.puppycrawl.tools.checkstyle.api.DetailAST
[checkstyle] /home/benjamin/NetBeansProjects/hive2/hive_stringbuilder_patch/hive/hcatalog/storage-handlers/hbase/src/test/org/apache/hcatalog/hbase/TestHBaseBulkOutputFormat.java:0: Got an exception - java.lang.ClassCastException: antlr.CommonAST cannot be cast to com.puppycrawl.tools.checkstyle.api.DetailAST
[checkstyle] /home/benjamin/NetBeansProjects/hive2/hive_stringbuilder_patch/hive/hcatalog/storage-handlers/hbase/src/test/org/apache/hcatalog/hbase/TestHBaseDirectOutputFormat.java:0: Got an exception - java.lang.ClassCastException: antlr.CommonAST cannot be cast to com.puppycrawl.tools.checkstyle.api.DetailAST
[checkstyle] /home/benjamin/NetBeansProjects/hive2/hive_stringbuilder_patch/hive/hcatalog/storage-handlers/hbase/src/test/org/apache/hcatalog/hbase/TestHBaseHCatStorageHandler.java:0: Got an exception - java.lang.ClassCastException: antlr.CommonAST cannot be cast to com.puppycrawl.tools.checkstyle.api.DetailAST
[checkstyle] /home/benjamin/NetBeansProjects/hive2/hive_stringbuilder_patch/hive/hcatalog/storage-handlers/hbase/src/test/org/apache/hcatalog/hbase/TestHBaseInputFormat.java:0: Got an exception - java.lang.ClassCastException: antlr.CommonAST cannot be cast to com.puppycrawl.tools.checkstyle.api.DetailAST
[checkstyle] /home/benjamin/NetBeansProjects/hive2/hive_stringbuilder_patch/hive/hcatalog/storage-handlers/hbase/src/test/org/apache/hcatalog/hbase/TestSnapshots.java:0: Got an exception - java.lang.ClassCastException: antlr.CommonAST cannot be cast to com.puppycrawl.tools.checkstyle.api.DetailAST
[checkstyle] /home/benjamin/NetBeansProjects/hive2/hive_stringbuilder_patch/hive/hcatalog/storage-handlers/hbase/src/test/org/apache/hcatalog/hbase/snapshot/IDGenClient.java:0: Got an exception - java.lang.ClassCastException: antlr.CommonAST cannot be cast to com.puppycrawl.tools.checkstyle.api.DetailAST
[checkstyle] /home/benjamin/NetBeansProjects/hive2/hive_stringbuilder_patch/hive/hcatalog/storage-handlers/hbase/src/test/org/apache/hcatalog/hbase/snapshot/TestIDGenerator.java:0: Got an exception - java.lang.ClassCastException: antlr.CommonAST cannot be cast to com.puppycrawl.tools.checkstyle.api.DetailAST
[checkstyle] /home/benjamin/NetBeansProjects/hive2/hive_stringbuilder_patch/hive/hcatalog/storage-handlers/hbase/src/test/org/apache/hcatalog/hbase/snapshot/TestRevisionManager.java:0: Got an exception - java.lang.ClassCastException: antlr.CommonAST cannot be cast to com.puppycrawl.tools.checkstyle.api.DetailAST
[checkstyle] /home/benjamin/NetBeansProjects/hive2/hive_stringbuilder_patch/hive/hcatalog/storage-handlers/hbase/src/test/org/apache/hcatalog/hbase/snapshot/TestRevisionManagerConfiguration.java:0: Got an exception - java.lang.ClassCastException: antlr.CommonAST cannot be cast to com.puppycrawl.tools.checkstyle.api.DetailAST
[checkstyle] Can't find/access AST Node typecom.puppycrawl.tools.checkstyle.api.DetailAST
[checkstyle] Can't find/access AST Node typecom.puppycrawl.tools.checkstyle.api.DetailAST
[checkstyle] Can't find/access AST Node typecom.puppycrawl.tools.checkstyle.api.DetailAST
[checkstyle] Can't find/access AST Node typecom.puppycrawl.tools.checkstyle.api.DetailAST
[checkstyle] Can't find/access AST Node typecom.puppycrawl.tools.checkstyle.api.DetailAST
[checkstyle] Can't find/access AST Node typecom.puppycrawl.tools.checkstyle.api.DetailAST
[checkstyle] Can't find/access AST Node typecom.puppycrawl.tools.checkstyle.api.DetailAST
[checkstyle] Can't find/access AST Node typecom.puppycrawl.tools.checkstyle.api.DetailAST
[checkstyle] Can't find/access AST Node typecom.puppycrawl.tools.checkstyle.api.DetailAST
[checkstyle] Can't find/access AST Node typecom.puppycrawl.tools.checkstyle.api.DetailAST
[checkstyle] Can't find/access AST Node typecom.puppycrawl.tools.checkstyle.api.DetailAST
[checkstyle] Can't find/access AST Node typecom.puppycrawl.tools.checkstyle.api.DetailAST
[checkstyle] Can't find/access AST Node typecom.puppycrawl.tools.checkstyle.api.DetailAST
[checkstyle] Can't find/access AST Node typecom.puppycrawl.tools.checkstyle.api.DetailAST
[checkstyle] Can't find/access AST Node typecom.puppycrawl.tools.checkstyle.api.DetailAST
[checkstyle] Can't find/access AST Node typecom.puppycrawl.tools.checkstyle.api.DetailAST
[checkstyle] Can't find/access AST Node typecom.puppycrawl.tools.checkstyle.api.DetailAST
[checkstyle] Can't find/access AST Node typecom.puppycrawl.tools.checkstyle.api.DetailAST
[checkstyle] Can't find/access AST Node typecom.puppycrawl.tools.checkstyle.api.DetailAST
[checkstyle] Can't find/access AST Node typecom.puppycrawl.tools.checkstyle.api.DetailAST
[checkstyle] Can't find/access AST Node typecom.puppycrawl.tools.checkstyle.api.DetailAST
[checkstyle] Can't find/access AST Node typecom.puppycrawl.tools.checkstyle.api.DetailAST
[checkstyle] Can't find/access AST Node typecom.puppycrawl.tools.checkstyle.api.DetailAST
[checkstyle] Can't find/access AST Node typecom.puppycrawl.tools.checkstyle.api.DetailAST
[checkstyle] Can't find/access AST Node typecom.puppycrawl.tools.checkstyle.api.DetailAST
[checkstyle] Can't find/access AST Node typecom.puppycrawl.tools.checkstyle.api.DetailAST
[checkstyle] Can't find/access AST Node typecom.puppycrawl.tools.checkstyle.api.DetailAST
[checkstyle] Can't find/access AST Node typecom.puppycrawl.tools.checkstyle.api.DetailAST
[checkstyle] Can't find/access AST Node typecom.puppycrawl.tools.checkstyle.api.DetailAST
[checkstyle] /home/benjamin/NetBeansProjects/hive2/hive_stringbuilder_patch/hive/hcatalog/storage-handlers/hbase/src/test/org/apache/hcatalog/hbase/snapshot/TestRevisionManagerEndpoint.java:0: Got an exception - java.lang.ClassCastException: antlr.CommonAST cannot be cast to com.puppycrawl.tools.checkstyle.api.DetailAST
[checkstyle] /home/benjamin/NetBeansProjects/hive2/hive_stringbuilder_patch/hive/hcatalog/storage-handlers/hbase/src/test/org/apache/hcatalog/hbase/snapshot/TestThriftSerialization.java:0: Got an exception - java.lang.ClassCastException: antlr.CommonAST cannot be cast to com.puppycrawl.tools.checkstyle.api.DetailAST
[checkstyle] /home/benjamin/NetBeansProjects/hive2/hive_stringbuilder_patch/hive/hcatalog/storage-handlers/hbase/src/test/org/apache/hcatalog/hbase/snapshot/TestZNodeSetUp.java:0: Got an exception - java.lang.ClassCastException: antlr.CommonAST cannot be cast to com.puppycrawl.tools.checkstyle.api.DetailAST
[checkstyle] /home/benjamin/NetBeansProjects/hive2/hive_stringbuilder_patch/hive/hcatalog/storage-handlers/hbase/src/test/org/apache/hcatalog/hbase/snapshot/lock/TestWriteLock.java:0: Got an exception - java.lang.ClassCastException: antlr.CommonAST cannot be cast to com.puppycrawl.tools.checkstyle.api.DetailAST
[checkstyle] /home/benjamin/NetBeansProjects/hive2/hive_stringbuilder_patch/hive/hcatalog/storage-handlers/hbase/src/test/org/apache/hcatalog/hbase/snapshot/lock/TestZNodeName.java:0: Got an exception - java.lang.ClassCastException: antlr.CommonAST cannot be cast to com.puppycrawl.tools.checkstyle.api.DetailAST
[checkstyle] /home/benjamin/NetBeansProjects/hive2/hive_stringbuilder_patch/hive/hcatalog/webhcat/java-client/src/main/java/org/apache/hcatalog/api/ConnectionFailureException.java:0: Got an exception - java.lang.ClassCastException: antlr.CommonAST cannot be cast to com.puppycrawl.tools.checkstyle.api.DetailAST
[checkstyle] /home/benjamin/NetBeansProjects/hive2/hive_stringbuilder_patch/hive/hcatalog/webhcat/java-client/src/main/java/org/apache/hcatalog/api/HCatAddPartitionDesc.java:0: Got an exception - java.lang.ClassCastException: antlr.CommonAST cannot be cast to com.puppycrawl.tools.checkstyle.api.DetailAST
[checkstyle] /home/benjamin/NetBeansProjects/hive2/hive_stringbuilder_patch/hive/hcatalog/webhcat/java-client/src/main/java/org/apache/hcatalog/api/HCatClient.java:0: Got an exception - java.lang.ClassCastException: antlr.CommonAST cannot be cast to com.puppycrawl.tools.checkstyle.api.DetailAST
[checkstyle] /home/benjamin/NetBeansProjects/hive2/hive_stringbuilder_patch/hive/hcatalog/webhcat/java-client/src/main/java/org/apache/hcatalog/api/HCatClientHMSImpl.java:0: Got an exception - java.lang.ClassCastException: antlr.CommonAST cannot be cast to com.puppycrawl.tools.checkstyle.api.DetailAST
[checkstyle] /home/benjamin/NetBeansProjects/hive2/hive_stringbuilder_patch/hive/hcatalog/webhcat/java-client/src/main/java/org/apache/hcatalog/api/HCatCreateDBDesc.java:0: Got an exception - java.lang.ClassCastException: antlr.CommonAST cannot be cast to com.puppycrawl.tools.checkstyle.api.DetailAST
[checkstyle] /home/benjamin/NetBeansProjects/hive2/hive_stringbuilder_patch/hive/hcatalog/webhcat/java-client/src/main/java/org/apache/hcatalog/api/HCatCreateTableDesc.java:0: Got an exception - java.lang.ClassCastException: antlr.CommonAST cannot be cast to com.puppycrawl.tools.checkstyle.api.DetailAST
[checkstyle] /home/benjamin/NetBeansProjects/hive2/hive_stringbuilder_patch/hive/hcatalog/webhcat/java-client/src/main/java/org/apache/hcatalog/api/HCatDatabase.java:0: Got an exception - java.lang.ClassCastException: antlr.CommonAST cannot be cast to com.puppycrawl.tools.checkstyle.api.DetailAST
[checkstyle] /home/benjamin/NetBeansProjects/hive2/hive_stringbuilder_patch/hive/hcatalog/webhcat/java-client/src/main/java/org/apache/hcatalog/api/HCatPartition.java:0: Got an exception - java.lang.ClassCastException: antlr.CommonAST cannot be cast to com.puppycrawl.tools.checkstyle.api.DetailAST
[checkstyle] /home/benjamin/NetBeansProjects/hive2/hive_stringbuilder_patch/hive/hcatalog/webhcat/java-client/src/main/java/org/apache/hcatalog/api/HCatTable.java:0: Got an exception - java.lang.ClassCastException: antlr.CommonAST cannot be cast to com.puppycrawl.tools.checkstyle.api.DetailAST
[checkstyle] /home/benjamin/NetBeansProjects/hive2/hive_stringbuilder_patch/hive/hcatalog/webhcat/java-client/src/main/java/org/apache/hcatalog/api/ObjectNotFoundException.java:0: Got an exception - java.lang.ClassCastException: antlr.CommonAST cannot be cast to com.puppycrawl.tools.checkstyle.api.DetailAST
[checkstyle] /home/benjamin/NetBeansProjects/hive2/hive_stringbuilder_patch/hive/hcatalog/webhcat/java-client/src/test/java/org/apache/hcatalog/api/TestHCatClient.java:0: Got an exception - java.lang.ClassCastException: antlr.CommonAST cannot be cast to com.puppycrawl.tools.checkstyle.api.DetailAST
[checkstyle] /home/benjamin/NetBeansProjects/hive2/hive_stringbuilder_patch/hive/hcatalog/webhcat/svr/src/main/java/org/apache/hcatalog/templeton/AppConfig.java:0: Got an exception - java.lang.ClassCastException: antlr.CommonAST cannot be cast to com.puppycrawl.tools.checkstyle.api.DetailAST
[checkstyle] /home/benjamin/NetBeansProjects/hive2/hive_stringbuilder_patch/hive/hcatalog/webhcat/svr/src/main/java/org/apache/hcatalog/templeton/BadParam.java:0: Got an exception - java.lang.ClassCastException: antlr.CommonAST cannot be cast to com.puppycrawl.tools.checkstyle.api.DetailAST
[checkstyle] /home/benjamin/NetBeansProjects/hive2/hive_stringbuilder_patch/hive/hcatalog/webhcat/svr/src/main/java/org/apache/hcatalog/templeton/BusyException.java:0: Got an exception - java.lang.ClassCastException: antlr.CommonAST cannot be cast to com.puppycrawl.tools.checkstyle.api.DetailAST
[checkstyle] /home/benjamin/NetBeansProjects/hive2/hive_stringbuilder_patch/hive/hcatalog/webhcat/svr/src/main/java/org/apache/hcatalog/templeton/CallbackFailedException.java:0: Got an exception - java.lang.ClassCastException: antlr.CommonAST cannot be cast to com.puppycrawl.tools.checkstyle.api.DetailAST
[checkstyle] /home/benjamin/NetBeansProjects/hive2/hive_stringbuilder_patch/hive/hcatalog/webhcat/svr/src/main/java/org/apache/hcatalog/templeton/CatchallExceptionMapper.java:0: Got an exception - java.lang.ClassCastException: antlr.CommonAST cannot be cast to com.puppycrawl.tools.checkstyle.api.DetailAST
[checkstyle] /home/benjamin/NetBeansProjects/hive2/hive_stringbuilder_patch/hive/hcatalog/webhcat/svr/src/main/java/org/apache/hcatalog/templeton/ColumnDesc.java:0: Got an exception - java.lang.ClassCastException: antlr.CommonAST cannot be cast to com.puppycrawl.tools.checkstyle.api.DetailAST
[checkstyle] /home/benjamin/NetBeansProjects/hive2/hive_stringbuilder_patch/hive/hcatalog/webhcat/svr/src/main/java/org/apache/hcatalog/templeton/CompleteBean.java:0: Got an exception - java.lang.ClassCastException: antlr.CommonAST cannot be cast to com.puppycrawl.tools.checkstyle.api.DetailAST
[checkstyle] /home/benjamin/NetBeansProjects/hive2/hive_stringbuilder_patch/hive/hcatalog/webhcat/svr/src/main/java/org/apache/hcatalog/templeton/CompleteDelegator.java:0: Got an exception - java.lang.ClassCastException: antlr.CommonAST cannot be cast to com.puppycrawl.tools.checkstyle.api.DetailAST
[checkstyle] /home/benjamin/NetBeansProjects/hive2/hive_stringbuilder_patch/hive/hcatalog/webhcat/svr/src/main/java/org/apache/hcatalog/templeton/DatabaseDesc.java:0: Got an exception - java.lang.ClassCastException: antlr.CommonAST cannot be cast to com.puppycrawl.tools.checkstyle.api.DetailAST
[checkstyle] /home/benjamin/NetBeansProjects/hive2/hive_stringbuilder_patch/hive/hcatalog/webhcat/svr/src/main/java/org/apache/hcatalog/templeton/DeleteDelegator.java:0: Got an exception - java.lang.ClassCastException: antlr.CommonAST cannot be cast to com.puppycrawl.tools.checkstyle.api.DetailAST
[checkstyle] /home/benjamin/NetBeansProjects/hive2/hive_stringbuilder_patch/hive/hcatalog/webhcat/svr/src/main/java/org/apache/hcatalog/templeton/EnqueueBean.java:0: Got an exception - java.lang.ClassCastException: antlr.CommonAST cannot be cast to com.puppycrawl.tools.checkstyle.api.DetailAST
[checkstyle] /home/benjamin/NetBeansProjects/hive2/hive_stringbuilder_patch/hive/hcatalog/webhcat/svr/src/main/java/org/apache/hcatalog/templeton/ExecBean.java:0: Got an exception - java.lang.ClassCastException: antlr.CommonAST cannot be cast to com.puppycrawl.tools.checkstyle.api.DetailAST
[checkstyle] Can't find/access AST Node typecom.puppycrawl.tools.checkstyle.api.DetailAST
[checkstyle] Can't find/access AST Node typecom.puppycrawl.tools.checkstyle.api.DetailAST
[checkstyle] Can't find/access AST Node typecom.puppycrawl.tools.checkstyle.api.DetailAST
[checkstyle] Can't find/access AST Node typecom.puppycrawl.tools.checkstyle.api.DetailAST
[checkstyle] Can't find/access AST Node typecom.puppycrawl.tools.checkstyle.api.DetailAST
[checkstyle] Can't find/access AST Node typecom.puppycrawl.tools.checkstyle.api.DetailAST
[checkstyle] Can't find/access AST Node typecom.puppycrawl.tools.checkstyle.api.DetailAST
[checkstyle] Can't find/access AST Node typecom.puppycrawl.tools.checkstyle.api.DetailAST
[checkstyle] Can't find/access AST Node typecom.puppycrawl.tools.checkstyle.api.DetailAST
[checkstyle] Can't find/access AST Node typecom.puppycrawl.tools.checkstyle.api.DetailAST
[checkstyle] Can't find/access AST Node typecom.puppycrawl.tools.checkstyle.api.DetailAST
[checkstyle] Can't find/access AST Node typecom.puppycrawl.tools.checkstyle.api.DetailAST
[checkstyle] Can't find/access AST Node typecom.puppycrawl.tools.checkstyle.api.DetailAST
[checkstyle] Can't find/access AST Node typecom.puppycrawl.tools.checkstyle.api.DetailAST
[checkstyle] Can't find/access AST Node typecom.puppycrawl.tools.checkstyle.api.DetailAST
[checkstyle] Can't find/access AST Node typecom.puppycrawl.tools.checkstyle.api.DetailAST
[checkstyle] Can't find/access AST Node typecom.puppycrawl.tools.checkstyle.api.DetailAST
[checkstyle] Can't find/access AST Node typecom.puppycrawl.tools.checkstyle.api.DetailAST
[checkstyle] Can't find/access AST Node typecom.puppycrawl.tools.checkstyle.api.DetailAST
[checkstyle] Can't find/access AST Node typecom.puppycrawl.tools.checkstyle.api.DetailAST
[checkstyle] Can't find/access AST Node typecom.puppycrawl.tools.checkstyle.api.DetailAST
[checkstyle] /home/benjamin/NetBeansProjects/hive2/hive_stringbuilder_patch/hive/hcatalog/webhcat/svr/src/main/java/org/apache/hcatalog/templeton/ExecService.java:0: Got an exception - java.lang.ClassCastException: antlr.CommonAST cannot be cast to com.puppycrawl.tools.checkstyle.api.DetailAST
[checkstyle] /home/benjamin/NetBeansProjects/hive2/hive_stringbuilder_patch/hive/hcatalog/webhcat/svr/src/main/java/org/apache/hcatalog/templeton/ExecServiceImpl.java:0: Got an exception - java.lang.ClassCastException: antlr.CommonAST cannot be cast to com.puppycrawl.tools.checkstyle.api.DetailAST
[checkstyle] /home/benjamin/NetBeansProjects/hive2/hive_stringbuilder_patch/hive/hcatalog/webhcat/svr/src/main/java/org/apache/hcatalog/templeton/GroupPermissionsDesc.java:0: Got an exception - java.lang.ClassCastException: antlr.CommonAST cannot be cast to com.puppycrawl.tools.checkstyle.api.DetailAST
[checkstyle] /home/benjamin/NetBeansProjects/hive2/hive_stringbuilder_patch/hive/hcatalog/webhcat/svr/src/main/java/org/apache/hcatalog/templeton/HcatDelegator.java:0: Got an exception - java.lang.ClassCastException: antlr.CommonAST cannot be cast to com.puppycrawl.tools.checkstyle.api.DetailAST
[checkstyle] /home/benjamin/NetBeansProjects/hive2/hive_stringbuilder_patch/hive/hcatalog/webhcat/svr/src/main/java/org/apache/hcatalog/templeton/HcatException.java:0: Got an exception - java.lang.ClassCastException: antlr.CommonAST cannot be cast to com.puppycrawl.tools.checkstyle.api.DetailAST
[checkstyle] /home/benjamin/NetBeansProjects/hive2/hive_stringbuilder_patch/hive/hcatalog/webhcat/svr/src/main/java/org/apache/hcatalog/templeton/HiveDelegator.java:0: Got an exception - java.lang.ClassCastException: antlr.CommonAST cannot be cast to com.puppycrawl.tools.checkstyle.api.DetailAST
[checkstyle] /home/benjamin/NetBeansProjects/hive2/hive_stringbuilder_patch/hive/hcatalog/webhcat/svr/src/main/java/org/apache/hcatalog/templeton/JarDelegator.java:0: Got an exception - java.lang.ClassCastException: antlr.CommonAST cannot be cast to com.puppycrawl.tools.checkstyle.api.DetailAST
[checkstyle] /home/benjamin/NetBeansProjects/hive2/hive_stringbuilder_patch/hive/hcatalog/webhcat/svr/src/main/java/org/apache/hcatalog/templeton/JsonBuilder.java:0: Got an exception - java.lang.ClassCastException: antlr.CommonAST cannot be cast to com.puppycrawl.tools.checkstyle.api.DetailAST
[checkstyle] /home/benjamin/NetBeansProjects/hive2/hive_stringbuilder_patch/hive/hcatalog/webhcat/svr/src/main/java/org/apache/hcatalog/templeton/LauncherDelegator.java:0: Got an exception - java.lang.ClassCastException: antlr.CommonAST cannot be cast to com.puppycrawl.tools.checkstyle.api.DetailAST
[checkstyle] /home/benjamin/NetBeansProjects/hive2/hive_stringbuilder_patch/hive/hcatalog/webhcat/svr/src/main/java/org/apache/hcatalog/templeton/ListDelegator.java:0: Got an exception - java.lang.ClassCastException: antlr.CommonAST cannot be cast to com.puppycrawl.tools.checkstyle.api.DetailAST
[checkstyle] /home/benjamin/NetBeansProjects/hive2/hive_stringbuilder_patch/hive/hcatalog/webhcat/svr/src/main/java/org/apache/hcatalog/templeton/Main.java:0: Got an exception - java.lang.ClassCastException: antlr.CommonAST cannot be cast to com.puppycrawl.tools.checkstyle.api.DetailAST
[checkstyle] /home/benjamin/NetBeansProjects/hive2/hive_stringbuilder_patch/hive/hcatalog/webhcat/svr/src/main/java/org/apache/hcatalog/templeton/MaxByteArrayOutputStream.java:0: Got an exception - java.lang.ClassCastException: antlr.CommonAST cannot be cast to com.puppycrawl.tools.checkstyle.api.DetailAST
[checkstyle] /home/benjamin/NetBeansProjects/hive2/hive_stringbuilder_patch/hive/hcatalog/webhcat/svr/src/main/java/org/apache/hcatalog/templeton/NotAuthorizedException.java:0: Got an exception - java.lang.ClassCastException: antlr.CommonAST cannot be cast to com.puppycrawl.tools.checkstyle.api.DetailAST
[checkstyle] /home/benjamin/NetBeansProjects/hive2/hive_stringbuilder_patch/hive/hcatalog/webhcat/svr/src/main/java/org/apache/hcatalog/templeton/PartitionDesc.java:0: Got an exception - java.lang.ClassCastException: antlr.CommonAST cannot be cast to com.puppycrawl.tools.checkstyle.api.DetailAST
[checkstyle] /home/benjamin/NetBeansProjects/hive2/hive_stringbuilder_patch/hive/hcatalog/webhcat/svr/src/main/java/org/apache/hcatalog/templeton/PigDelegator.java:0: Got an exception - java.lang.ClassCastException: antlr.CommonAST cannot be cast to com.puppycrawl.tools.checkstyle.api.DetailAST
[checkstyle] /home/benjamin/NetBeansProjects/hive2/hive_stringbuilder_patch/hive/hcatalog/webhcat/svr/src/main/java/org/apache/hcatalog/templeton/QueueException.java:0: Got an exception - java.lang.ClassCastException: antlr.CommonAST cannot be cast to com.puppycrawl.tools.checkstyle.api.DetailAST
[checkstyle] /home/benjamin/NetBeansProjects/hive2/hive_stringbuilder_patch/hive/hcatalog/webhcat/svr/src/main/java/org/apache/hcatalog/templeton/QueueStatusBean.java:0: Got an exception - java.lang.ClassCastException: antlr.CommonAST cannot be cast to com.puppycrawl.tools.checkstyle.api.DetailAST
[checkstyle] /home/benjamin/NetBeansProjects/hive2/hive_stringbuilder_patch/hive/hcatalog/webhcat/svr/src/main/java/org/apache/hcatalog/templeton/SecureProxySupport.java:0: Got an exception - java.lang.ClassCastException: antlr.CommonAST cannot be cast to com.puppycrawl.tools.checkstyle.api.DetailAST
[checkstyle] /home/benjamin/NetBeansProjects/hive2/hive_stringbuilder_patch/hive/hcatalog/webhcat/svr/src/main/java/org/apache/hcatalog/templeton/Server.java:0: Got an exception - java.lang.ClassCastException: antlr.CommonAST cannot be cast to com.puppycrawl.tools.checkstyle.api.DetailAST
[checkstyle] /home/benjamin/NetBeansProjects/hive2/hive_stringbuilder_patch/hive/hcatalog/webhcat/svr/src/main/java/org/apache/hcatalog/templeton/SimpleExceptionMapper.java:0: Got an exception - java.lang.ClassCastException: antlr.CommonAST cannot be cast to com.puppycrawl.tools.checkstyle.api.DetailAST
[checkstyle] /home/benjamin/NetBeansProjects/hive2/hive_stringbuilder_patch/hive/hcatalog/webhcat/svr/src/main/java/org/apache/hcatalog/templeton/SimpleWebException.java:0: Got an exception - java.lang.ClassCastException: antlr.CommonAST cannot be cast to com.puppycrawl.tools.checkstyle.api.DetailAST
[checkstyle] /home/benjamin/NetBeansProjects/hive2/hive_stringbuilder_patch/hive/hcatalog/webhcat/svr/src/main/java/org/apache/hcatalog/templeton/StatusDelegator.java:0: Got an exception - java.lang.ClassCastException: antlr.CommonAST cannot be cast to com.puppycrawl.tools.checkstyle.api.DetailAST
[checkstyle] /home/benjamin/NetBeansProjects/hive2/hive_stringbuilder_patch/hive/hcatalog/webhcat/svr/src/main/java/org/apache/hcatalog/templeton/StreamingDelegator.java:0: Got an exception - java.lang.ClassCastException: antlr.CommonAST cannot be cast to com.puppycrawl.tools.checkstyle.api.DetailAST
[checkstyle] /home/benjamin/NetBeansProjects/hive2/hive_stringbuilder_patch/hive/hcatalog/webhcat/svr/src/main/java/org/apache/hcatalog/templeton/TableDesc.java:0: Got an exception - java.lang.ClassCastException: antlr.CommonAST cannot be cast to com.puppycrawl.tools.checkstyle.api.DetailAST
[checkstyle] /home/benjamin/NetBeansProjects/hive2/hive_stringbuilder_patch/hive/hcatalog/webhcat/svr/src/main/java/org/apache/hcatalog/templeton/TableLikeDesc.java:0: Got an exception - java.lang.ClassCastException: antlr.CommonAST cannot be cast to com.puppycrawl.tools.checkstyle.api.DetailAST
[checkstyle] /home/benjamin/NetBeansProjects/hive2/hive_stringbuilder_patch/hive/hcatalog/webhcat/svr/src/main/java/org/apache/hcatalog/templeton/TablePropertyDesc.java:0: Got an exception - java.lang.ClassCastException: antlr.CommonAST cannot be cast to com.puppycrawl.tools.checkstyle.api.DetailAST
[checkstyle] /home/benjamin/NetBeansProjects/hive2/hive_stringbuilder_patch/hive/hcatalog/webhcat/svr/src/main/java/org/apache/hcatalog/templeton/TempletonDelegator.java:0: Got an exception - java.lang.ClassCastException: antlr.CommonAST cannot be cast to com.puppycrawl.tools.checkstyle.api.DetailAST
[checkstyle] /home/benjamin/NetBeansProjects/hive2/hive_stringbuilder_patch/hive/hcatalog/webhcat/svr/src/main/java/org/apache/hcatalog/templeton/UgiFactory.java:0: Got an exception - java.lang.ClassCastException: antlr.CommonAST cannot be cast to com.puppycrawl.tools.checkstyle.api.DetailAST
[checkstyle] /home/benjamin/NetBeansProjects/hive2/hive_stringbuilder_patch/hive/hcatalog/webhcat/svr/src/main/java/org/apache/hcatalog/templeton/WadlConfig.java:0: Got an exception - java.lang.ClassCastException: antlr.CommonAST cannot be cast to com.puppycrawl.tools.checkstyle.api.DetailAST
[checkstyle] /home/benjamin/NetBeansProjects/hive2/hive_stringbuilder_patch/hive/hcatalog/webhcat/svr/src/main/java/org/apache/hcatalog/templeton/tool/HDFSCleanup.java:0: Got an exception - java.lang.ClassCastException: antlr.CommonAST cannot be cast to com.puppycrawl.tools.checkstyle.api.DetailAST
[checkstyle] /home/benjamin/NetBeansProjects/hive2/hive_stringbuilder_patch/hive/hcatalog/webhcat/svr/src/main/java/org/apache/hcatalog/templeton/tool/HDFSStorage.java:0: Got an exception - java.lang.ClassCastException: antlr.CommonAST cannot be cast to com.puppycrawl.tools.checkstyle.api.DetailAST
[checkstyle] /home/benjamin/NetBeansProjects/hive2/hive_stringbuilder_patch/hive/hcatalog/webhcat/svr/src/main/java/org/apache/hcatalog/templeton/tool/JobState.java:0: Got an exception - java.lang.ClassCastException: antlr.CommonAST cannot be cast to com.puppycrawl.tools.checkstyle.api.DetailAST
[checkstyle] /home/benjamin/NetBeansProjects/hive2/hive_stringbuilder_patch/hive/hcatalog/webhcat/svr/src/main/java/org/apache/hcatalog/templeton/tool/JobStateTracker.java:0: Got an exception - java.lang.ClassCastException: antlr.CommonAST cannot be cast to com.puppycrawl.tools.checkstyle.api.DetailAST
[checkstyle] /home/benjamin/NetBeansProjects/hive2/hive_stringbuilder_patch/hive/hcatalog/webhcat/svr/src/main/java/org/apache/hcatalog/templeton/tool/NotFoundException.java:0: Got an exception - java.lang.ClassCastException: antlr.CommonAST cannot be cast to com.puppycrawl.tools.checkstyle.api.DetailAST
[checkstyle] /home/benjamin/NetBeansProjects/hive2/hive_stringbuilder_patch/hive/hcatalog/webhcat/svr/src/main/java/org/apache/hcatalog/templeton/tool/NullRecordReader.java:0: Got an exception - java.lang.ClassCastException: antlr.CommonAST cannot be cast to com.puppycrawl.tools.checkstyle.api.DetailAST
[checkstyle] /home/benjamin/NetBeansProjects/hive2/hive_stringbuilder_patch/hive/hcatalog/webhcat/svr/src/main/java/org/apache/hcatalog/templeton/tool/NullSplit.java:0: Got an exception - java.lang.ClassCastException: antlr.CommonAST cannot be cast to com.puppycrawl.tools.checkstyle.api.DetailAST
[checkstyle] /home/benjamin/NetBeansProjects/hive2/hive_stringbuilder_patch/hive/hcatalog/webhcat/svr/src/main/java/org/apache/hcatalog/templeton/tool/SingleInputFormat.java:0: Got an exception - java.lang.ClassCastException: antlr.CommonAST cannot be cast to com.puppycrawl.tools.checkstyle.api.DetailAST
[checkstyle] /home/benjamin/NetBeansProjects/hive2/hive_stringbuilder_patch/hive/hcatalog/webhcat/svr/src/main/java/org/apache/hcatalog/templeton/tool/TempletonControllerJob.java:0: Got an exception - java.lang.ClassCastException: antlr.CommonAST cannot be cast to com.puppycrawl.tools.checkstyle.api.DetailAST
[checkstyle] /home/benjamin/NetBeansProjects/hive2/hive_stringbuilder_patch/hive/hcatalog/webhcat/svr/src/main/java/org/apache/hcatalog/templeton/tool/TempletonStorage.java:0: Got an exception - java.lang.ClassCastException: antlr.CommonAST cannot be cast to com.puppycrawl.tools.checkstyle.api.DetailAST
[checkstyle] /home/benjamin/NetBeansProjects/hive2/hive_stringbuilder_patch/hive/hcatalog/webhcat/svr/src/main/java/org/apache/hcatalog/templeton/tool/TempletonUtils.java:0: Got an exception - java.lang.ClassCastException: antlr.CommonAST cannot be cast to com.puppycrawl.tools.checkstyle.api.DetailAST
[checkstyle] /home/benjamin/NetBeansProjects/hive2/hive_stringbuilder_patch/hive/hcatalog/webhcat/svr/src/main/java/org/apache/hcatalog/templeton/tool/TrivialExecService.java:0: Got an exception - java.lang.ClassCastException: antlr.CommonAST cannot be cast to com.puppycrawl.tools.checkstyle.api.DetailAST
[checkstyle] /home/benjamin/NetBeansProjects/hive2/hive_stringbuilder_patch/hive/hcatalog/webhcat/svr/src/main/java/org/apache/hcatalog/templeton/tool/ZooKeeperCleanup.java:0: Got an exception - java.lang.ClassCastException: antlr.CommonAST cannot be cast to com.puppycrawl.tools.checkstyle.api.DetailAST
[checkstyle] /home/benjamin/NetBeansProjects/hive2/hive_stringbuilder_patch/hive/hcatalog/webhcat/svr/src/main/java/org/apache/hcatalog/templeton/tool/ZooKeeperStorage.java:0: Got an exception - java.lang.ClassCastException: antlr.CommonAST cannot be cast to com.puppycrawl.tools.checkstyle.api.DetailAST
[checkstyle] /home/benjamin/NetBeansProjects/hive2/hive_stringbuilder_patch/hive/hcatalog/webhcat/svr/src/test/java/org/apache/hcatalog/templeton/TestDesc.java:0: Got an exception - java.lang.ClassCastException: antlr.CommonAST cannot be cast to com.puppycrawl.tools.checkstyle.api.DetailAST
[checkstyle] /home/benjamin/NetBeansProjects/hive2/hive_stringbuilder_patch/hive/hcatalog/webhcat/svr/src/test/java/org/apache/hcatalog/templeton/TestServer.java:0: Got an exception - java.lang.ClassCastException: antlr.CommonAST cannot be cast to com.puppycrawl.tools.checkstyle.api.DetailAST
[checkstyle] /home/benjamin/NetBeansProjects/hive2/hive_stringbuilder_patch/hive/hcatalog/webhcat/svr/src/test/java/org/apache/hcatalog/templeton/TestWebHCatE2e.java:0: Got an exception - java.lang.ClassCastException: antlr.CommonAST cannot be cast to com.puppycrawl.tools.checkstyle.api.DetailAST
[checkstyle] /home/benjamin/NetBeansProjects/hive2/hive_stringbuilder_patch/hive/hcatalog/webhcat/svr/src/test/java/org/apache/hcatalog/templeton/mock/MockExecService.java:0: Got an exception - java.lang.ClassCastException: antlr.CommonAST cannot be cast to com.puppycrawl.tools.checkstyle.api.DetailAST
[checkstyle] /home/benjamin/NetBeansProjects/hive2/hive_stringbuilder_patch/hive/hcatalog/webhcat/svr/src/test/java/org/apache/hcatalog/templeton/mock/MockServer.java:0: Got an exception - java.lang.ClassCastException: antlr.CommonAST cannot be cast to com.puppycrawl.tools.checkstyle.api.DetailAST
[checkstyle] /home/benjamin/NetBeansProjects/hive2/hive_stringbuilder_patch/hive/hcatalog/webhcat/svr/src/test/java/org/apache/hcatalog/templeton/mock/MockUriInfo.java:0: Got an exception - java.lang.ClassCastException: antlr.CommonAST cannot be cast to com.puppycrawl.tools.checkstyle.api.DetailAST
[checkstyle] /home/benjamin/NetBeansProjects/hive2/hive_stringbuilder_patch/hive/hcatalog/webhcat/svr/src/test/java/org/apache/hcatalog/templeton/tool/TestTempletonUtils.java:0: Got an exception - java.lang.ClassCastException: antlr.CommonAST cannot be cast to com.puppycrawl.tools.checkstyle.api.DetailAST
[checkstyle] /home/benjamin/NetBeansProjects/hive2/hive_stringbuilder_patch/hive/hcatalog/webhcat/svr/src/test/java/org/apache/hcatalog/templeton/tool/TestTrivialExecService.java:0: Got an exception - java.lang.ClassCastException: antlr.CommonAST cannot be cast to com.puppycrawl.tools.checkstyle.api.DetailAST
      [for] hcatalog: The following error occurred while executing this line:
      [for] /home/benjamin/NetBeansProjects/hive2/hive_stringbuilder_patch/hive/build.xml:355: The following error occurred while executing this line:
      [for] /home/benjamin/NetBeansProjects/hive2/hive_stringbuilder_patch/hive/hcatalog/build.xml:102: 
      [for] The following error occurred while executing this line:
      [for] /home/benjamin/NetBeansProjects/hive2/hive_stringbuilder_patch/hive/hcatalog/build-support/ant/build-common.xml:97: The following error occurred while executing this line:
      [for] /home/benjamin/NetBeansProjects/hive2/hive_stringbuilder_patch/hive/hcatalog/build-support/ant/test.xml:45: Problem: failed to create task or type junit
      [for] Cause: the class org.apache.tools.ant.taskdefs.optional.junit.JUnitTask was not found.
      [for]         This looks like one of Ant's optional components.
      [for] Action: Check that the appropriate optional JAR exists in
      [for]         -/usr/share/ant-core/lib
      [for]         -/home/benjamin/.ant/lib
      [for]         -a directory added on the command line with the -lib argument
      [for] 
      [for] Do not panic, this is a common problem.
      [for] The commonest cause is a missing JAR.
      [for] 
      [for] This is not a bug; it is a configuration problem
      [for] 
      [for] The following error occurred while executing this line:
      [for] /home/benjamin/NetBeansProjects/hive2/hive_stringbuilder_patch/hive/hcatalog/build-support/ant/build-common.xml:97: The following error occurred while executing this line:
      [for] /home/benjamin/NetBeansProjects/hive2/hive_stringbuilder_patch/hive/hcatalog/build-support/ant/test.xml:45: Problem: failed to create task or type junit
      [for] Cause: the class org.apache.tools.ant.taskdefs.optional.junit.JUnitTask was not found.
      [for]         This looks like one of Ant's optional components.
      [for] Action: Check that the appropriate optional JAR exists in
      [for]         -/usr/share/ant-core/lib
      [for]         -/home/benjamin/.ant/lib
      [for]         -a directory added on the command line with the -lib argument
      [for] 
      [for] Do not panic, this is a common problem.
      [for] The commonest cause is a missing JAR.
      [for] 
      [for] This is not a bug; it is a configuration problem
      [for] 
      [for] The following error occurred while executing this line:
      [for] /home/benjamin/NetBeansProjects/hive2/hive_stringbuilder_patch/hive/hcatalog/build-support/ant/build-common.xml:97: The following error occurred while executing this line:
      [for] /home/benjamin/NetBeansProjects/hive2/hive_stringbuilder_patch/hive/hcatalog/build-support/ant/test.xml:45: Problem: failed to create task or type junit
      [for] Cause: the class org.apache.tools.ant.taskdefs.optional.junit.JUnitTask was not found.
      [for]         This looks like one of Ant's optional components.
      [for] Action: Check that the appropriate optional JAR exists in
      [for]         -/usr/share/ant-core/lib
      [for]         -/home/benjamin/.ant/lib
      [for]         -a directory added on the command line with the -lib argument
      [for] 
      [for] Do not panic, this is a common problem.
      [for] The commonest cause is a missing JAR.
      [for] 
      [for] This is not a bug; it is a configuration problem
      [for] 
      [for] The following error occurred while executing this line:
      [for] /home/benjamin/NetBeansProjects/hive2/hive_stringbuilder_patch/hive/hcatalog/build-support/ant/build-common.xml:97: The following error occurred while executing this line:
      [for] /home/benjamin/NetBeansProjects/hive2/hive_stringbuilder_patch/hive/hcatalog/build-support/ant/test.xml:45: Problem: failed to create task or type junit
      [for] Cause: the class org.apache.tools.ant.taskdefs.optional.junit.JUnitTask was not found.
      [for]         This looks like one of Ant's optional components.
      [for] Action: Check that the appropriate optional JAR exists in
      [for]         -/usr/share/ant-core/lib
      [for]         -/home/benjamin/.ant/lib
      [for]         -a directory added on the command line with the -lib argument
      [for] 
      [for] Do not panic, this is a common problem.
      [for] The commonest cause is a missing JAR.
      [for] 
      [for] This is not a bug; it is a configuration problem
      [for] 
      [for] The following error occurred while executing this line:
      [for] /home/benjamin/NetBeansProjects/hive2/hive_stringbuilder_patch/hive/hcatalog/build-support/ant/build-common.xml:97: The following error occurred while executing this line:
      [for] /home/benjamin/NetBeansProjects/hive2/hive_stringbuilder_patch/hive/hcatalog/build-support/ant/test.xml:45: Problem: failed to create task or type junit
      [for] Cause: the class org.apache.tools.ant.taskdefs.optional.junit.JUnitTask was not found.
      [for]         This looks like one of Ant's optional components.
      [for] Action: Check that the appropriate optional JAR exists in
      [for]         -/usr/share/ant-core/lib
      [for]         -/home/benjamin/.ant/lib
      [for]         -a directory added on the command line with the -lib argument
      [for] 
      [for] Do not panic, this is a common problem.
      [for] The commonest cause is a missing JAR.
      [for] 
      [for] This is not a bug; it is a configuration problem
      [for] 
      [for] The following error occurred while executing this line:
      [for] /home/benjamin/NetBeansProjects/hive2/hive_stringbuilder_patch/hive/hcatalog/storage-handlers/hbase/build.xml:140: Problem: failed to create task or type junit
      [for] Cause: the class org.apache.tools.ant.taskdefs.optional.junit.JUnitTask was not found.
      [for]         This looks like one of Ant's optional components.
      [for] Action: Check that the appropriate optional JAR exists in
      [for]         -/usr/share/ant-core/lib
      [for]         -/home/benjamin/.ant/lib
      [for]         -a directory added on the command line with the -lib argument
      [for] 
      [for] Do not panic, this is a common problem.
      [for] The commonest cause is a missing JAR.
      [for] 
      [for] This is not a bug; it is a configuration problem
      [for] 
      [for] The following error occurred while executing this line:
      [for] /home/benjamin/NetBeansProjects/hive2/hive_stringbuilder_patch/hive/hcatalog/build-support/ant/checkstyle.xml:32: Got 307 errors and 0 warnings.

BUILD FAILED
/home/benjamin/NetBeansProjects/hive2/hive_stringbuilder_patch/hive/build.xml:353: Keepgoing execution: 10 of 11 iterations failed.

Total time: 12 minutes 14 seconds
$ 

{code}
                
> Avoiding object instantiation in loops (issue 6)
> ------------------------------------------------
>
>                 Key: HIVE-5018
>                 URL: https://issues.apache.org/jira/browse/HIVE-5018
>             Project: Hive
>          Issue Type: Sub-task
>            Reporter: Benjamin Jakobus
>            Assignee: Benjamin Jakobus
>            Priority: Minor
>             Fix For: 0.12.0
>
>         Attachments: HIVE-5018.1.patch.txt
>
>
> Object instantiation inside loops is very expensive. Where possible, object references should be created outside the loop so that they can be reused.

--
This message is automatically generated by JIRA.
If you think it was sent incorrectly, please contact your JIRA administrators
For more information on JIRA, see: http://www.atlassian.com/software/jira

Mime
View raw message