hive-dev mailing list archives

Site index · List index
Message view « Date » · « Thread »
Top « Date » · « Thread »
From Apache Jenkins Server <jenk...@builds.apache.org>
Subject Hive-trunk-hadoop2 - Build # 266 - Failure
Date Mon, 01 Jul 2013 11:21:00 GMT
Changes for Build #233

Changes for Build #234
[navis] HIVE-4691 : orc_createas1.q has minor inconsistency (Brock Noland via Navis)

[navis] HIVE-4549 : JDBC compliance change TABLE_SCHEMA to TABLE_SCHEM (Prasad Mujumdar via
Navis)


Changes for Build #235
[hashutosh] HIVE-4712 : Fix TestCliDriver.truncate_* on 0.23 (Brock Noland via Ashutosh Chauhan)


Changes for Build #236
[navis] HIVE-4708 : Fix TestCliDriver.combine2.q on 0.23 (Brock Noland via Navis)


Changes for Build #237
[hashutosh] HIVE-4717 : Fix non-deterministic TestCliDriver on 0.23 (Brock Noland via Ashutosh
Chauhan)


Changes for Build #238

Changes for Build #239
[hashutosh] HIVE-4713 : Fix TestCliDriver.skewjoin_union_remove_{1,2}.q on 0.23 (Brock Noland
via Ashutosh Chauhan)

[hashutosh] HIVE-4715 : Fix TestCliDriver.{recursive_dir.q,sample_islocalmode_hook.q,input12.q,input39.q,auto_join14.q}
on 0.23 (Brock Noland via Ashutosh Chauhan)


Changes for Build #240

Changes for Build #241
[ecapriolo] Submitted by: Brock Noland Jonathon Chang	
Reviewed by: Edward Capriolo	
Approved by: Edward Capriolo


Changes for Build #242

Changes for Build #243

Changes for Build #244
[navis] HIVE-4708 : Temporary files are not closed in PTFPersistence on jvm reuse (Navis reviewed
by Harish Butani)


Changes for Build #245
[hashutosh] HIVE-4593 : ErrorMsg has several messages that reuse the same error code (Navis
via Ashutosh Chauhan)

[hashutosh] HIVE-4711 : Fix TestCliDriver.list_bucket_query_oneskew_{1,2,3}.q on 0.23 (Brock
Noland via Ashutosh Chauhan)


Changes for Build #246
[hashutosh] HIVE-4707 : Support configurable domain name for HiveServer2 LDAP authentication
using Active Directory (Prasad Mujumdar via Ashutosh Chauhan)

[gates] HIVE-4969 WebHCat e2e test framework is missing files and instructions (ekoifman via
gates)


Changes for Build #247
[hashutosh] HIVE-4746 : Fix TestCliDriver.list_bucket_dml_{2,4,5,9,12,13}.q on 0.23 (Brock
Noland via Ashutosh Chauhan)


Changes for Build #248
[ecapriolo] HIVE-4616: Support outer lateral view


Submitted by:	Navis	
Reviewed by:	Edward Capriolo
Approved by:	Edward Capriolo

[gates] HIVE-4679 WebHCat can deadlock Hadoop if the number of concurrently running tasks
if higher or equal than the number of mappers (ekoifman via gates)


Changes for Build #249
[hashutosh] HIVE-3953 : Reading of partitioned Avro data fails because of missing properties
(Mark Wagner via Ashutosh Chauhan)


Changes for Build #250
[hashutosh] HIVE-4761 : ZooKeeperHiveLockManage.unlockPrimitive has race condition with threads
(Brock Noland via Ashutosh Chauhan)

[hashutosh] HIVE-4609 : Allow hive tests to specify an alternative to /tmp (Brock Noland via
Ashutosh Chauhan)


Changes for Build #251
[hashutosh] HIVE-4172 : JDBC2 does not support VOID type (Navis via Ashutosh Chauhan)


Changes for Build #252
[hashutosh] HIVE-4767 : ObjectStore.getPMF has concurrency problems (Brock Noland via Ashutosh
Chauhan)

[hashutosh] HIVE-4743 : Improve test coverage of package org.apache.hadoop.hive.ql.io (Ivan
Veselovsky via Ashutosh Chauhan)


Changes for Build #253

Changes for Build #254

Changes for Build #255
[ecapriolo] HIVE-1402 Add parallel order by to hive (Navis Ryu and Jeff Zhang via egc)

Submitted by:	Navis Ryu
Reviewed by:	Edward Capriolo


Changes for Build #256

Changes for Build #257
[navis] HIVE-4496 : JDBC2 won't compile with JDK7 (Chris Drome via Navis)


Changes for Build #258

Changes for Build #259

Changes for Build #260

Changes for Build #261

Changes for Build #262
[daijy] HIVE-4591: Making changes to webhcat-site.xml have no effect

[daijy] HIVE-4784:ant testreport doesn't include any HCatalog tests


Changes for Build #263
[omalley] Undoing the accidental update of the 0.11 release notes.

[omalley] HIVE-4478. In ORC remove ispresent stream from columns that contain no null 
values in a stripe. (Prasanth Jayachandran via omalley)


Changes for Build #264

Changes for Build #265
[hashutosh] HIVE-4740 : HIVE2379 is missing hbase.jar itself (Navis via Ashutosh Chauhan)

[hashutosh] HIVE-4756 : Upgrade Hadoop 0.23 profile to 2.0.5-alpha (Brock Noland via Ashutosh
Chauhan)

[hashutosh] HIVE-4791 : improve test coverage of package org.apache.hadoop.hive.ql.udf.xml
(Ivan Veselovsky via Ashutosh Chauhan)


Changes for Build #266
[hashutosh] HIVE-4618 : show create table creating unusable DDL when field delimiter is \001
(Navis via Ashutosh Chauhan)

[hashutosh] HIVE-4559 : hcatalog/webhcat scripts in tar.gz don't have execute permissions
set (Eugene Koifman via Ashutosh Chauhan)

[hashutosh] HIVE-4798 : NPE when we call isSame from an instance of ExprNodeConstantDesc with
null value (Yin Huai via Ashutosh Chauhan)

[hashutosh] HIVE-4781 : LEFT SEMI JOIN generates wrong results when the number of rows belonging
to a single key of the right table exceed hive.join.emit.interval (Yin Huai via Ashutosh Chauhan)

[hashutosh] HIVE-4647 : RetryingHMSHandler logs too many error messages (Navis via Ashutosh
Chauhan)

[hashutosh] HIVE-4692 : Constant agg parameters will be replaced by ExprNodeColumnDesc with
single-sourced multi-gby cases (Navis via Ashutosh Chauhan)




28 tests failed.
FAILED:  org.apache.hadoop.hive.cli.TestHBaseMinimrCliDriver.testCliDriver_hbase_bulk

Error Message:
Unexpected exception in setup

Stack Trace:
junit.framework.AssertionFailedError: Unexpected exception in setup
	at junit.framework.Assert.fail(Assert.java:50)
	at org.apache.hadoop.hive.cli.TestHBaseMinimrCliDriver.setUp(TestHBaseMinimrCliDriver.java:59)
	at junit.framework.TestCase.runBare(TestCase.java:132)
	at junit.framework.TestResult$1.protect(TestResult.java:110)
	at junit.framework.TestResult.runProtected(TestResult.java:128)
	at junit.framework.TestResult.run(TestResult.java:113)
	at junit.framework.TestCase.run(TestCase.java:124)
	at junit.framework.TestSuite.runTest(TestSuite.java:243)
	at junit.framework.TestSuite.run(TestSuite.java:238)
	at junit.extensions.TestDecorator.basicRun(TestDecorator.java:24)
	at junit.extensions.TestSetup$1.protect(TestSetup.java:23)
	at junit.framework.TestResult.runProtected(TestResult.java:128)
	at junit.extensions.TestSetup.run(TestSetup.java:27)
	at org.apache.tools.ant.taskdefs.optional.junit.JUnitTestRunner.run(JUnitTestRunner.java:422)
	at org.apache.tools.ant.taskdefs.optional.junit.JUnitTestRunner.launch(JUnitTestRunner.java:931)
	at org.apache.tools.ant.taskdefs.optional.junit.JUnitTestRunner.main(JUnitTestRunner.java:785)


FAILED:  org.apache.hadoop.hive.cli.TestHBaseNegativeCliDriver.testCliDriver_cascade_dbdrop

Error Message:
Unexpected exception in setup

Stack Trace:
junit.framework.AssertionFailedError: Unexpected exception in setup
	at junit.framework.Assert.fail(Assert.java:50)
	at org.apache.hadoop.hive.cli.TestHBaseNegativeCliDriver.setUp(TestHBaseNegativeCliDriver.java:38)
	at junit.framework.TestCase.runBare(TestCase.java:132)
	at junit.framework.TestResult$1.protect(TestResult.java:110)
	at junit.framework.TestResult.runProtected(TestResult.java:128)
	at junit.framework.TestResult.run(TestResult.java:113)
	at junit.framework.TestCase.run(TestCase.java:124)
	at junit.framework.TestSuite.runTest(TestSuite.java:243)
	at junit.framework.TestSuite.run(TestSuite.java:238)
	at junit.extensions.TestDecorator.basicRun(TestDecorator.java:24)
	at junit.extensions.TestSetup$1.protect(TestSetup.java:23)
	at junit.framework.TestResult.runProtected(TestResult.java:128)
	at junit.extensions.TestSetup.run(TestSetup.java:27)
	at org.apache.tools.ant.taskdefs.optional.junit.JUnitTestRunner.run(JUnitTestRunner.java:422)
	at org.apache.tools.ant.taskdefs.optional.junit.JUnitTestRunner.launch(JUnitTestRunner.java:931)
	at org.apache.tools.ant.taskdefs.optional.junit.JUnitTestRunner.main(JUnitTestRunner.java:785)


FAILED:  org.apache.hadoop.hive.cli.TestHBaseNegativeCliDriver.testCliDriver_cascade_dbdrop_hadoop20

Error Message:
Unexpected exception in setup

Stack Trace:
junit.framework.AssertionFailedError: Unexpected exception in setup
	at junit.framework.Assert.fail(Assert.java:50)
	at org.apache.hadoop.hive.cli.TestHBaseNegativeCliDriver.setUp(TestHBaseNegativeCliDriver.java:38)
	at junit.framework.TestCase.runBare(TestCase.java:132)
	at junit.framework.TestResult$1.protect(TestResult.java:110)
	at junit.framework.TestResult.runProtected(TestResult.java:128)
	at junit.framework.TestResult.run(TestResult.java:113)
	at junit.framework.TestCase.run(TestCase.java:124)
	at junit.framework.TestSuite.runTest(TestSuite.java:243)
	at junit.framework.TestSuite.run(TestSuite.java:238)
	at junit.extensions.TestDecorator.basicRun(TestDecorator.java:24)
	at junit.extensions.TestSetup$1.protect(TestSetup.java:23)
	at junit.framework.TestResult.runProtected(TestResult.java:128)
	at junit.extensions.TestSetup.run(TestSetup.java:27)
	at org.apache.tools.ant.taskdefs.optional.junit.JUnitTestRunner.run(JUnitTestRunner.java:422)
	at org.apache.tools.ant.taskdefs.optional.junit.JUnitTestRunner.launch(JUnitTestRunner.java:931)
	at org.apache.tools.ant.taskdefs.optional.junit.JUnitTestRunner.main(JUnitTestRunner.java:785)


REGRESSION:  org.apache.hadoop.hive.cli.TestCliDriver.testCliDriver_bucketmapjoin1

Error Message:
Unexpected exception See build/ql/tmp/hive.log, or try "ant test ... -Dtest.silent=false"
to get more logs.

Stack Trace:
junit.framework.AssertionFailedError: Unexpected exception
See build/ql/tmp/hive.log, or try "ant test ... -Dtest.silent=false" to get more logs.
	at junit.framework.Assert.fail(Assert.java:50)
	at org.apache.hadoop.hive.cli.TestCliDriver.runTest(TestCliDriver.java:6340)
	at org.apache.hadoop.hive.cli.TestCliDriver.testCliDriver_bucketmapjoin1(TestCliDriver.java:1869)
	at sun.reflect.NativeMethodAccessorImpl.invoke0(Native Method)
	at sun.reflect.NativeMethodAccessorImpl.invoke(NativeMethodAccessorImpl.java:39)
	at sun.reflect.DelegatingMethodAccessorImpl.invoke(DelegatingMethodAccessorImpl.java:25)
	at java.lang.reflect.Method.invoke(Method.java:597)
	at junit.framework.TestCase.runTest(TestCase.java:168)
	at junit.framework.TestCase.runBare(TestCase.java:134)
	at junit.framework.TestResult$1.protect(TestResult.java:110)
	at junit.framework.TestResult.runProtected(TestResult.java:128)
	at junit.framework.TestResult.run(TestResult.java:113)
	at junit.framework.TestCase.run(TestCase.java:124)
	at junit.framework.TestSuite.runTest(TestSuite.java:243)
	at junit.framework.TestSuite.run(TestSuite.java:238)
	at org.apache.tools.ant.taskdefs.optional.junit.JUnitTestRunner.run(JUnitTestRunner.java:422)
	at org.apache.tools.ant.taskdefs.optional.junit.JUnitTestRunner.launch(JUnitTestRunner.java:931)
	at org.apache.tools.ant.taskdefs.optional.junit.JUnitTestRunner.main(JUnitTestRunner.java:785)


FAILED:  org.apache.hadoop.hive.cli.TestMinimrCliDriver.testCliDriver_leftsemijoin_mr

Error Message:
Unexpected exception See build/ql/tmp/hive.log, or try "ant test ... -Dtest.silent=false"
to get more logs.

Stack Trace:
junit.framework.AssertionFailedError: Unexpected exception
See build/ql/tmp/hive.log, or try "ant test ... -Dtest.silent=false" to get more logs.
	at junit.framework.Assert.fail(Assert.java:50)
	at org.apache.hadoop.hive.cli.TestMinimrCliDriver.runTest(TestMinimrCliDriver.java:295)
	at org.apache.hadoop.hive.cli.TestMinimrCliDriver.testCliDriver_leftsemijoin_mr(TestMinimrCliDriver.java:204)
	at sun.reflect.NativeMethodAccessorImpl.invoke0(Native Method)
	at sun.reflect.NativeMethodAccessorImpl.invoke(NativeMethodAccessorImpl.java:39)
	at sun.reflect.DelegatingMethodAccessorImpl.invoke(DelegatingMethodAccessorImpl.java:25)
	at java.lang.reflect.Method.invoke(Method.java:597)
	at junit.framework.TestCase.runTest(TestCase.java:168)
	at junit.framework.TestCase.runBare(TestCase.java:134)
	at junit.framework.TestResult$1.protect(TestResult.java:110)
	at junit.framework.TestResult.runProtected(TestResult.java:128)
	at junit.framework.TestResult.run(TestResult.java:113)
	at junit.framework.TestCase.run(TestCase.java:124)
	at junit.framework.TestSuite.runTest(TestSuite.java:243)
	at junit.framework.TestSuite.run(TestSuite.java:238)
	at org.apache.tools.ant.taskdefs.optional.junit.JUnitTestRunner.run(JUnitTestRunner.java:422)
	at org.apache.tools.ant.taskdefs.optional.junit.JUnitTestRunner.launch(JUnitTestRunner.java:931)
	at org.apache.tools.ant.taskdefs.optional.junit.JUnitTestRunner.main(JUnitTestRunner.java:785)


FAILED:  org.apache.hadoop.hive.cli.TestHBaseCliDriver.testCliDriver_external_table_ppd

Error Message:
Unexpected exception in setup

Stack Trace:
junit.framework.AssertionFailedError: Unexpected exception in setup
	at junit.framework.Assert.fail(Assert.java:50)
	at org.apache.hadoop.hive.cli.TestHBaseCliDriver.setUp(TestHBaseCliDriver.java:59)
	at junit.framework.TestCase.runBare(TestCase.java:132)
	at junit.framework.TestResult$1.protect(TestResult.java:110)
	at junit.framework.TestResult.runProtected(TestResult.java:128)
	at junit.framework.TestResult.run(TestResult.java:113)
	at junit.framework.TestCase.run(TestCase.java:124)
	at junit.framework.TestSuite.runTest(TestSuite.java:243)
	at junit.framework.TestSuite.run(TestSuite.java:238)
	at junit.extensions.TestDecorator.basicRun(TestDecorator.java:24)
	at junit.extensions.TestSetup$1.protect(TestSetup.java:23)
	at junit.framework.TestResult.runProtected(TestResult.java:128)
	at junit.extensions.TestSetup.run(TestSetup.java:27)
	at org.apache.tools.ant.taskdefs.optional.junit.JUnitTestRunner.run(JUnitTestRunner.java:422)
	at org.apache.tools.ant.taskdefs.optional.junit.JUnitTestRunner.launch(JUnitTestRunner.java:931)
	at org.apache.tools.ant.taskdefs.optional.junit.JUnitTestRunner.main(JUnitTestRunner.java:785)


FAILED:  org.apache.hadoop.hive.cli.TestHBaseCliDriver.testCliDriver_hbase_binary_external_table_queries

Error Message:
Unexpected exception in setup

Stack Trace:
junit.framework.AssertionFailedError: Unexpected exception in setup
	at junit.framework.Assert.fail(Assert.java:50)
	at org.apache.hadoop.hive.cli.TestHBaseCliDriver.setUp(TestHBaseCliDriver.java:59)
	at junit.framework.TestCase.runBare(TestCase.java:132)
	at junit.framework.TestResult$1.protect(TestResult.java:110)
	at junit.framework.TestResult.runProtected(TestResult.java:128)
	at junit.framework.TestResult.run(TestResult.java:113)
	at junit.framework.TestCase.run(TestCase.java:124)
	at junit.framework.TestSuite.runTest(TestSuite.java:243)
	at junit.framework.TestSuite.run(TestSuite.java:238)
	at junit.extensions.TestDecorator.basicRun(TestDecorator.java:24)
	at junit.extensions.TestSetup$1.protect(TestSetup.java:23)
	at junit.framework.TestResult.runProtected(TestResult.java:128)
	at junit.extensions.TestSetup.run(TestSetup.java:27)
	at org.apache.tools.ant.taskdefs.optional.junit.JUnitTestRunner.run(JUnitTestRunner.java:422)
	at org.apache.tools.ant.taskdefs.optional.junit.JUnitTestRunner.launch(JUnitTestRunner.java:931)
	at org.apache.tools.ant.taskdefs.optional.junit.JUnitTestRunner.main(JUnitTestRunner.java:785)


FAILED:  org.apache.hadoop.hive.cli.TestHBaseCliDriver.testCliDriver_hbase_binary_map_queries

Error Message:
Unexpected exception in setup

Stack Trace:
junit.framework.AssertionFailedError: Unexpected exception in setup
	at junit.framework.Assert.fail(Assert.java:50)
	at org.apache.hadoop.hive.cli.TestHBaseCliDriver.setUp(TestHBaseCliDriver.java:59)
	at junit.framework.TestCase.runBare(TestCase.java:132)
	at junit.framework.TestResult$1.protect(TestResult.java:110)
	at junit.framework.TestResult.runProtected(TestResult.java:128)
	at junit.framework.TestResult.run(TestResult.java:113)
	at junit.framework.TestCase.run(TestCase.java:124)
	at junit.framework.TestSuite.runTest(TestSuite.java:243)
	at junit.framework.TestSuite.run(TestSuite.java:238)
	at junit.extensions.TestDecorator.basicRun(TestDecorator.java:24)
	at junit.extensions.TestSetup$1.protect(TestSetup.java:23)
	at junit.framework.TestResult.runProtected(TestResult.java:128)
	at junit.extensions.TestSetup.run(TestSetup.java:27)
	at org.apache.tools.ant.taskdefs.optional.junit.JUnitTestRunner.run(JUnitTestRunner.java:422)
	at org.apache.tools.ant.taskdefs.optional.junit.JUnitTestRunner.launch(JUnitTestRunner.java:931)
	at org.apache.tools.ant.taskdefs.optional.junit.JUnitTestRunner.main(JUnitTestRunner.java:785)


FAILED:  org.apache.hadoop.hive.cli.TestHBaseCliDriver.testCliDriver_hbase_binary_storage_queries

Error Message:
Unexpected exception in setup

Stack Trace:
junit.framework.AssertionFailedError: Unexpected exception in setup
	at junit.framework.Assert.fail(Assert.java:50)
	at org.apache.hadoop.hive.cli.TestHBaseCliDriver.setUp(TestHBaseCliDriver.java:59)
	at junit.framework.TestCase.runBare(TestCase.java:132)
	at junit.framework.TestResult$1.protect(TestResult.java:110)
	at junit.framework.TestResult.runProtected(TestResult.java:128)
	at junit.framework.TestResult.run(TestResult.java:113)
	at junit.framework.TestCase.run(TestCase.java:124)
	at junit.framework.TestSuite.runTest(TestSuite.java:243)
	at junit.framework.TestSuite.run(TestSuite.java:238)
	at junit.extensions.TestDecorator.basicRun(TestDecorator.java:24)
	at junit.extensions.TestSetup$1.protect(TestSetup.java:23)
	at junit.framework.TestResult.runProtected(TestResult.java:128)
	at junit.extensions.TestSetup.run(TestSetup.java:27)
	at org.apache.tools.ant.taskdefs.optional.junit.JUnitTestRunner.run(JUnitTestRunner.java:422)
	at org.apache.tools.ant.taskdefs.optional.junit.JUnitTestRunner.launch(JUnitTestRunner.java:931)
	at org.apache.tools.ant.taskdefs.optional.junit.JUnitTestRunner.main(JUnitTestRunner.java:785)


FAILED:  org.apache.hadoop.hive.cli.TestHBaseCliDriver.testCliDriver_hbase_joins

Error Message:
Unexpected exception in setup

Stack Trace:
junit.framework.AssertionFailedError: Unexpected exception in setup
	at junit.framework.Assert.fail(Assert.java:50)
	at org.apache.hadoop.hive.cli.TestHBaseCliDriver.setUp(TestHBaseCliDriver.java:59)
	at junit.framework.TestCase.runBare(TestCase.java:132)
	at junit.framework.TestResult$1.protect(TestResult.java:110)
	at junit.framework.TestResult.runProtected(TestResult.java:128)
	at junit.framework.TestResult.run(TestResult.java:113)
	at junit.framework.TestCase.run(TestCase.java:124)
	at junit.framework.TestSuite.runTest(TestSuite.java:243)
	at junit.framework.TestSuite.run(TestSuite.java:238)
	at junit.extensions.TestDecorator.basicRun(TestDecorator.java:24)
	at junit.extensions.TestSetup$1.protect(TestSetup.java:23)
	at junit.framework.TestResult.runProtected(TestResult.java:128)
	at junit.extensions.TestSetup.run(TestSetup.java:27)
	at org.apache.tools.ant.taskdefs.optional.junit.JUnitTestRunner.run(JUnitTestRunner.java:422)
	at org.apache.tools.ant.taskdefs.optional.junit.JUnitTestRunner.launch(JUnitTestRunner.java:931)
	at org.apache.tools.ant.taskdefs.optional.junit.JUnitTestRunner.main(JUnitTestRunner.java:785)


FAILED:  org.apache.hadoop.hive.cli.TestHBaseCliDriver.testCliDriver_hbase_ppd_key_range

Error Message:
Unexpected exception in setup

Stack Trace:
junit.framework.AssertionFailedError: Unexpected exception in setup
	at junit.framework.Assert.fail(Assert.java:50)
	at org.apache.hadoop.hive.cli.TestHBaseCliDriver.setUp(TestHBaseCliDriver.java:59)
	at junit.framework.TestCase.runBare(TestCase.java:132)
	at junit.framework.TestResult$1.protect(TestResult.java:110)
	at junit.framework.TestResult.runProtected(TestResult.java:128)
	at junit.framework.TestResult.run(TestResult.java:113)
	at junit.framework.TestCase.run(TestCase.java:124)
	at junit.framework.TestSuite.runTest(TestSuite.java:243)
	at junit.framework.TestSuite.run(TestSuite.java:238)
	at junit.extensions.TestDecorator.basicRun(TestDecorator.java:24)
	at junit.extensions.TestSetup$1.protect(TestSetup.java:23)
	at junit.framework.TestResult.runProtected(TestResult.java:128)
	at junit.extensions.TestSetup.run(TestSetup.java:27)
	at org.apache.tools.ant.taskdefs.optional.junit.JUnitTestRunner.run(JUnitTestRunner.java:422)
	at org.apache.tools.ant.taskdefs.optional.junit.JUnitTestRunner.launch(JUnitTestRunner.java:931)
	at org.apache.tools.ant.taskdefs.optional.junit.JUnitTestRunner.main(JUnitTestRunner.java:785)


FAILED:  org.apache.hadoop.hive.cli.TestHBaseCliDriver.testCliDriver_hbase_pushdown

Error Message:
Unexpected exception in setup

Stack Trace:
junit.framework.AssertionFailedError: Unexpected exception in setup
	at junit.framework.Assert.fail(Assert.java:50)
	at org.apache.hadoop.hive.cli.TestHBaseCliDriver.setUp(TestHBaseCliDriver.java:59)
	at junit.framework.TestCase.runBare(TestCase.java:132)
	at junit.framework.TestResult$1.protect(TestResult.java:110)
	at junit.framework.TestResult.runProtected(TestResult.java:128)
	at junit.framework.TestResult.run(TestResult.java:113)
	at junit.framework.TestCase.run(TestCase.java:124)
	at junit.framework.TestSuite.runTest(TestSuite.java:243)
	at junit.framework.TestSuite.run(TestSuite.java:238)
	at junit.extensions.TestDecorator.basicRun(TestDecorator.java:24)
	at junit.extensions.TestSetup$1.protect(TestSetup.java:23)
	at junit.framework.TestResult.runProtected(TestResult.java:128)
	at junit.extensions.TestSetup.run(TestSetup.java:27)
	at org.apache.tools.ant.taskdefs.optional.junit.JUnitTestRunner.run(JUnitTestRunner.java:422)
	at org.apache.tools.ant.taskdefs.optional.junit.JUnitTestRunner.launch(JUnitTestRunner.java:931)
	at org.apache.tools.ant.taskdefs.optional.junit.JUnitTestRunner.main(JUnitTestRunner.java:785)


FAILED:  org.apache.hadoop.hive.cli.TestHBaseCliDriver.testCliDriver_hbase_queries

Error Message:
Unexpected exception in setup

Stack Trace:
junit.framework.AssertionFailedError: Unexpected exception in setup
	at junit.framework.Assert.fail(Assert.java:50)
	at org.apache.hadoop.hive.cli.TestHBaseCliDriver.setUp(TestHBaseCliDriver.java:59)
	at junit.framework.TestCase.runBare(TestCase.java:132)
	at junit.framework.TestResult$1.protect(TestResult.java:110)
	at junit.framework.TestResult.runProtected(TestResult.java:128)
	at junit.framework.TestResult.run(TestResult.java:113)
	at junit.framework.TestCase.run(TestCase.java:124)
	at junit.framework.TestSuite.runTest(TestSuite.java:243)
	at junit.framework.TestSuite.run(TestSuite.java:238)
	at junit.extensions.TestDecorator.basicRun(TestDecorator.java:24)
	at junit.extensions.TestSetup$1.protect(TestSetup.java:23)
	at junit.framework.TestResult.runProtected(TestResult.java:128)
	at junit.extensions.TestSetup.run(TestSetup.java:27)
	at org.apache.tools.ant.taskdefs.optional.junit.JUnitTestRunner.run(JUnitTestRunner.java:422)
	at org.apache.tools.ant.taskdefs.optional.junit.JUnitTestRunner.launch(JUnitTestRunner.java:931)
	at org.apache.tools.ant.taskdefs.optional.junit.JUnitTestRunner.main(JUnitTestRunner.java:785)


FAILED:  org.apache.hadoop.hive.cli.TestHBaseCliDriver.testCliDriver_hbase_stats

Error Message:
Unexpected exception in setup

Stack Trace:
junit.framework.AssertionFailedError: Unexpected exception in setup
	at junit.framework.Assert.fail(Assert.java:50)
	at org.apache.hadoop.hive.cli.TestHBaseCliDriver.setUp(TestHBaseCliDriver.java:59)
	at junit.framework.TestCase.runBare(TestCase.java:132)
	at junit.framework.TestResult$1.protect(TestResult.java:110)
	at junit.framework.TestResult.runProtected(TestResult.java:128)
	at junit.framework.TestResult.run(TestResult.java:113)
	at junit.framework.TestCase.run(TestCase.java:124)
	at junit.framework.TestSuite.runTest(TestSuite.java:243)
	at junit.framework.TestSuite.run(TestSuite.java:238)
	at junit.extensions.TestDecorator.basicRun(TestDecorator.java:24)
	at junit.extensions.TestSetup$1.protect(TestSetup.java:23)
	at junit.framework.TestResult.runProtected(TestResult.java:128)
	at junit.extensions.TestSetup.run(TestSetup.java:27)
	at org.apache.tools.ant.taskdefs.optional.junit.JUnitTestRunner.run(JUnitTestRunner.java:422)
	at org.apache.tools.ant.taskdefs.optional.junit.JUnitTestRunner.launch(JUnitTestRunner.java:931)
	at org.apache.tools.ant.taskdefs.optional.junit.JUnitTestRunner.main(JUnitTestRunner.java:785)


FAILED:  org.apache.hadoop.hive.cli.TestHBaseCliDriver.testCliDriver_hbase_stats2

Error Message:
Unexpected exception in setup

Stack Trace:
junit.framework.AssertionFailedError: Unexpected exception in setup
	at junit.framework.Assert.fail(Assert.java:50)
	at org.apache.hadoop.hive.cli.TestHBaseCliDriver.setUp(TestHBaseCliDriver.java:59)
	at junit.framework.TestCase.runBare(TestCase.java:132)
	at junit.framework.TestResult$1.protect(TestResult.java:110)
	at junit.framework.TestResult.runProtected(TestResult.java:128)
	at junit.framework.TestResult.run(TestResult.java:113)
	at junit.framework.TestCase.run(TestCase.java:124)
	at junit.framework.TestSuite.runTest(TestSuite.java:243)
	at junit.framework.TestSuite.run(TestSuite.java:238)
	at junit.extensions.TestDecorator.basicRun(TestDecorator.java:24)
	at junit.extensions.TestSetup$1.protect(TestSetup.java:23)
	at junit.framework.TestResult.runProtected(TestResult.java:128)
	at junit.extensions.TestSetup.run(TestSetup.java:27)
	at org.apache.tools.ant.taskdefs.optional.junit.JUnitTestRunner.run(JUnitTestRunner.java:422)
	at org.apache.tools.ant.taskdefs.optional.junit.JUnitTestRunner.launch(JUnitTestRunner.java:931)
	at org.apache.tools.ant.taskdefs.optional.junit.JUnitTestRunner.main(JUnitTestRunner.java:785)


FAILED:  org.apache.hadoop.hive.cli.TestHBaseCliDriver.testCliDriver_hbase_stats3

Error Message:
Unexpected exception in setup

Stack Trace:
junit.framework.AssertionFailedError: Unexpected exception in setup
	at junit.framework.Assert.fail(Assert.java:50)
	at org.apache.hadoop.hive.cli.TestHBaseCliDriver.setUp(TestHBaseCliDriver.java:59)
	at junit.framework.TestCase.runBare(TestCase.java:132)
	at junit.framework.TestResult$1.protect(TestResult.java:110)
	at junit.framework.TestResult.runProtected(TestResult.java:128)
	at junit.framework.TestResult.run(TestResult.java:113)
	at junit.framework.TestCase.run(TestCase.java:124)
	at junit.framework.TestSuite.runTest(TestSuite.java:243)
	at junit.framework.TestSuite.run(TestSuite.java:238)
	at junit.extensions.TestDecorator.basicRun(TestDecorator.java:24)
	at junit.extensions.TestSetup$1.protect(TestSetup.java:23)
	at junit.framework.TestResult.runProtected(TestResult.java:128)
	at junit.extensions.TestSetup.run(TestSetup.java:27)
	at org.apache.tools.ant.taskdefs.optional.junit.JUnitTestRunner.run(JUnitTestRunner.java:422)
	at org.apache.tools.ant.taskdefs.optional.junit.JUnitTestRunner.launch(JUnitTestRunner.java:931)
	at org.apache.tools.ant.taskdefs.optional.junit.JUnitTestRunner.main(JUnitTestRunner.java:785)


FAILED:  org.apache.hadoop.hive.cli.TestHBaseCliDriver.testCliDriver_hbase_stats_empty_partition

Error Message:
Unexpected exception in setup

Stack Trace:
junit.framework.AssertionFailedError: Unexpected exception in setup
	at junit.framework.Assert.fail(Assert.java:50)
	at org.apache.hadoop.hive.cli.TestHBaseCliDriver.setUp(TestHBaseCliDriver.java:59)
	at junit.framework.TestCase.runBare(TestCase.java:132)
	at junit.framework.TestResult$1.protect(TestResult.java:110)
	at junit.framework.TestResult.runProtected(TestResult.java:128)
	at junit.framework.TestResult.run(TestResult.java:113)
	at junit.framework.TestCase.run(TestCase.java:124)
	at junit.framework.TestSuite.runTest(TestSuite.java:243)
	at junit.framework.TestSuite.run(TestSuite.java:238)
	at junit.extensions.TestDecorator.basicRun(TestDecorator.java:24)
	at junit.extensions.TestSetup$1.protect(TestSetup.java:23)
	at junit.framework.TestResult.runProtected(TestResult.java:128)
	at junit.extensions.TestSetup.run(TestSetup.java:27)
	at org.apache.tools.ant.taskdefs.optional.junit.JUnitTestRunner.run(JUnitTestRunner.java:422)
	at org.apache.tools.ant.taskdefs.optional.junit.JUnitTestRunner.launch(JUnitTestRunner.java:931)
	at org.apache.tools.ant.taskdefs.optional.junit.JUnitTestRunner.main(JUnitTestRunner.java:785)


FAILED:  org.apache.hadoop.hive.cli.TestHBaseCliDriver.testCliDriver_ppd_key_ranges

Error Message:
Unexpected exception in setup

Stack Trace:
junit.framework.AssertionFailedError: Unexpected exception in setup
	at junit.framework.Assert.fail(Assert.java:50)
	at org.apache.hadoop.hive.cli.TestHBaseCliDriver.setUp(TestHBaseCliDriver.java:59)
	at junit.framework.TestCase.runBare(TestCase.java:132)
	at junit.framework.TestResult$1.protect(TestResult.java:110)
	at junit.framework.TestResult.runProtected(TestResult.java:128)
	at junit.framework.TestResult.run(TestResult.java:113)
	at junit.framework.TestCase.run(TestCase.java:124)
	at junit.framework.TestSuite.runTest(TestSuite.java:243)
	at junit.framework.TestSuite.run(TestSuite.java:238)
	at junit.extensions.TestDecorator.basicRun(TestDecorator.java:24)
	at junit.extensions.TestSetup$1.protect(TestSetup.java:23)
	at junit.framework.TestResult.runProtected(TestResult.java:128)
	at junit.extensions.TestSetup.run(TestSetup.java:27)
	at org.apache.tools.ant.taskdefs.optional.junit.JUnitTestRunner.run(JUnitTestRunner.java:422)
	at org.apache.tools.ant.taskdefs.optional.junit.JUnitTestRunner.launch(JUnitTestRunner.java:931)
	at org.apache.tools.ant.taskdefs.optional.junit.JUnitTestRunner.main(JUnitTestRunner.java:785)


FAILED:  org.apache.hadoop.hive.cli.TestCliDriver.testCliDriver_archive_excludeHadoop20

Error Message:
Unexpected exception See build/ql/tmp/hive.log, or try "ant test ... -Dtest.silent=false"
to get more logs.

Stack Trace:
junit.framework.AssertionFailedError: Unexpected exception
See build/ql/tmp/hive.log, or try "ant test ... -Dtest.silent=false" to get more logs.
	at junit.framework.Assert.fail(Assert.java:50)
	at org.apache.hadoop.hive.cli.TestCliDriver.runTest(TestCliDriver.java:6340)
	at org.apache.hadoop.hive.cli.TestCliDriver.testCliDriver_archive_excludeHadoop20(TestCliDriver.java:1477)
	at sun.reflect.NativeMethodAccessorImpl.invoke0(Native Method)
	at sun.reflect.NativeMethodAccessorImpl.invoke(NativeMethodAccessorImpl.java:39)
	at sun.reflect.DelegatingMethodAccessorImpl.invoke(DelegatingMethodAccessorImpl.java:25)
	at java.lang.reflect.Method.invoke(Method.java:597)
	at junit.framework.TestCase.runTest(TestCase.java:168)
	at junit.framework.TestCase.runBare(TestCase.java:134)
	at junit.framework.TestResult$1.protect(TestResult.java:110)
	at junit.framework.TestResult.runProtected(TestResult.java:128)
	at junit.framework.TestResult.run(TestResult.java:113)
	at junit.framework.TestCase.run(TestCase.java:124)
	at junit.framework.TestSuite.runTest(TestSuite.java:243)
	at junit.framework.TestSuite.run(TestSuite.java:238)
	at org.apache.tools.ant.taskdefs.optional.junit.JUnitTestRunner.run(JUnitTestRunner.java:422)
	at org.apache.tools.ant.taskdefs.optional.junit.JUnitTestRunner.launch(JUnitTestRunner.java:931)
	at org.apache.tools.ant.taskdefs.optional.junit.JUnitTestRunner.main(JUnitTestRunner.java:785)


FAILED:  org.apache.hadoop.hive.cli.TestCliDriver.testCliDriver_archive_multi

Error Message:
Unexpected exception See build/ql/tmp/hive.log, or try "ant test ... -Dtest.silent=false"
to get more logs.

Stack Trace:
junit.framework.AssertionFailedError: Unexpected exception
See build/ql/tmp/hive.log, or try "ant test ... -Dtest.silent=false" to get more logs.
	at junit.framework.Assert.fail(Assert.java:50)
	at org.apache.hadoop.hive.cli.TestCliDriver.runTest(TestCliDriver.java:6340)
	at org.apache.hadoop.hive.cli.TestCliDriver.testCliDriver_archive_multi(TestCliDriver.java:1481)
	at sun.reflect.NativeMethodAccessorImpl.invoke0(Native Method)
	at sun.reflect.NativeMethodAccessorImpl.invoke(NativeMethodAccessorImpl.java:39)
	at sun.reflect.DelegatingMethodAccessorImpl.invoke(DelegatingMethodAccessorImpl.java:25)
	at java.lang.reflect.Method.invoke(Method.java:597)
	at junit.framework.TestCase.runTest(TestCase.java:168)
	at junit.framework.TestCase.runBare(TestCase.java:134)
	at junit.framework.TestResult$1.protect(TestResult.java:110)
	at junit.framework.TestResult.runProtected(TestResult.java:128)
	at junit.framework.TestResult.run(TestResult.java:113)
	at junit.framework.TestCase.run(TestCase.java:124)
	at junit.framework.TestSuite.runTest(TestSuite.java:243)
	at junit.framework.TestSuite.run(TestSuite.java:238)
	at org.apache.tools.ant.taskdefs.optional.junit.JUnitTestRunner.run(JUnitTestRunner.java:422)
	at org.apache.tools.ant.taskdefs.optional.junit.JUnitTestRunner.launch(JUnitTestRunner.java:931)
	at org.apache.tools.ant.taskdefs.optional.junit.JUnitTestRunner.main(JUnitTestRunner.java:785)


FAILED:  org.apache.hadoop.hive.cli.TestCliDriver.testCliDriver_infer_bucket_sort_list_bucket

Error Message:
Unexpected exception See build/ql/tmp/hive.log, or try "ant test ... -Dtest.silent=false"
to get more logs.

Stack Trace:
junit.framework.AssertionFailedError: Unexpected exception
See build/ql/tmp/hive.log, or try "ant test ... -Dtest.silent=false" to get more logs.
	at junit.framework.Assert.fail(Assert.java:50)
	at org.apache.hadoop.hive.cli.TestCliDriver.runTest(TestCliDriver.java:6340)
	at org.apache.hadoop.hive.cli.TestCliDriver.testCliDriver_infer_bucket_sort_list_bucket(TestCliDriver.java:2981)
	at sun.reflect.NativeMethodAccessorImpl.invoke0(Native Method)
	at sun.reflect.NativeMethodAccessorImpl.invoke(NativeMethodAccessorImpl.java:39)
	at sun.reflect.DelegatingMethodAccessorImpl.invoke(DelegatingMethodAccessorImpl.java:25)
	at java.lang.reflect.Method.invoke(Method.java:597)
	at junit.framework.TestCase.runTest(TestCase.java:168)
	at junit.framework.TestCase.runBare(TestCase.java:134)
	at junit.framework.TestResult$1.protect(TestResult.java:110)
	at junit.framework.TestResult.runProtected(TestResult.java:128)
	at junit.framework.TestResult.run(TestResult.java:113)
	at junit.framework.TestCase.run(TestCase.java:124)
	at junit.framework.TestSuite.runTest(TestSuite.java:243)
	at junit.framework.TestSuite.run(TestSuite.java:238)
	at org.apache.tools.ant.taskdefs.optional.junit.JUnitTestRunner.run(JUnitTestRunner.java:422)
	at org.apache.tools.ant.taskdefs.optional.junit.JUnitTestRunner.launch(JUnitTestRunner.java:931)
	at org.apache.tools.ant.taskdefs.optional.junit.JUnitTestRunner.main(JUnitTestRunner.java:785)


FAILED:  org.apache.hadoop.hive.cli.TestCliDriver.testCliDriver_join_1to1

Error Message:
Unexpected exception See build/ql/tmp/hive.log, or try "ant test ... -Dtest.silent=false"
to get more logs.

Stack Trace:
junit.framework.AssertionFailedError: Unexpected exception
See build/ql/tmp/hive.log, or try "ant test ... -Dtest.silent=false" to get more logs.
	at junit.framework.Assert.fail(Assert.java:50)
	at org.apache.hadoop.hive.cli.TestCliDriver.runTest(TestCliDriver.java:6340)
	at org.apache.hadoop.hive.cli.TestCliDriver.testCliDriver_join_1to1(TestCliDriver.java:3573)
	at sun.reflect.NativeMethodAccessorImpl.invoke0(Native Method)
	at sun.reflect.NativeMethodAccessorImpl.invoke(NativeMethodAccessorImpl.java:39)
	at sun.reflect.DelegatingMethodAccessorImpl.invoke(DelegatingMethodAccessorImpl.java:25)
	at java.lang.reflect.Method.invoke(Method.java:597)
	at junit.framework.TestCase.runTest(TestCase.java:168)
	at junit.framework.TestCase.runBare(TestCase.java:134)
	at junit.framework.TestResult$1.protect(TestResult.java:110)
	at junit.framework.TestResult.runProtected(TestResult.java:128)
	at junit.framework.TestResult.run(TestResult.java:113)
	at junit.framework.TestCase.run(TestCase.java:124)
	at junit.framework.TestSuite.runTest(TestSuite.java:243)
	at junit.framework.TestSuite.run(TestSuite.java:238)
	at org.apache.tools.ant.taskdefs.optional.junit.JUnitTestRunner.run(JUnitTestRunner.java:422)
	at org.apache.tools.ant.taskdefs.optional.junit.JUnitTestRunner.launch(JUnitTestRunner.java:931)
	at org.apache.tools.ant.taskdefs.optional.junit.JUnitTestRunner.main(JUnitTestRunner.java:785)


FAILED:  org.apache.hadoop.hive.cli.TestCliDriver.testCliDriver_list_bucket_dml_13

Error Message:
Unexpected exception See build/ql/tmp/hive.log, or try "ant test ... -Dtest.silent=false"
to get more logs.

Stack Trace:
junit.framework.AssertionFailedError: Unexpected exception
See build/ql/tmp/hive.log, or try "ant test ... -Dtest.silent=false" to get more logs.
	at junit.framework.Assert.fail(Assert.java:50)
	at org.apache.hadoop.hive.cli.TestCliDriver.runTest(TestCliDriver.java:6340)
	at org.apache.hadoop.hive.cli.TestCliDriver.testCliDriver_list_bucket_dml_13(TestCliDriver.java:3697)
	at sun.reflect.NativeMethodAccessorImpl.invoke0(Native Method)
	at sun.reflect.NativeMethodAccessorImpl.invoke(NativeMethodAccessorImpl.java:39)
	at sun.reflect.DelegatingMethodAccessorImpl.invoke(DelegatingMethodAccessorImpl.java:25)
	at java.lang.reflect.Method.invoke(Method.java:597)
	at junit.framework.TestCase.runTest(TestCase.java:168)
	at junit.framework.TestCase.runBare(TestCase.java:134)
	at junit.framework.TestResult$1.protect(TestResult.java:110)
	at junit.framework.TestResult.runProtected(TestResult.java:128)
	at junit.framework.TestResult.run(TestResult.java:113)
	at junit.framework.TestCase.run(TestCase.java:124)
	at junit.framework.TestSuite.runTest(TestSuite.java:243)
	at junit.framework.TestSuite.run(TestSuite.java:238)
	at org.apache.tools.ant.taskdefs.optional.junit.JUnitTestRunner.run(JUnitTestRunner.java:422)
	at org.apache.tools.ant.taskdefs.optional.junit.JUnitTestRunner.launch(JUnitTestRunner.java:931)
	at org.apache.tools.ant.taskdefs.optional.junit.JUnitTestRunner.main(JUnitTestRunner.java:785)


FAILED:  org.apache.hadoop.hive.cli.TestCliDriver.testCliDriver_ptf_npath

Error Message:
Unexpected exception See build/ql/tmp/hive.log, or try "ant test ... -Dtest.silent=false"
to get more logs.

Stack Trace:
junit.framework.AssertionFailedError: Unexpected exception
See build/ql/tmp/hive.log, or try "ant test ... -Dtest.silent=false" to get more logs.
	at junit.framework.Assert.fail(Assert.java:50)
	at org.apache.hadoop.hive.cli.TestCliDriver.runTest(TestCliDriver.java:6340)
	at org.apache.hadoop.hive.cli.TestCliDriver.testCliDriver_ptf_npath(TestCliDriver.java:4461)
	at sun.reflect.NativeMethodAccessorImpl.invoke0(Native Method)
	at sun.reflect.NativeMethodAccessorImpl.invoke(NativeMethodAccessorImpl.java:39)
	at sun.reflect.DelegatingMethodAccessorImpl.invoke(DelegatingMethodAccessorImpl.java:25)
	at java.lang.reflect.Method.invoke(Method.java:597)
	at junit.framework.TestCase.runTest(TestCase.java:168)
	at junit.framework.TestCase.runBare(TestCase.java:134)
	at junit.framework.TestResult$1.protect(TestResult.java:110)
	at junit.framework.TestResult.runProtected(TestResult.java:128)
	at junit.framework.TestResult.run(TestResult.java:113)
	at junit.framework.TestCase.run(TestCase.java:124)
	at junit.framework.TestSuite.runTest(TestSuite.java:243)
	at junit.framework.TestSuite.run(TestSuite.java:238)
	at org.apache.tools.ant.taskdefs.optional.junit.JUnitTestRunner.run(JUnitTestRunner.java:422)
	at org.apache.tools.ant.taskdefs.optional.junit.JUnitTestRunner.launch(JUnitTestRunner.java:931)
	at org.apache.tools.ant.taskdefs.optional.junit.JUnitTestRunner.main(JUnitTestRunner.java:785)


FAILED:  org.apache.hadoop.hive.cli.TestCliDriver.testCliDriver_stats_partscan_1

Error Message:
Unexpected exception See build/ql/tmp/hive.log, or try "ant test ... -Dtest.silent=false"
to get more logs.

Stack Trace:
junit.framework.AssertionFailedError: Unexpected exception
See build/ql/tmp/hive.log, or try "ant test ... -Dtest.silent=false" to get more logs.
	at junit.framework.Assert.fail(Assert.java:50)
	at org.apache.hadoop.hive.cli.TestCliDriver.runTest(TestCliDriver.java:6340)
	at org.apache.hadoop.hive.cli.TestCliDriver.testCliDriver_stats_partscan_1(TestCliDriver.java:5101)
	at sun.reflect.NativeMethodAccessorImpl.invoke0(Native Method)
	at sun.reflect.NativeMethodAccessorImpl.invoke(NativeMethodAccessorImpl.java:39)
	at sun.reflect.DelegatingMethodAccessorImpl.invoke(DelegatingMethodAccessorImpl.java:25)
	at java.lang.reflect.Method.invoke(Method.java:597)
	at junit.framework.TestCase.runTest(TestCase.java:168)
	at junit.framework.TestCase.runBare(TestCase.java:134)
	at junit.framework.TestResult$1.protect(TestResult.java:110)
	at junit.framework.TestResult.runProtected(TestResult.java:128)
	at junit.framework.TestResult.run(TestResult.java:113)
	at junit.framework.TestCase.run(TestCase.java:124)
	at junit.framework.TestSuite.runTest(TestSuite.java:243)
	at junit.framework.TestSuite.run(TestSuite.java:238)
	at org.apache.tools.ant.taskdefs.optional.junit.JUnitTestRunner.run(JUnitTestRunner.java:422)
	at org.apache.tools.ant.taskdefs.optional.junit.JUnitTestRunner.launch(JUnitTestRunner.java:931)
	at org.apache.tools.ant.taskdefs.optional.junit.JUnitTestRunner.main(JUnitTestRunner.java:785)


FAILED:  org.apache.hadoop.hive.cli.TestCliDriver.testCliDriver_udaf_percentile_approx

Error Message:
Unexpected exception See build/ql/tmp/hive.log, or try "ant test ... -Dtest.silent=false"
to get more logs.

Stack Trace:
junit.framework.AssertionFailedError: Unexpected exception
See build/ql/tmp/hive.log, or try "ant test ... -Dtest.silent=false" to get more logs.
	at junit.framework.Assert.fail(Assert.java:50)
	at org.apache.hadoop.hive.cli.TestCliDriver.runTest(TestCliDriver.java:6340)
	at org.apache.hadoop.hive.cli.TestCliDriver.testCliDriver_udaf_percentile_approx(TestCliDriver.java:5241)
	at sun.reflect.NativeMethodAccessorImpl.invoke0(Native Method)
	at sun.reflect.NativeMethodAccessorImpl.invoke(NativeMethodAccessorImpl.java:39)
	at sun.reflect.DelegatingMethodAccessorImpl.invoke(DelegatingMethodAccessorImpl.java:25)
	at java.lang.reflect.Method.invoke(Method.java:597)
	at junit.framework.TestCase.runTest(TestCase.java:168)
	at junit.framework.TestCase.runBare(TestCase.java:134)
	at junit.framework.TestResult$1.protect(TestResult.java:110)
	at junit.framework.TestResult.runProtected(TestResult.java:128)
	at junit.framework.TestResult.run(TestResult.java:113)
	at junit.framework.TestCase.run(TestCase.java:124)
	at junit.framework.TestSuite.runTest(TestSuite.java:243)
	at junit.framework.TestSuite.run(TestSuite.java:238)
	at org.apache.tools.ant.taskdefs.optional.junit.JUnitTestRunner.run(JUnitTestRunner.java:422)
	at org.apache.tools.ant.taskdefs.optional.junit.JUnitTestRunner.launch(JUnitTestRunner.java:931)
	at org.apache.tools.ant.taskdefs.optional.junit.JUnitTestRunner.main(JUnitTestRunner.java:785)


FAILED:  org.apache.hadoop.hive.cli.TestMinimrCliDriver.testCliDriver_parallel_orderby

Error Message:
Unexpected exception See build/ql/tmp/hive.log, or try "ant test ... -Dtest.silent=false"
to get more logs.

Stack Trace:
junit.framework.AssertionFailedError: Unexpected exception
See build/ql/tmp/hive.log, or try "ant test ... -Dtest.silent=false" to get more logs.
	at junit.framework.Assert.fail(Assert.java:50)
	at org.apache.hadoop.hive.cli.TestMinimrCliDriver.runTest(TestMinimrCliDriver.java:295)
	at org.apache.hadoop.hive.cli.TestMinimrCliDriver.testCliDriver_parallel_orderby(TestMinimrCliDriver.java:224)
	at sun.reflect.NativeMethodAccessorImpl.invoke0(Native Method)
	at sun.reflect.NativeMethodAccessorImpl.invoke(NativeMethodAccessorImpl.java:39)
	at sun.reflect.DelegatingMethodAccessorImpl.invoke(DelegatingMethodAccessorImpl.java:25)
	at java.lang.reflect.Method.invoke(Method.java:597)
	at junit.framework.TestCase.runTest(TestCase.java:168)
	at junit.framework.TestCase.runBare(TestCase.java:134)
	at junit.framework.TestResult$1.protect(TestResult.java:110)
	at junit.framework.TestResult.runProtected(TestResult.java:128)
	at junit.framework.TestResult.run(TestResult.java:113)
	at junit.framework.TestCase.run(TestCase.java:124)
	at junit.framework.TestSuite.runTest(TestSuite.java:243)
	at junit.framework.TestSuite.run(TestSuite.java:238)
	at org.apache.tools.ant.taskdefs.optional.junit.JUnitTestRunner.run(JUnitTestRunner.java:422)
	at org.apache.tools.ant.taskdefs.optional.junit.JUnitTestRunner.launch(JUnitTestRunner.java:931)
	at org.apache.tools.ant.taskdefs.optional.junit.JUnitTestRunner.main(JUnitTestRunner.java:785)


FAILED:  org.apache.hadoop.hive.cli.TestMinimrCliDriver.testCliDriver_load_hdfs_file_with_space_in_the_name

Error Message:
Unexpected exception See build/ql/tmp/hive.log, or try "ant test ... -Dtest.silent=false"
to get more logs.

Stack Trace:
junit.framework.AssertionFailedError: Unexpected exception
See build/ql/tmp/hive.log, or try "ant test ... -Dtest.silent=false" to get more logs.
	at junit.framework.Assert.fail(Assert.java:50)
	at org.apache.hadoop.hive.cli.TestMinimrCliDriver.runTest(TestMinimrCliDriver.java:295)
	at org.apache.hadoop.hive.cli.TestMinimrCliDriver.testCliDriver_load_hdfs_file_with_space_in_the_name(TestMinimrCliDriver.java:216)
	at sun.reflect.NativeMethodAccessorImpl.invoke0(Native Method)
	at sun.reflect.NativeMethodAccessorImpl.invoke(NativeMethodAccessorImpl.java:39)
	at sun.reflect.DelegatingMethodAccessorImpl.invoke(DelegatingMethodAccessorImpl.java:25)
	at java.lang.reflect.Method.invoke(Method.java:597)
	at junit.framework.TestCase.runTest(TestCase.java:168)
	at junit.framework.TestCase.runBare(TestCase.java:134)
	at junit.framework.TestResult$1.protect(TestResult.java:110)
	at junit.framework.TestResult.runProtected(TestResult.java:128)
	at junit.framework.TestResult.run(TestResult.java:113)
	at junit.framework.TestCase.run(TestCase.java:124)
	at junit.framework.TestSuite.runTest(TestSuite.java:243)
	at junit.framework.TestSuite.run(TestSuite.java:238)
	at org.apache.tools.ant.taskdefs.optional.junit.JUnitTestRunner.run(JUnitTestRunner.java:422)
	at org.apache.tools.ant.taskdefs.optional.junit.JUnitTestRunner.launch(JUnitTestRunner.java:931)
	at org.apache.tools.ant.taskdefs.optional.junit.JUnitTestRunner.main(JUnitTestRunner.java:785)




The Apache Jenkins build system has built Hive-trunk-hadoop2 (build #266)

Status: Failure

Check console output at https://builds.apache.org/job/Hive-trunk-hadoop2/266/ to view the
results.
Mime
  • Unnamed multipart/mixed (inline, None, 0 bytes)
View raw message