hive-dev mailing list archives

Site index · List index
Message view « Date » · « Thread »
Top « Date » · « Thread »
From Apache Jenkins Server <jenk...@builds.apache.org>
Subject Build failed in Jenkins: Hive-0.10.0-SNAPSHOT-h0.20.1 #178
Date Sun, 16 Jun 2013 16:03:03 GMT
See <https://builds.apache.org/job/Hive-0.10.0-SNAPSHOT-h0.20.1/178/>

------------------------------------------
[...truncated 6160 lines...]
init:
     [echo] Project: contrib

create-dirs:
     [echo] Project: service
    [mkdir] Created dir: /x1/jenkins/jenkins-slave/workspace/Hive-0.10.0-SNAPSHOT-h0.20.1/hive/build/service
    [mkdir] Created dir: /x1/jenkins/jenkins-slave/workspace/Hive-0.10.0-SNAPSHOT-h0.20.1/hive/build/service/classes
    [mkdir] Created dir: /x1/jenkins/jenkins-slave/workspace/Hive-0.10.0-SNAPSHOT-h0.20.1/hive/build/service/test
    [mkdir] Created dir: /x1/jenkins/jenkins-slave/workspace/Hive-0.10.0-SNAPSHOT-h0.20.1/hive/build/service/test/src
    [mkdir] Created dir: /x1/jenkins/jenkins-slave/workspace/Hive-0.10.0-SNAPSHOT-h0.20.1/hive/build/service/test/classes
    [mkdir] Created dir: /x1/jenkins/jenkins-slave/workspace/Hive-0.10.0-SNAPSHOT-h0.20.1/hive/build/service/test/resources
     [copy] Warning: /x1/jenkins/jenkins-slave/workspace/Hive-0.10.0-SNAPSHOT-h0.20.1/hive/service/src/test/resources
does not exist.

init:
     [echo] Project: service

create-dirs:
     [echo] Project: cli
    [mkdir] Created dir: /x1/jenkins/jenkins-slave/workspace/Hive-0.10.0-SNAPSHOT-h0.20.1/hive/build/cli
    [mkdir] Created dir: /x1/jenkins/jenkins-slave/workspace/Hive-0.10.0-SNAPSHOT-h0.20.1/hive/build/cli/classes
    [mkdir] Created dir: /x1/jenkins/jenkins-slave/workspace/Hive-0.10.0-SNAPSHOT-h0.20.1/hive/build/cli/test
    [mkdir] Created dir: /x1/jenkins/jenkins-slave/workspace/Hive-0.10.0-SNAPSHOT-h0.20.1/hive/build/cli/test/src
    [mkdir] Created dir: /x1/jenkins/jenkins-slave/workspace/Hive-0.10.0-SNAPSHOT-h0.20.1/hive/build/cli/test/classes
    [mkdir] Created dir: /x1/jenkins/jenkins-slave/workspace/Hive-0.10.0-SNAPSHOT-h0.20.1/hive/build/cli/test/resources
     [copy] Warning: /x1/jenkins/jenkins-slave/workspace/Hive-0.10.0-SNAPSHOT-h0.20.1/hive/cli/src/test/resources
does not exist.

init:
     [echo] Project: cli

create-dirs:
     [echo] Project: jdbc
    [mkdir] Created dir: /x1/jenkins/jenkins-slave/workspace/Hive-0.10.0-SNAPSHOT-h0.20.1/hive/build/jdbc
    [mkdir] Created dir: /x1/jenkins/jenkins-slave/workspace/Hive-0.10.0-SNAPSHOT-h0.20.1/hive/build/jdbc/classes
    [mkdir] Created dir: /x1/jenkins/jenkins-slave/workspace/Hive-0.10.0-SNAPSHOT-h0.20.1/hive/build/jdbc/test
    [mkdir] Created dir: /x1/jenkins/jenkins-slave/workspace/Hive-0.10.0-SNAPSHOT-h0.20.1/hive/build/jdbc/test/src
    [mkdir] Created dir: /x1/jenkins/jenkins-slave/workspace/Hive-0.10.0-SNAPSHOT-h0.20.1/hive/build/jdbc/test/classes
    [mkdir] Created dir: /x1/jenkins/jenkins-slave/workspace/Hive-0.10.0-SNAPSHOT-h0.20.1/hive/build/jdbc/test/resources
     [copy] Warning: /x1/jenkins/jenkins-slave/workspace/Hive-0.10.0-SNAPSHOT-h0.20.1/hive/jdbc/src/test/resources
does not exist.

init:
     [echo] Project: jdbc

create-dirs:
     [echo] Project: hwi
    [mkdir] Created dir: /x1/jenkins/jenkins-slave/workspace/Hive-0.10.0-SNAPSHOT-h0.20.1/hive/build/hwi
    [mkdir] Created dir: /x1/jenkins/jenkins-slave/workspace/Hive-0.10.0-SNAPSHOT-h0.20.1/hive/build/hwi/classes
    [mkdir] Created dir: /x1/jenkins/jenkins-slave/workspace/Hive-0.10.0-SNAPSHOT-h0.20.1/hive/build/hwi/test
    [mkdir] Created dir: /x1/jenkins/jenkins-slave/workspace/Hive-0.10.0-SNAPSHOT-h0.20.1/hive/build/hwi/test/src
    [mkdir] Created dir: /x1/jenkins/jenkins-slave/workspace/Hive-0.10.0-SNAPSHOT-h0.20.1/hive/build/hwi/test/classes
    [mkdir] Created dir: /x1/jenkins/jenkins-slave/workspace/Hive-0.10.0-SNAPSHOT-h0.20.1/hive/build/hwi/test/resources
     [copy] Warning: /x1/jenkins/jenkins-slave/workspace/Hive-0.10.0-SNAPSHOT-h0.20.1/hive/hwi/src/test/resources
does not exist.

init:
     [echo] Project: hwi

create-dirs:
     [echo] Project: hbase-handler
    [mkdir] Created dir: /x1/jenkins/jenkins-slave/workspace/Hive-0.10.0-SNAPSHOT-h0.20.1/hive/build/hbase-handler
    [mkdir] Created dir: /x1/jenkins/jenkins-slave/workspace/Hive-0.10.0-SNAPSHOT-h0.20.1/hive/build/hbase-handler/classes
    [mkdir] Created dir: /x1/jenkins/jenkins-slave/workspace/Hive-0.10.0-SNAPSHOT-h0.20.1/hive/build/hbase-handler/test
    [mkdir] Created dir: /x1/jenkins/jenkins-slave/workspace/Hive-0.10.0-SNAPSHOT-h0.20.1/hive/build/hbase-handler/test/src
    [mkdir] Created dir: /x1/jenkins/jenkins-slave/workspace/Hive-0.10.0-SNAPSHOT-h0.20.1/hive/build/hbase-handler/test/classes
    [mkdir] Created dir: /x1/jenkins/jenkins-slave/workspace/Hive-0.10.0-SNAPSHOT-h0.20.1/hive/build/hbase-handler/test/resources
     [copy] Warning: /x1/jenkins/jenkins-slave/workspace/Hive-0.10.0-SNAPSHOT-h0.20.1/hive/hbase-handler/src/test/resources
does not exist.

init:
     [echo] Project: hbase-handler

create-dirs:
     [echo] Project: pdk
    [mkdir] Created dir: /x1/jenkins/jenkins-slave/workspace/Hive-0.10.0-SNAPSHOT-h0.20.1/hive/build/pdk
    [mkdir] Created dir: /x1/jenkins/jenkins-slave/workspace/Hive-0.10.0-SNAPSHOT-h0.20.1/hive/build/pdk/classes
    [mkdir] Created dir: /x1/jenkins/jenkins-slave/workspace/Hive-0.10.0-SNAPSHOT-h0.20.1/hive/build/pdk/test
    [mkdir] Created dir: /x1/jenkins/jenkins-slave/workspace/Hive-0.10.0-SNAPSHOT-h0.20.1/hive/build/pdk/test/src
    [mkdir] Created dir: /x1/jenkins/jenkins-slave/workspace/Hive-0.10.0-SNAPSHOT-h0.20.1/hive/build/pdk/test/classes
    [mkdir] Created dir: /x1/jenkins/jenkins-slave/workspace/Hive-0.10.0-SNAPSHOT-h0.20.1/hive/build/pdk/test/resources
     [copy] Warning: /x1/jenkins/jenkins-slave/workspace/Hive-0.10.0-SNAPSHOT-h0.20.1/hive/pdk/src/test/resources
does not exist.

init:
     [echo] Project: pdk

create-dirs:
     [echo] Project: builtins
    [mkdir] Created dir: /x1/jenkins/jenkins-slave/workspace/Hive-0.10.0-SNAPSHOT-h0.20.1/hive/build/builtins
    [mkdir] Created dir: /x1/jenkins/jenkins-slave/workspace/Hive-0.10.0-SNAPSHOT-h0.20.1/hive/build/builtins/classes
    [mkdir] Created dir: /x1/jenkins/jenkins-slave/workspace/Hive-0.10.0-SNAPSHOT-h0.20.1/hive/build/builtins/test
    [mkdir] Created dir: /x1/jenkins/jenkins-slave/workspace/Hive-0.10.0-SNAPSHOT-h0.20.1/hive/build/builtins/test/src
    [mkdir] Created dir: /x1/jenkins/jenkins-slave/workspace/Hive-0.10.0-SNAPSHOT-h0.20.1/hive/build/builtins/test/classes
    [mkdir] Created dir: /x1/jenkins/jenkins-slave/workspace/Hive-0.10.0-SNAPSHOT-h0.20.1/hive/build/builtins/test/resources
     [copy] Warning: /x1/jenkins/jenkins-slave/workspace/Hive-0.10.0-SNAPSHOT-h0.20.1/hive/builtins/src/test/resources
does not exist.

init:
     [echo] Project: builtins

jar:
     [echo] Project: hive

create-dirs:
     [echo] Project: shims
     [copy] Warning: /x1/jenkins/jenkins-slave/workspace/Hive-0.10.0-SNAPSHOT-h0.20.1/hive/shims/src/test/resources
does not exist.

init:
     [echo] Project: shims

ivy-init-settings:
     [echo] Project: shims

ivy-resolve:
     [echo] Project: shims
[ivy:resolve] :: loading settings :: file = /x1/jenkins/jenkins-slave/workspace/Hive-0.10.0-SNAPSHOT-h0.20.1/hive/ivy/ivysettings.xml
[ivy:resolve] downloading http://repo1.maven.org/maven2/org/apache/thrift/libthrift/0.9.0/libthrift-0.9.0.jar
...
[ivy:resolve] .................................... (339kB)
[ivy:resolve] .. (0kB)
[ivy:resolve] 	[SUCCESSFUL ] org.apache.thrift#libthrift;0.9.0!libthrift.jar (87ms)
[ivy:report] Processing /x1/jenkins/jenkins-slave/workspace/Hive-0.10.0-SNAPSHOT-h0.20.1/hive/build/ivy/resolution-cache/org.apache.hive-hive-shims-default.xml
to /x1/jenkins/jenkins-slave/workspace/Hive-0.10.0-SNAPSHOT-h0.20.1/hive/build/ivy/report/org.apache.hive-hive-shims-default.html

ivy-retrieve:
     [echo] Project: shims

compile:
     [echo] Project: shims
     [echo] Building shims 0.20

build-shims:
     [echo] Project: shims
     [echo] Compiling /x1/jenkins/jenkins-slave/workspace/Hive-0.10.0-SNAPSHOT-h0.20.1/hive/shims/src/common/java;/x1/jenkins/jenkins-slave/workspace/Hive-0.10.0-SNAPSHOT-h0.20.1/hive/shims/src/0.20/java
against hadoop 0.20.2 (/x1/jenkins/jenkins-slave/workspace/Hive-0.10.0-SNAPSHOT-h0.20.1/hive/build/hadoopcore/hadoop-0.20.2)

ivy-init-settings:
     [echo] Project: shims

ivy-resolve-hadoop-shim:
     [echo] Project: shims
[ivy:resolve] :: loading settings :: file = /x1/jenkins/jenkins-slave/workspace/Hive-0.10.0-SNAPSHOT-h0.20.1/hive/ivy/ivysettings.xml
[ivy:resolve] downloading http://repo1.maven.org/maven2/commons-cli/commons-cli/1.2/commons-cli-1.2.jar
...
[ivy:resolve] ..... (40kB)
[ivy:resolve] .. (0kB)
[ivy:resolve] downloading http://repo1.maven.org/maven2/xmlenc/xmlenc/0.52/xmlenc-0.52.jar
...
[ivy:resolve] .. (14kB)
[ivy:resolve] .. (0kB)
[ivy:resolve] downloading http://repo1.maven.org/maven2/commons-httpclient/commons-httpclient/3.0.1/commons-httpclient-3.0.1.jar
...
[ivy:resolve] ............................. (273kB)
[ivy:resolve] downloading http://repo1.maven.org/maven2/org/mortbay/jetty/jsp-api-2.1/6.1.14/jsp-api-2.1-6.1.14.jar
...
[ivy:resolve] ............... (131kB)
[ivy:resolve] .. (0kB)
[ivy:resolve] 	[SUCCESSFUL ] org.mortbay.jetty#jsp-api-2.1;6.1.14!jsp-api-2.1.jar (65ms)
[ivy:resolve] downloading http://repo1.maven.org/maven2/net/sf/kosmosfs/kfs/0.3/kfs-0.3.jar
...
[ivy:resolve] .. (11kB)
[ivy:resolve] .. (0kB)
[ivy:resolve] downloading http://repo1.maven.org/maven2/junit/junit/4.5/junit-4.5.jar ...
[ivy:resolve] ...................................... (194kB)
[ivy:resolve] downloading http://repo1.maven.org/maven2/org/apache/ftpserver/ftpserver-deprecated/1.0.0-M2/ftpserver-deprecated-1.0.0-M2.jar
...
[ivy:resolve] .... (31kB)
[ivy:resolve] .. (0kB)
[ivy:resolve] 	[SUCCESSFUL ] org.apache.ftpserver#ftpserver-deprecated;1.0.0-M2!ftpserver-deprecated.jar
(49ms)
[ivy:resolve] 
[ivy:resolve] :: problems summary ::
[ivy:resolve] :::: WARNINGS
[ivy:resolve] 	problem while downloading module descriptor: http://repo1.maven.org/maven2/tomcat/jasper-compiler/5.5.12/jasper-compiler-5.5.12.pom:
/home/jenkins/.ivy2/cache/tomcat/jasper-compiler/ivy-5.5.12.xml.original.part (No such file
or directory) (30ms)
[ivy:resolve] 		module not found: tomcat#jasper-compiler;5.5.12
[ivy:resolve] 	==== local: tried
[ivy:resolve] 	  /home/jenkins/.ivy2/local/tomcat/jasper-compiler/5.5.12/ivys/ivy.xml
[ivy:resolve] 	  -- artifact tomcat#jasper-compiler;5.5.12!jasper-compiler.jar:
[ivy:resolve] 	  /home/jenkins/.ivy2/local/tomcat/jasper-compiler/5.5.12/jars/jasper-compiler.jar
[ivy:resolve] 	==== apache-snapshot: tried
[ivy:resolve] 	  https://repository.apache.org/content/repositories/snapshots/tomcat/jasper-compiler/5.5.12/jasper-compiler-5.5.12.pom
[ivy:resolve] 	  -- artifact tomcat#jasper-compiler;5.5.12!jasper-compiler.jar:
[ivy:resolve] 	  https://repository.apache.org/content/repositories/snapshots/tomcat/jasper-compiler/5.5.12/jasper-compiler-5.5.12.jar
[ivy:resolve] 	==== maven2: tried
[ivy:resolve] 	  http://repo1.maven.org/maven2/tomcat/jasper-compiler/5.5.12/jasper-compiler-5.5.12.pom
[ivy:resolve] 	==== datanucleus-repo: tried
[ivy:resolve] 	  -- artifact tomcat#jasper-compiler;5.5.12!jasper-compiler.jar:
[ivy:resolve] 	  http://www.datanucleus.org/downloads/maven2/tomcat/jasper-compiler/5.5.12/jasper-compiler-5.5.12.jar
[ivy:resolve] 	==== sourceforge: tried
[ivy:resolve] 	  -- artifact tomcat#jasper-compiler;5.5.12!jasper-compiler.jar:
[ivy:resolve] 	  http://www.sourceforge.net/projects/jasper-compiler/files/jasper-compiler//jasper-compiler-5.5.12.jar
[ivy:resolve] 	problem while downloading module descriptor: http://repo1.maven.org/maven2/org/apache/hadoop/hadoop-tools/0.20.2/hadoop-tools-0.20.2.pom:
/home/jenkins/.ivy2/cache/org.apache.hadoop/hadoop-tools/ivy-0.20.2.xml.original.part (No
such file or directory) (30ms)
[ivy:resolve] 		module not found: org.apache.hadoop#hadoop-tools;0.20.2
[ivy:resolve] 	==== local: tried
[ivy:resolve] 	  /home/jenkins/.ivy2/local/org.apache.hadoop/hadoop-tools/0.20.2/ivys/ivy.xml
[ivy:resolve] 	  -- artifact org.apache.hadoop#hadoop-tools;0.20.2!hadoop-tools.jar:
[ivy:resolve] 	  /home/jenkins/.ivy2/local/org.apache.hadoop/hadoop-tools/0.20.2/jars/hadoop-tools.jar
[ivy:resolve] 	==== apache-snapshot: tried
[ivy:resolve] 	  https://repository.apache.org/content/repositories/snapshots/org/apache/hadoop/hadoop-tools/0.20.2/hadoop-tools-0.20.2.pom
[ivy:resolve] 	  -- artifact org.apache.hadoop#hadoop-tools;0.20.2!hadoop-tools.jar:
[ivy:resolve] 	  https://repository.apache.org/content/repositories/snapshots/org/apache/hadoop/hadoop-tools/0.20.2/hadoop-tools-0.20.2.jar
[ivy:resolve] 	==== maven2: tried
[ivy:resolve] 	  http://repo1.maven.org/maven2/org/apache/hadoop/hadoop-tools/0.20.2/hadoop-tools-0.20.2.pom
[ivy:resolve] 	==== datanucleus-repo: tried
[ivy:resolve] 	  -- artifact org.apache.hadoop#hadoop-tools;0.20.2!hadoop-tools.jar:
[ivy:resolve] 	  http://www.datanucleus.org/downloads/maven2/org/apache/hadoop/hadoop-tools/0.20.2/hadoop-tools-0.20.2.jar
[ivy:resolve] 	==== sourceforge: tried
[ivy:resolve] 	  -- artifact org.apache.hadoop#hadoop-tools;0.20.2!hadoop-tools.jar:
[ivy:resolve] 	  http://www.sourceforge.net/projects/hadoop-tools/files/hadoop-tools//hadoop-tools-0.20.2.jar
[ivy:resolve] 		[FAILED     ] commons-cli#commons-cli;1.2!commons-cli.jar: /home/jenkins/.ivy2/cache/commons-cli/commons-cli/jars/commons-cli-1.2.jar.part
(No such file or directory) (87ms)
[ivy:resolve] 		[FAILED     ] xmlenc#xmlenc;0.52!xmlenc.jar: /home/jenkins/.ivy2/cache/xmlenc/xmlenc/jars/xmlenc-0.52.jar.part
(No such file or directory) (36ms)
[ivy:resolve] 		[FAILED     ] commons-httpclient#commons-httpclient;3.0.1!commons-httpclient.jar:
Downloaded file size doesn't match expected Content Length for http://repo1.maven.org/maven2/commons-httpclient/commons-httpclient/3.0.1/commons-httpclient-3.0.1.jar.
Please retry. (60ms)
[ivy:resolve] 		[FAILED     ] commons-httpclient#commons-httpclient;3.0.1!commons-httpclient.jar:
 (0ms)
[ivy:resolve] 	==== local: tried
[ivy:resolve] 	  /home/jenkins/.ivy2/local/commons-httpclient/commons-httpclient/3.0.1/jars/commons-httpclient.jar
[ivy:resolve] 	==== apache-snapshot: tried
[ivy:resolve] 	  https://repository.apache.org/content/repositories/snapshots/commons-httpclient/commons-httpclient/3.0.1/commons-httpclient-3.0.1.jar
[ivy:resolve] 	==== maven2: tried
[ivy:resolve] 	  http://repo1.maven.org/maven2/commons-httpclient/commons-httpclient/3.0.1/commons-httpclient-3.0.1.jar
[ivy:resolve] 	==== datanucleus-repo: tried
[ivy:resolve] 	  http://www.datanucleus.org/downloads/maven2/commons-httpclient/commons-httpclient/3.0.1/commons-httpclient-3.0.1.jar
[ivy:resolve] 	==== sourceforge: tried
[ivy:resolve] 	  http://www.sourceforge.net/projects/commons-httpclient/files/commons-httpclient//commons-httpclient-3.0.1.jar
[ivy:resolve] 		[FAILED     ] net.sf.kosmosfs#kfs;0.3!kfs.jar: /home/jenkins/.ivy2/cache/net.sf.kosmosfs/kfs/jars/kfs-0.3.jar.part
(No such file or directory) (36ms)
[ivy:resolve] 		[FAILED     ] junit#junit;4.5!junit.jar: Downloaded file size doesn't match
expected Content Length for http://repo1.maven.org/maven2/junit/junit/4.5/junit-4.5.jar. Please
retry. (35ms)
[ivy:resolve] 		[FAILED     ] junit#junit;4.5!junit.jar:  (0ms)
[ivy:resolve] 	==== local: tried
[ivy:resolve] 	  /home/jenkins/.ivy2/local/junit/junit/4.5/jars/junit.jar
[ivy:resolve] 	==== apache-snapshot: tried
[ivy:resolve] 	  https://repository.apache.org/content/repositories/snapshots/junit/junit/4.5/junit-4.5.jar
[ivy:resolve] 	==== maven2: tried
[ivy:resolve] 	  http://repo1.maven.org/maven2/junit/junit/4.5/junit-4.5.jar
[ivy:resolve] 	==== datanucleus-repo: tried
[ivy:resolve] 	  http://www.datanucleus.org/downloads/maven2/junit/junit/4.5/junit-4.5.jar
[ivy:resolve] 	==== sourceforge: tried
[ivy:resolve] 	  http://www.sourceforge.net/projects/junit/files/junit//junit-4.5.jar
[ivy:resolve] 		::::::::::::::::::::::::::::::::::::::::::::::
[ivy:resolve] 		::          UNRESOLVED DEPENDENCIES         ::
[ivy:resolve] 		::::::::::::::::::::::::::::::::::::::::::::::
[ivy:resolve] 		:: tomcat#jasper-compiler;5.5.12: not found
[ivy:resolve] 		:: org.apache.hadoop#hadoop-tools;0.20.2: not found
[ivy:resolve] 		::::::::::::::::::::::::::::::::::::::::::::::
[ivy:resolve] 		::::::::::::::::::::::::::::::::::::::::::::::
[ivy:resolve] 		::              FAILED DOWNLOADS            ::
[ivy:resolve] 		:: ^ see resolution messages for details  ^ ::
[ivy:resolve] 		::::::::::::::::::::::::::::::::::::::::::::::
[ivy:resolve] 		:: commons-httpclient#commons-httpclient;3.0.1!commons-httpclient.jar
[ivy:resolve] 		:: junit#junit;4.5!junit.jar
[ivy:resolve] 		::::::::::::::::::::::::::::::::::::::::::::::
[ivy:resolve] 
[ivy:resolve] :: USE VERBOSE OR DEBUG MESSAGE LEVEL FOR MORE DETAILS

BUILD FAILED
/x1/jenkins/jenkins-slave/workspace/Hive-0.10.0-SNAPSHOT-h0.20.1/hive/build.xml:302: The following
error occurred while executing this line:
/x1/jenkins/jenkins-slave/workspace/Hive-0.10.0-SNAPSHOT-h0.20.1/hive/build.xml:152: The following
error occurred while executing this line:
/x1/jenkins/jenkins-slave/workspace/Hive-0.10.0-SNAPSHOT-h0.20.1/hive/shims/build.xml:73:
The following error occurred while executing this line:
/x1/jenkins/jenkins-slave/workspace/Hive-0.10.0-SNAPSHOT-h0.20.1/hive/shims/build.xml:76:
The following error occurred while executing this line:
/x1/jenkins/jenkins-slave/workspace/Hive-0.10.0-SNAPSHOT-h0.20.1/hive/shims/build.xml:48:
The following error occurred while executing this line:
/x1/jenkins/jenkins-slave/workspace/Hive-0.10.0-SNAPSHOT-h0.20.1/hive/build-common.xml:168:
impossible to resolve dependencies:
	resolve failed - see output for details

Total time: 29 seconds
Build step 'Invoke Ant' marked build as failure
Archiving artifacts
Recording test results

Mime
View raw message