hive-dev mailing list archives

Site index · List index
Message view « Date » · « Thread »
Top « Date » · « Thread »
From Apache Jenkins Server <jenk...@builds.apache.org>
Subject Build failed in Jenkins: Hive-0.10.0-SNAPSHOT-h0.20.1 #120
Date Sun, 14 Apr 2013 16:07:16 GMT
See <https://builds.apache.org/job/Hive-0.10.0-SNAPSHOT-h0.20.1/120/>

------------------------------------------
[...truncated 6252 lines...]
     [echo] Project: builtins

jar:
     [echo] Project: hive

create-dirs:
     [echo] Project: shims
     [copy] Warning: /x1/jenkins/jenkins-slave/workspace/Hive-0.10.0-SNAPSHOT-h0.20.1/hive/shims/src/test/resources
does not exist.

init:
     [echo] Project: shims

ivy-init-settings:
     [echo] Project: shims

ivy-resolve:
     [echo] Project: shims
[ivy:resolve] :: loading settings :: file = /x1/jenkins/jenkins-slave/workspace/Hive-0.10.0-SNAPSHOT-h0.20.1/hive/ivy/ivysettings.xml
[ivy:resolve] downloading http://repo1.maven.org/maven2/org/apache/zookeeper/zookeeper/3.4.3/zookeeper-3.4.3.jar
...
[ivy:resolve] ...............................................................................................................
(749kB)
[ivy:resolve] .. (0kB)
[ivy:resolve] 	[SUCCESSFUL ] org.apache.zookeeper#zookeeper;3.4.3!zookeeper.jar (236ms)
[ivy:resolve] downloading http://repo1.maven.org/maven2/org/apache/thrift/libthrift/0.9.0/libthrift-0.9.0.jar
...
[ivy:resolve] ........................................... (339kB)
[ivy:resolve] .. (0kB)
[ivy:resolve] 	[SUCCESSFUL ] org.apache.thrift#libthrift;0.9.0!libthrift.jar (235ms)
[ivy:resolve] downloading http://repo1.maven.org/maven2/commons-logging/commons-logging/1.0.4/commons-logging-1.0.4.jar
...
[ivy:resolve] ..... (37kB)
[ivy:resolve] .. (0kB)
[ivy:resolve] 	[SUCCESSFUL ] commons-logging#commons-logging;1.0.4!commons-logging.jar (31ms)
[ivy:resolve] downloading http://repo1.maven.org/maven2/commons-logging/commons-logging-api/1.0.4/commons-logging-api-1.0.4.jar
...
[ivy:resolve] ..... (25kB)
[ivy:resolve] .. (0kB)
[ivy:resolve] 	[SUCCESSFUL ] commons-logging#commons-logging-api;1.0.4!commons-logging-api.jar
(31ms)
[ivy:resolve] downloading http://repo1.maven.org/maven2/org/codehaus/jackson/jackson-core-asl/1.8.8/jackson-core-asl-1.8.8.jar
...
[ivy:resolve] ......................... (222kB)
[ivy:resolve] .. (0kB)
[ivy:resolve] 	[SUCCESSFUL ] org.codehaus.jackson#jackson-core-asl;1.8.8!jackson-core-asl.jar
(55ms)
[ivy:resolve] downloading http://repo1.maven.org/maven2/org/codehaus/jackson/jackson-mapper-asl/1.8.8/jackson-mapper-asl-1.8.8.jar
...
[ivy:resolve] ........................................................ (652kB)
[ivy:resolve] .. (0kB)
[ivy:resolve] 	[SUCCESSFUL ] org.codehaus.jackson#jackson-mapper-asl;1.8.8!jackson-mapper-asl.jar
(121ms)
[ivy:report] Processing /x1/jenkins/jenkins-slave/workspace/Hive-0.10.0-SNAPSHOT-h0.20.1/hive/build/ivy/resolution-cache/org.apache.hive-hive-shims-default.xml
to /x1/jenkins/jenkins-slave/workspace/Hive-0.10.0-SNAPSHOT-h0.20.1/hive/build/ivy/report/org.apache.hive-hive-shims-default.html

ivy-retrieve:
     [echo] Project: shims

compile:
     [echo] Project: shims
     [echo] Building shims 0.20

build-shims:
     [echo] Project: shims
     [echo] Compiling /x1/jenkins/jenkins-slave/workspace/Hive-0.10.0-SNAPSHOT-h0.20.1/hive/shims/src/common/java;/x1/jenkins/jenkins-slave/workspace/Hive-0.10.0-SNAPSHOT-h0.20.1/hive/shims/src/0.20/java
against hadoop 0.20.2 (/x1/jenkins/jenkins-slave/workspace/Hive-0.10.0-SNAPSHOT-h0.20.1/hive/build/hadoopcore/hadoop-0.20.2)

ivy-init-settings:
     [echo] Project: shims

ivy-resolve-hadoop-shim:
     [echo] Project: shims
[ivy:resolve] :: loading settings :: file = /x1/jenkins/jenkins-slave/workspace/Hive-0.10.0-SNAPSHOT-h0.20.1/hive/ivy/ivysettings.xml
[ivy:resolve] downloading http://repo1.maven.org/maven2/com/google/guava/guava/r09/guava-r09.jar
...
[ivy:resolve] ...........................................................................................................................................
(1117kB)
[ivy:resolve] .. (0kB)
[ivy:resolve] 	[SUCCESSFUL ] com.google.guava#guava;r09!guava.jar (1345ms)
[ivy:resolve] downloading http://repo1.maven.org/maven2/org/apache/hadoop/hadoop-core/0.20.2/hadoop-core-0.20.2.jar
...
[ivy:resolve] ............................................................................................................................................................................................................................................................................................................................................................................................................................................................................................................................................................................................................................................
(2624kB)
[ivy:resolve] .. (0kB)
[ivy:resolve] 	[SUCCESSFUL ] org.apache.hadoop#hadoop-core;0.20.2!hadoop-core.jar (373ms)
[ivy:resolve] downloading http://repo1.maven.org/maven2/org/apache/hadoop/hadoop-tools/0.20.2/hadoop-tools-0.20.2.jar
...
[ivy:resolve] ......... (68kB)
[ivy:resolve] .. (0kB)
[ivy:resolve] downloading http://repo1.maven.org/maven2/org/apache/hadoop/hadoop-test/0.20.2/hadoop-test-0.20.2.jar
...
[ivy:resolve] ................................................................................................................................................................................................................................................................................
(1527kB)
[ivy:resolve] .. (0kB)
[ivy:resolve] 	[SUCCESSFUL ] org.apache.hadoop#hadoop-test;0.20.2!hadoop-test.jar (190ms)
[ivy:resolve] downloading http://repo1.maven.org/maven2/commons-cli/commons-cli/1.2/commons-cli-1.2.jar
...
[ivy:resolve] ...... (40kB)
[ivy:resolve] .. (0kB)
[ivy:resolve] 	[SUCCESSFUL ] commons-cli#commons-cli;1.2!commons-cli.jar (39ms)
[ivy:resolve] downloading http://repo1.maven.org/maven2/xmlenc/xmlenc/0.52/xmlenc-0.52.jar
...
[ivy:resolve] .. (14kB)
[ivy:resolve] .. (0kB)
[ivy:resolve] 	[SUCCESSFUL ] xmlenc#xmlenc;0.52!xmlenc.jar (30ms)
[ivy:resolve] downloading http://repo1.maven.org/maven2/commons-httpclient/commons-httpclient/3.0.1/commons-httpclient-3.0.1.jar
...
[ivy:resolve] .......................................... (273kB)
[ivy:resolve] .. (0kB)
[ivy:resolve] downloading http://repo1.maven.org/maven2/commons-codec/commons-codec/1.3/commons-codec-1.3.jar
...
[ivy:resolve] ....... (45kB)
[ivy:resolve] .. (0kB)
[ivy:resolve] 	[SUCCESSFUL ] commons-codec#commons-codec;1.3!commons-codec.jar (42ms)
[ivy:resolve] downloading http://repo1.maven.org/maven2/commons-net/commons-net/1.4.1/commons-net-1.4.1.jar
...
[ivy:resolve] .................. (176kB)
[ivy:resolve] .. (0kB)
[ivy:resolve] 	[SUCCESSFUL ] commons-net#commons-net;1.4.1!commons-net.jar (99ms)
[ivy:resolve] downloading http://repo1.maven.org/maven2/org/mortbay/jetty/jetty/6.1.14/jetty-6.1.14.jar
...
[ivy:resolve] .................................................... (504kB)
[ivy:resolve] .. (0kB)
[ivy:resolve] downloading http://repo1.maven.org/maven2/net/java/dev/jets3t/jets3t/0.7.1/jets3t-0.7.1.jar
...
[ivy:resolve] .................................................... (368kB)
[ivy:resolve] downloading http://repo1.maven.org/maven2/org/mortbay/jetty/servlet-api-2.5/6.1.14/servlet-api-2.5-6.1.14.jar
...
[ivy:resolve] ................. (129kB)
[ivy:resolve] downloading http://repo1.maven.org/maven2/junit/junit/4.5/junit-4.5.jar ...
[ivy:resolve] .................................... (194kB)
[ivy:resolve] .. (0kB)
[ivy:resolve] downloading http://repo1.maven.org/maven2/hsqldb/hsqldb/1.8.0.10/hsqldb-1.8.0.10.jar
...
[ivy:resolve] ..................................................................................
(690kB)
[ivy:resolve] .. (0kB)
[ivy:resolve] 	[SUCCESSFUL ] hsqldb#hsqldb;1.8.0.10!hsqldb.jar (81ms)
[ivy:resolve] downloading http://repo1.maven.org/maven2/oro/oro/2.0.8/oro-2.0.8.jar ...
[ivy:resolve] ......... (63kB)
[ivy:resolve] .. (0kB)
[ivy:resolve] 	[SUCCESSFUL ] oro#oro;2.0.8!oro.jar (31ms)
[ivy:resolve] downloading http://repo1.maven.org/maven2/org/eclipse/jdt/core/3.1.1/core-3.1.1.jar
...
[ivy:resolve] .................................................................................................................................................................................................................................................................................................................................................................................................................
(3483kB)
[ivy:resolve] .. (0kB)
[ivy:resolve] downloading http://repo1.maven.org/maven2/ant/ant/1.6.5/ant-1.6.5.jar ...
[ivy:resolve] .....................................................................................................................................................................................
(1009kB)
[ivy:resolve] .. (0kB)
[ivy:resolve] 	[SUCCESSFUL ] ant#ant;1.6.5!ant.jar (150ms)
[ivy:resolve] downloading http://repo1.maven.org/maven2/commons-logging/commons-logging/1.1.1/commons-logging-1.1.1.jar
...
[ivy:resolve] ....... (59kB)
[ivy:resolve] .. (0kB)
[ivy:resolve] 	[SUCCESSFUL ] commons-logging#commons-logging;1.1.1!commons-logging.jar (29ms)
[ivy:resolve] downloading http://repo1.maven.org/maven2/org/apache/ftpserver/ftplet-api/1.0.0/ftplet-api-1.0.0.jar
...
[ivy:resolve] .... (22kB)
[ivy:resolve] .. (0kB)
[ivy:resolve] 	[SUCCESSFUL ] org.apache.ftpserver#ftplet-api;1.0.0!ftplet-api.jar(bundle)
(52ms)
[ivy:resolve] downloading http://repo1.maven.org/maven2/org/apache/mina/mina-core/2.0.0-M5/mina-core-2.0.0-M5.jar
...
[ivy:resolve] ............................................................... (622kB)
[ivy:resolve] .. (0kB)
[ivy:resolve] 	[SUCCESSFUL ] org.apache.mina#mina-core;2.0.0-M5!mina-core.jar(bundle) (77ms)
[ivy:resolve] downloading http://repo1.maven.org/maven2/org/apache/ftpserver/ftpserver-core/1.0.0/ftpserver-core-1.0.0.jar
...
[ivy:resolve] .............................. (264kB)
[ivy:resolve] .. (0kB)
[ivy:resolve] 	[SUCCESSFUL ] org.apache.ftpserver#ftpserver-core;1.0.0!ftpserver-core.jar(bundle)
(88ms)
[ivy:resolve] downloading http://repo1.maven.org/maven2/org/apache/ftpserver/ftpserver-deprecated/1.0.0-M2/ftpserver-deprecated-1.0.0-M2.jar
...
[ivy:resolve] ..... (31kB)
[ivy:resolve] .. (0kB)
[ivy:resolve] 	[SUCCESSFUL ] org.apache.ftpserver#ftpserver-deprecated;1.0.0-M2!ftpserver-deprecated.jar
(31ms)
[ivy:resolve] downloading http://repo1.maven.org/maven2/org/slf4j/slf4j-api/1.5.2/slf4j-api-1.5.2.jar
...
[ivy:resolve] ... (16kB)
[ivy:resolve] .. (0kB)
[ivy:resolve] 
[ivy:resolve] :: problems summary ::
[ivy:resolve] :::: WARNINGS
[ivy:resolve] 	impossible to put metadata file in cache: http://repo1.maven.org/maven2/com/google/google/5/google-5.pom
(5). java.io.FileNotFoundException: /home/jenkins/.ivy2/cache/com.google/google/ivy-5.xml.original
(No such file or directory)
[ivy:resolve] 	impossible to put metadata file in cache: http://repo1.maven.org/maven2/com/google/guava/guava/r09/guava-r09.pom
(r09). java.io.FileNotFoundException: /home/jenkins/.ivy2/cache/com.google.guava/guava/ivy-r09.xml.original
(No such file or directory)
[ivy:resolve] 		[FAILED     ] org.apache.hadoop#hadoop-tools;0.20.2!hadoop-tools.jar: invalid
sha1: expected=2b612181df39643f25f9577103386b575f20b31f computed=bc1a55b6f3e83e6b5feca2d0e48908cd42c622f2
(80ms)
[ivy:resolve] 		[FAILED     ] org.apache.hadoop#hadoop-tools;0.20.2!hadoop-tools.jar:  (0ms)
[ivy:resolve] 	==== local: tried
[ivy:resolve] 	  /home/jenkins/.ivy2/local/org.apache.hadoop/hadoop-tools/0.20.2/jars/hadoop-tools.jar
[ivy:resolve] 	==== apache-snapshot: tried
[ivy:resolve] 	  https://repository.apache.org/content/repositories/snapshots/org/apache/hadoop/hadoop-tools/0.20.2/hadoop-tools-0.20.2.jar
[ivy:resolve] 	==== maven2: tried
[ivy:resolve] 	  http://repo1.maven.org/maven2/org/apache/hadoop/hadoop-tools/0.20.2/hadoop-tools-0.20.2.jar
[ivy:resolve] 	==== datanucleus-repo: tried
[ivy:resolve] 	  http://www.datanucleus.org/downloads/maven2/org/apache/hadoop/hadoop-tools/0.20.2/hadoop-tools-0.20.2.jar
[ivy:resolve] 	==== sourceforge: tried
[ivy:resolve] 	  http://www.sourceforge.net/projects/hadoop-tools/files/hadoop-tools//hadoop-tools-0.20.2.jar
[ivy:resolve] 		[FAILED     ] commons-httpclient#commons-httpclient;3.0.1!commons-httpclient.jar:
invalid sha1: expected=d6364bcc1b2b2aa69d008602d36a700453648560 computed=53dcbf0401fee72b7d80caffceafb94b70d0b4d2
(47ms)
[ivy:resolve] 		[FAILED     ] commons-httpclient#commons-httpclient;3.0.1!commons-httpclient.jar:
 (0ms)
[ivy:resolve] 	==== local: tried
[ivy:resolve] 	  /home/jenkins/.ivy2/local/commons-httpclient/commons-httpclient/3.0.1/jars/commons-httpclient.jar
[ivy:resolve] 	==== apache-snapshot: tried
[ivy:resolve] 	  https://repository.apache.org/content/repositories/snapshots/commons-httpclient/commons-httpclient/3.0.1/commons-httpclient-3.0.1.jar
[ivy:resolve] 	==== maven2: tried
[ivy:resolve] 	  http://repo1.maven.org/maven2/commons-httpclient/commons-httpclient/3.0.1/commons-httpclient-3.0.1.jar
[ivy:resolve] 	==== datanucleus-repo: tried
[ivy:resolve] 	  http://www.datanucleus.org/downloads/maven2/commons-httpclient/commons-httpclient/3.0.1/commons-httpclient-3.0.1.jar
[ivy:resolve] 	==== sourceforge: tried
[ivy:resolve] 	  http://www.sourceforge.net/projects/commons-httpclient/files/commons-httpclient//commons-httpclient-3.0.1.jar
[ivy:resolve] 		[FAILED     ] org.mortbay.jetty#jetty;6.1.14!jetty.jar: invalid sha1: expected=5ded67b609e59c27e82ff61b510773d28c9bef56
computed=7b03f93d5b0f5d283b759017fc3c0fea0316b3eb (80ms)
[ivy:resolve] 		[FAILED     ] org.mortbay.jetty#jetty;6.1.14!jetty.jar:  (0ms)
[ivy:resolve] 	==== local: tried
[ivy:resolve] 	  /home/jenkins/.ivy2/local/org.mortbay.jetty/jetty/6.1.14/jars/jetty.jar
[ivy:resolve] 	==== apache-snapshot: tried
[ivy:resolve] 	  https://repository.apache.org/content/repositories/snapshots/org/mortbay/jetty/jetty/6.1.14/jetty-6.1.14.jar
[ivy:resolve] 	==== maven2: tried
[ivy:resolve] 	  http://repo1.maven.org/maven2/org/mortbay/jetty/jetty/6.1.14/jetty-6.1.14.jar
[ivy:resolve] 	==== datanucleus-repo: tried
[ivy:resolve] 	  http://www.datanucleus.org/downloads/maven2/org/mortbay/jetty/jetty/6.1.14/jetty-6.1.14.jar
[ivy:resolve] 	==== sourceforge: tried
[ivy:resolve] 	  http://www.sourceforge.net/projects/jetty/files/jetty//jetty-6.1.14.jar
[ivy:resolve] 		[FAILED     ] net.java.dev.jets3t#jets3t;0.7.1!jets3t.jar: Downloaded file
size doesn't match expected Content Length for http://repo1.maven.org/maven2/net/java/dev/jets3t/jets3t/0.7.1/jets3t-0.7.1.jar.
Please retry. (58ms)
[ivy:resolve] 		[FAILED     ] net.java.dev.jets3t#jets3t;0.7.1!jets3t.jar:  (0ms)
[ivy:resolve] 	==== local: tried
[ivy:resolve] 	  /home/jenkins/.ivy2/local/net.java.dev.jets3t/jets3t/0.7.1/jars/jets3t.jar
[ivy:resolve] 	==== apache-snapshot: tried
[ivy:resolve] 	  https://repository.apache.org/content/repositories/snapshots/net/java/dev/jets3t/jets3t/0.7.1/jets3t-0.7.1.jar
[ivy:resolve] 	==== maven2: tried
[ivy:resolve] 	  http://repo1.maven.org/maven2/net/java/dev/jets3t/jets3t/0.7.1/jets3t-0.7.1.jar
[ivy:resolve] 	==== datanucleus-repo: tried
[ivy:resolve] 	  http://www.datanucleus.org/downloads/maven2/net/java/dev/jets3t/jets3t/0.7.1/jets3t-0.7.1.jar
[ivy:resolve] 	==== sourceforge: tried
[ivy:resolve] 	  http://www.sourceforge.net/projects/jets3t/files/jets3t//jets3t-0.7.1.jar
[ivy:resolve] 		[FAILED     ] org.mortbay.jetty#servlet-api-2.5;6.1.14!servlet-api-2.5.jar:
Downloaded file size doesn't match expected Content Length for http://repo1.maven.org/maven2/org/mortbay/jetty/servlet-api-2.5/6.1.14/servlet-api-2.5-6.1.14.jar.
Please retry. (33ms)
[ivy:resolve] 		[FAILED     ] org.mortbay.jetty#servlet-api-2.5;6.1.14!servlet-api-2.5.jar:
 (0ms)
[ivy:resolve] 	==== local: tried
[ivy:resolve] 	  /home/jenkins/.ivy2/local/org.mortbay.jetty/servlet-api-2.5/6.1.14/jars/servlet-api-2.5.jar
[ivy:resolve] 	==== apache-snapshot: tried
[ivy:resolve] 	  https://repository.apache.org/content/repositories/snapshots/org/mortbay/jetty/servlet-api-2.5/6.1.14/servlet-api-2.5-6.1.14.jar
[ivy:resolve] 	==== maven2: tried
[ivy:resolve] 	  http://repo1.maven.org/maven2/org/mortbay/jetty/servlet-api-2.5/6.1.14/servlet-api-2.5-6.1.14.jar
[ivy:resolve] 	==== datanucleus-repo: tried
[ivy:resolve] 	  http://www.datanucleus.org/downloads/maven2/org/mortbay/jetty/servlet-api-2.5/6.1.14/servlet-api-2.5-6.1.14.jar
[ivy:resolve] 	==== sourceforge: tried
[ivy:resolve] 	  http://www.sourceforge.net/projects/servlet-api-2.5/files/servlet-api-2.5//servlet-api-2.5-6.1.14.jar
[ivy:resolve] 		[FAILED     ] junit#junit;4.5!junit.jar: /home/jenkins/.ivy2/cache/junit/junit/jars/junit-4.5.jar.part
(No such file or directory) (65ms)
[ivy:resolve] 		[FAILED     ] org.eclipse.jdt#core;3.1.1!core.jar: invalid sha1: expected=88c83ce444cf46d02494da37c9fa1eebc9ce9cea
computed=31fc2c49ee2defedc605ce6961ea469797b67b4d (140ms)
[ivy:resolve] 		[FAILED     ] org.eclipse.jdt#core;3.1.1!core.jar:  (0ms)
[ivy:resolve] 	==== local: tried
[ivy:resolve] 	  /home/jenkins/.ivy2/local/org.eclipse.jdt/core/3.1.1/jars/core.jar
[ivy:resolve] 	==== apache-snapshot: tried
[ivy:resolve] 	  https://repository.apache.org/content/repositories/snapshots/org/eclipse/jdt/core/3.1.1/core-3.1.1.jar
[ivy:resolve] 	==== maven2: tried
[ivy:resolve] 	  http://repo1.maven.org/maven2/org/eclipse/jdt/core/3.1.1/core-3.1.1.jar
[ivy:resolve] 	==== datanucleus-repo: tried
[ivy:resolve] 	  http://www.datanucleus.org/downloads/maven2/org/eclipse/jdt/core/3.1.1/core-3.1.1.jar
[ivy:resolve] 	==== sourceforge: tried
[ivy:resolve] 	  http://www.sourceforge.net/projects/core/files/core//core-3.1.1.jar
[ivy:resolve] 		[FAILED     ] org.slf4j#slf4j-api;1.5.2!slf4j-api.jar: /home/jenkins/.ivy2/cache/org.slf4j/slf4j-api/jars/slf4j-api-1.5.2.jar.part
(No such file or directory) (206ms)
[ivy:resolve] 		::::::::::::::::::::::::::::::::::::::::::::::
[ivy:resolve] 		::              FAILED DOWNLOADS            ::
[ivy:resolve] 		:: ^ see resolution messages for details  ^ ::
[ivy:resolve] 		::::::::::::::::::::::::::::::::::::::::::::::
[ivy:resolve] 		:: commons-httpclient#commons-httpclient;3.0.1!commons-httpclient.jar
[ivy:resolve] 		:: org.mortbay.jetty#jetty;6.1.14!jetty.jar
[ivy:resolve] 		:: org.mortbay.jetty#servlet-api-2.5;6.1.14!servlet-api-2.5.jar
[ivy:resolve] 		:: org.eclipse.jdt#core;3.1.1!core.jar
[ivy:resolve] 		:: net.java.dev.jets3t#jets3t;0.7.1!jets3t.jar
[ivy:resolve] 		:: org.apache.hadoop#hadoop-tools;0.20.2!hadoop-tools.jar
[ivy:resolve] 		::::::::::::::::::::::::::::::::::::::::::::::
[ivy:resolve] 
[ivy:resolve] :: USE VERBOSE OR DEBUG MESSAGE LEVEL FOR MORE DETAILS

BUILD FAILED
/x1/jenkins/jenkins-slave/workspace/Hive-0.10.0-SNAPSHOT-h0.20.1/hive/build.xml:302: The following
error occurred while executing this line:
/x1/jenkins/jenkins-slave/workspace/Hive-0.10.0-SNAPSHOT-h0.20.1/hive/build.xml:152: The following
error occurred while executing this line:
/x1/jenkins/jenkins-slave/workspace/Hive-0.10.0-SNAPSHOT-h0.20.1/hive/shims/build.xml:73:
The following error occurred while executing this line:
/x1/jenkins/jenkins-slave/workspace/Hive-0.10.0-SNAPSHOT-h0.20.1/hive/shims/build.xml:76:
The following error occurred while executing this line:
/x1/jenkins/jenkins-slave/workspace/Hive-0.10.0-SNAPSHOT-h0.20.1/hive/shims/build.xml:48:
The following error occurred while executing this line:
/x1/jenkins/jenkins-slave/workspace/Hive-0.10.0-SNAPSHOT-h0.20.1/hive/build-common.xml:168:
impossible to resolve dependencies:
	resolve failed - see output for details

Total time: 52 seconds
Build step 'Invoke Ant' marked build as failure
Archiving artifacts
Recording test results

Mime
View raw message