hive-dev mailing list archives

Site index · List index
Message view « Date » · « Thread »
Top « Date » · « Thread »
From Apache Jenkins Server <jenk...@builds.apache.org>
Subject Build failed in Jenkins: Hive-0.10.0-SNAPSHOT-h0.20.1 #104
Date Mon, 25 Mar 2013 19:05:34 GMT
See <https://builds.apache.org/job/Hive-0.10.0-SNAPSHOT-h0.20.1/104/>

------------------------------------------
[...truncated 18533 lines...]
    [junit] Running org.apache.hadoop.hive.serde2.avro.TestGenericAvroRecordWritable
    [junit] Tests run: 1, Failures: 0, Errors: 0, Time elapsed: 0.936 sec
    [junit] Tests run: 1, Failures: 0, Errors: 0, Time elapsed: 0.936 sec
    [junit] Running org.apache.hadoop.hive.serde2.avro.TestInstanceCache
    [junit] Tests run: 2, Failures: 0, Errors: 0, Time elapsed: 0.358 sec
    [junit] Running org.apache.hadoop.hive.serde2.avro.TestSchemaReEncoder
    [junit] Tests run: 1, Failures: 0, Errors: 0, Time elapsed: 0.52 sec
    [junit] Tests run: 1, Failures: 0, Errors: 0, Time elapsed: 0.52 sec
    [junit] Running org.apache.hadoop.hive.serde2.avro.TestThatEvolvedSchemasActAsWeWant
    [junit] Tests run: 1, Failures: 0, Errors: 0, Time elapsed: 1.58 sec
    [junit] Running org.apache.hadoop.hive.serde2.binarysortable.TestBinarySortableSerDe
    [junit] Beginning Test testBinarySortableSerDe:
    [junit] Test testTBinarySortableProtocol passed!
    [junit] Tests run: 1, Failures: 0, Errors: 0, Time elapsed: 1.821 sec
    [junit] Running org.apache.hadoop.hive.serde2.columnar.TestLazyBinaryColumnarSerDe
    [junit] Tests run: 5, Failures: 0, Errors: 0, Time elapsed: 0.774 sec
    [junit] Running org.apache.hadoop.hive.serde2.dynamic_type.TestDynamicSerDe
    [junit] input struct = [234, [firstString, secondString], {firstKey=1, secondKey=2}, -234,
1.0, -2.5]
    [junit] Testing protocol: org.apache.hadoop.hive.serde2.thrift.TBinarySortableProtocol
    [junit] TypeName = struct<_hello:int,2bye:array<string>,another:map<string,int>,nhello:int,d:double,nd:double>
    [junit] bytes =x01x80x00x00xeax01x80x00x00x02x01x66x69x72x73x74x53x74x72x69x6ex67x00x01x73x65x63x6fx6ex64x53x74x72x69x6ex67x00x01x80x00x00x02x01x66x69x72x73x74x4bx65x79x00x01x80x00x00x01x01x73x65x63x6fx6ex64x4bx65x79x00x01x80x00x00x02x01x7fxffxffx16x01xbfxf0x00x00x00x00x00x00x01x3fxfbxffxffxffxffxffxff
    [junit] o class = class java.util.ArrayList
    [junit] o size = 6
    [junit] o[0] class = class java.lang.Integer
    [junit] o[1] class = class java.util.ArrayList
    [junit] o[2] class = class java.util.HashMap
    [junit] o = [234, [firstString, secondString], {firstKey=1, secondKey=2}, -234, 1.0, -2.5]
    [junit] Testing protocol: org.apache.hadoop.hive.serde2.thrift.TBinarySortableProtocol
    [junit] TypeName = struct<_hello:int,2bye:array<string>,another:map<string,int>,nhello:int,d:double,nd:double>
    [junit] bytes =xfex7fxffxffx15xfex7fxffxffxfdxfex99x96x8dx8cx8bxacx8bx8dx96x91x98xffxfex8cx9ax9cx90x91x9bxacx8bx8dx96x91x98xffxfex7fxffxffxfdxfex99x96x8dx8cx8bxb4x9ax86xffxfex7fxffxffxfexfex8cx9ax9cx90x91x9bxb4x9ax86xffxfex7fxffxffxfdxfex80x00x00xe9xfex40x0fxffxffxffxffxffxffxfexc0x04x00x00x00x00x00x00
    [junit] o class = class java.util.ArrayList
    [junit] o size = 6
    [junit] o[0] class = class java.lang.Integer
    [junit] o[1] class = class java.util.ArrayList
    [junit] o[2] class = class java.util.HashMap
    [junit] o = [234, [firstString, secondString], {firstKey=1, secondKey=2}, -234, 1.0, -2.5]
    [junit] Testing protocol: org.apache.thrift.protocol.TBinaryProtocol
    [junit] TypeName = struct<_hello:int,2bye:array<string>,another:map<string,int>,nhello:int,d:double,nd:double>
    [junit] bytes =x08xffxffx00x00x00xeax0fxffxfex0bx00x00x00x02x00x00x00x0bx66x69x72x73x74x53x74x72x69x6ex67x00x00x00x0cx73x65x63x6fx6ex64x53x74x72x69x6ex67x0dxffxfdx0bx08x00x00x00x02x00x00x00x08x66x69x72x73x74x4bx65x79x00x00x00x01x00x00x00x09x73x65x63x6fx6ex64x4bx65x79x00x00x00x02x08xffxfcxffxffxffx16x04xffxfbx3fxf0x00x00x00x00x00x00x04xffxfaxc0x04x00x00x00x00x00x00x00
    [junit] o class = class java.util.ArrayList
    [junit] o size = 6
    [junit] o[0] class = class java.lang.Integer
    [junit] o[1] class = class java.util.ArrayList
    [junit] o[2] class = class java.util.HashMap
    [junit] o = [234, [firstString, secondString], {firstKey=1, secondKey=2}, -234, 1.0, -2.5]
    [junit] Testing protocol: org.apache.thrift.protocol.TJSONProtocol
    [junit] TypeName = struct<_hello:int,2bye:array<string>,another:map<string,int>,nhello:int,d:double,nd:double>
    [junit] bytes =x7bx22x2dx31x22x3ax7bx22x69x33x32x22x3ax32x33x34x7dx2cx22x2dx32x22x3ax7bx22x6cx73x74x22x3ax5bx22x73x74x72x22x2cx32x2cx22x66x69x72x73x74x53x74x72x69x6ex67x22x2cx22x73x65x63x6fx6ex64x53x74x72x69x6ex67x22x5dx7dx2cx22x2dx33x22x3ax7bx22x6dx61x70x22x3ax5bx22x73x74x72x22x2cx22x69x33x32x22x2cx32x2cx7bx22x66x69x72x73x74x4bx65x79x22x3ax31x2cx22x73x65x63x6fx6ex64x4bx65x79x22x3ax32x7dx5dx7dx2cx22x2dx34x22x3ax7bx22x69x33x32x22x3ax2dx32x33x34x7dx2cx22x2dx35x22x3ax7bx22x64x62x6cx22x3ax31x2ex30x7dx2cx22x2dx36x22x3ax7bx22x64x62x6cx22x3ax2dx32x2ex35x7dx7d
    [junit] bytes in text ={"-1":{"i32":234},"-2":{"lst":["str",2,"firstString","secondString"]},"-3":{"map":["str","i32",2,{"firstKey":1,"secondKey":2}]},"-4":{"i32":-234},"-5":{"dbl":1.0},"-6":{"dbl":-2.5}}
    [junit] o class = class java.util.ArrayList
    [junit] o size = 6
    [junit] o[0] class = class java.lang.Integer
    [junit] o[1] class = class java.util.ArrayList
    [junit] o[2] class = class java.util.HashMap
    [junit] o = [234, [firstString, secondString], {firstKey=1, secondKey=2}, -234, 1.0, -2.5]
    [junit] Testing protocol: org.apache.hadoop.hive.serde2.thrift.TCTLSeparatedProtocol
    [junit] TypeName = struct<_hello:int,2bye:array<string>,another:map<string,int>,nhello:int,d:double,nd:double>
    [junit] bytes =x32x33x34x01x66x69x72x73x74x53x74x72x69x6ex67x02x73x65x63x6fx6ex64x53x74x72x69x6ex67x01x66x69x72x73x74x4bx65x79x03x31x02x73x65x63x6fx6ex64x4bx65x79x03x32x01x2dx32x33x34x01x31x2ex30x01x2dx32x2ex35
    [junit] bytes in text =234firstStringsecondStringfirstKey1secondKey2-2341.0-2.5
    [junit] o class = class java.util.ArrayList
    [junit] o size = 6
    [junit] o[0] class = class java.lang.Integer
    [junit] o[1] class = class java.util.ArrayList
    [junit] o[2] class = class java.util.HashMap
    [junit] o = [234, [firstString, secondString], {firstKey=1, secondKey=2}, -234, 1.0, -2.5]
    [junit] Beginning Test testTBinarySortableProtocol:
    [junit] Testing struct test { double hello}
    [junit] Testing struct test { i32 hello}
    [junit] Testing struct test { i64 hello}
    [junit] Testing struct test { string hello}
    [junit] Testing struct test { string hello, double another}
    [junit] Test testTBinarySortableProtocol passed!
    [junit] bytes in text =234	firstStringsecondString	firstKey1secondKey2>
    [junit] compare to    =234	firstStringsecondString	firstKey1secondKey2>
    [junit] o class = class java.util.ArrayList
    [junit] o size = 3
    [junit] o[0] class = class java.lang.Integer
    [junit] o[1] class = class java.util.ArrayList
    [junit] o[2] class = class java.util.HashMap
    [junit] o = [234, [firstString, secondString], {firstKey=1, secondKey=2}]
    [junit] bytes in text =234	firstStringsecondString	firstKey1secondKey2>
    [junit] compare to    =234	firstStringsecondString	firstKey1secondKey2>
    [junit] o class = class java.util.ArrayList
    [junit] o size = 3
    [junit] o = [234, null, {firstKey=1, secondKey=2}]
    [junit] Tests run: 9, Failures: 0, Errors: 0, Time elapsed: 0.805 sec
    [junit] Running org.apache.hadoop.hive.serde2.lazy.TestLazyArrayMapStruct
    [junit] Tests run: 4, Failures: 0, Errors: 0, Time elapsed: 0.545 sec
    [junit] Running org.apache.hadoop.hive.serde2.lazy.TestLazyPrimitive
    [junit] Tests run: 9, Failures: 0, Errors: 0, Time elapsed: 0.297 sec
    [junit] Running org.apache.hadoop.hive.serde2.lazy.TestLazySimpleSerDe
    [junit] Tests run: 4, Failures: 0, Errors: 0, Time elapsed: 0.791 sec
    [junit] Running org.apache.hadoop.hive.serde2.lazybinary.TestLazyBinarySerDe
    [junit] Beginning Test TestLazyBinarySerDe:
    [junit] Test TestLazyBinarySerDe passed!
    [junit] Tests run: 4, Failures: 0, Errors: 0, Time elapsed: 1.082 sec
    [junit] Running org.apache.hadoop.hive.serde2.objectinspector.TestCrossMapEqualComparer
    [junit] Tests run: 3, Failures: 0, Errors: 0, Time elapsed: 0.41 sec
    [junit] Running org.apache.hadoop.hive.serde2.objectinspector.TestFullMapEqualComparer
    [junit] Tests run: 2, Failures: 0, Errors: 0, Time elapsed: 0.269 sec
    [junit] Running org.apache.hadoop.hive.serde2.objectinspector.TestObjectInspectorConverters
    [junit] Tests run: 1, Failures: 0, Errors: 0, Time elapsed: 0.256 sec
    [junit] Running org.apache.hadoop.hive.serde2.objectinspector.TestObjectInspectorUtils
    [junit] Tests run: 1, Failures: 0, Errors: 0, Time elapsed: 0.647 sec
    [junit] Running org.apache.hadoop.hive.serde2.objectinspector.TestProtocolBuffersObjectInspectors
    [junit] Tests run: 1, Failures: 0, Errors: 0, Time elapsed: 2.431 sec
    [junit] Running org.apache.hadoop.hive.serde2.objectinspector.TestReflectionObjectInspectors
    [junit] Tests run: 1, Failures: 0, Errors: 0, Time elapsed: 4.237 sec
    [junit] Running org.apache.hadoop.hive.serde2.objectinspector.TestSimpleMapEqualComparer
    [junit] Tests run: 3, Failures: 0, Errors: 0, Time elapsed: 0.362 sec
    [junit] Running org.apache.hadoop.hive.serde2.objectinspector.TestStandardObjectInspectors
    [junit] [null, null, null]
    [junit] [null, null, null]
    [junit] Tests run: 6, Failures: 0, Errors: 0, Time elapsed: 0.778 sec
    [junit] Running org.apache.hadoop.hive.serde2.objectinspector.TestThriftObjectInspectors
    [junit] Tests run: 1, Failures: 0, Errors: 0, Time elapsed: 0.284 sec
    [junit] Running org.apache.hadoop.hive.serde2.objectinspector.TestUnionStructObjectInspector
    [junit] Tests run: 1, Failures: 0, Errors: 0, Time elapsed: 0.247 sec

test-conditions:
     [echo] Project: service

gen-test:
     [echo] Project: service

create-dirs:
     [echo] Project: service
     [copy] Warning: <https://builds.apache.org/job/Hive-0.10.0-SNAPSHOT-h0.20.1/ws/hive/service/src/test/resources>
does not exist.

init:
     [echo] Project: service

ivy-init-settings:
     [echo] Project: service

ivy-resolve:
     [echo] Project: service
[ivy:resolve] :: loading settings :: file = <https://builds.apache.org/job/Hive-0.10.0-SNAPSHOT-h0.20.1/ws/hive/ivy/ivysettings.xml>
[ivy:report] Processing <https://builds.apache.org/job/Hive-0.10.0-SNAPSHOT-h0.20.1/104/artifact/hive/build/ivy/resolution-cache/org.apache.hive-hive-service-default.xml>
to <https://builds.apache.org/job/Hive-0.10.0-SNAPSHOT-h0.20.1/104/artifact/hive/build/ivy/report/org.apache.hive-hive-service-default.html>

ivy-retrieve:
     [echo] Project: service

compile:
     [echo] Project: service

ivy-resolve-test:
     [echo] Project: service

ivy-retrieve-test:
     [echo] Project: service

set-test-classpath:

compile-test:
     [echo] Project: service

test-jar:
     [echo] Project: service
      [jar] Building MANIFEST-only jar: <https://builds.apache.org/job/Hive-0.10.0-SNAPSHOT-h0.20.1/104/artifact/hive/build/service/test/test-udfs.jar>

test-init:
     [echo] Project: service
    [mkdir] Created dir: <https://builds.apache.org/job/Hive-0.10.0-SNAPSHOT-h0.20.1/104/artifact/hive/build/service/test/data>
    [mkdir] Created dir: <https://builds.apache.org/job/Hive-0.10.0-SNAPSHOT-h0.20.1/104/artifact/hive/build/service/test/logs/clientpositive>
    [mkdir] Created dir: <https://builds.apache.org/job/Hive-0.10.0-SNAPSHOT-h0.20.1/104/artifact/hive/build/service/test/logs/clientnegative>
    [mkdir] Created dir: <https://builds.apache.org/job/Hive-0.10.0-SNAPSHOT-h0.20.1/104/artifact/hive/build/service/test/logs/positive>
    [mkdir] Created dir: <https://builds.apache.org/job/Hive-0.10.0-SNAPSHOT-h0.20.1/104/artifact/hive/build/service/test/logs/negative>
    [mkdir] Created dir: <https://builds.apache.org/job/Hive-0.10.0-SNAPSHOT-h0.20.1/104/artifact/hive/build/service/test/data/warehouse>
    [mkdir] Created dir: <https://builds.apache.org/job/Hive-0.10.0-SNAPSHOT-h0.20.1/104/artifact/hive/build/service/test/data/metadb>

test:
     [echo] Project: service
    [junit] WARNING: multiple versions of ant detected in path for junit 
    [junit]          jar:file:/home/hudson/tools/ant/apache-ant-1.8.1/lib/ant.jar!/org/apache/tools/ant/Project.class
    [junit]      and jar:<https://builds.apache.org/job/Hive-0.10.0-SNAPSHOT-h0.20.1/104/artifact/hive/build/ivy/lib/hadoop0.20.shim/ant-1.6.5.jar!/org/apache/tools/ant/Project.class>
    [junit] Running org.apache.hadoop.hive.service.TestHiveServer
    [junit] Hive history file=<https://builds.apache.org/job/Hive-0.10.0-SNAPSHOT-h0.20.1/104/artifact/hive/build/service/tmp/hive_job_log_jenkins_201303251203_1246580029.txt>
    [junit] FAILED: ParseException line 0:-1 cannot recognize input near '<EOF>' '<EOF>'
'<EOF>'
    [junit] 
    [junit] FAILED: ParseException line 1:33 cannot recognize input near '(' ')' '<EOF>'
    [junit] 
    [junit] HiveServerException(message:Query returned non-zero code: 40000, cause: FAILED:
ParseException line 1:33 cannot recognize input near '(' ')' '<EOF>'
    [junit] , errorCode:40000, SQLState:42000)
    [junit] 	at org.apache.hadoop.hive.service.HiveServer$HiveServerHandler.execute(HiveServer.java:219)
    [junit] 	at org.apache.hadoop.hive.service.TestHiveServer.testExecute(TestHiveServer.java:110)
    [junit] 	at sun.reflect.NativeMethodAccessorImpl.invoke0(Native Method)
    [junit] 	at sun.reflect.NativeMethodAccessorImpl.invoke(NativeMethodAccessorImpl.java:39)
    [junit] 	at sun.reflect.DelegatingMethodAccessorImpl.invoke(DelegatingMethodAccessorImpl.java:25)
    [junit] 	at java.lang.reflect.Method.invoke(Method.java:597)
    [junit] 	at junit.framework.TestCase.runTest(TestCase.java:168)
    [junit] 	at junit.framework.TestCase.runBare(TestCase.java:134)
    [junit] 	at junit.framework.TestResult$1.protect(TestResult.java:110)
    [junit] 	at junit.framework.TestResult.runProtected(TestResult.java:128)
    [junit] 	at junit.framework.TestResult.run(TestResult.java:113)
    [junit] 	at junit.framework.TestCase.run(TestCase.java:124)
    [junit] 	at junit.framework.TestSuite.runTest(TestSuite.java:232)
    [junit] 	at junit.framework.TestSuite.run(TestSuite.java:227)
    [junit] 	at org.junit.internal.runners.JUnit38ClassRunner.run(JUnit38ClassRunner.java:79)
    [junit] 	at junit.framework.JUnit4TestAdapter.run(JUnit4TestAdapter.java:39)
    [junit] 	at org.apache.tools.ant.taskdefs.optional.junit.JUnitTestRunner.run(JUnitTestRunner.java:422)
    [junit] 	at org.apache.tools.ant.taskdefs.optional.junit.JUnitTestRunner.launch(JUnitTestRunner.java:931)
    [junit] 	at org.apache.tools.ant.taskdefs.optional.junit.JUnitTestRunner.main(JUnitTestRunner.java:785)
    [junit] Hive history file=<https://builds.apache.org/job/Hive-0.10.0-SNAPSHOT-h0.20.1/104/artifact/hive/build/service/tmp/hive_job_log_jenkins_201303251203_861570868.txt>
    [junit] FAILED: ParseException line 0:-1 cannot recognize input near '<EOF>' '<EOF>'
'<EOF>'
    [junit] 
    [junit] FAILED: ParseException line 1:33 cannot recognize input near '(' ')' '<EOF>'
    [junit] 
    [junit] Hive history file=<https://builds.apache.org/job/Hive-0.10.0-SNAPSHOT-h0.20.1/104/artifact/hive/build/service/tmp/hive_job_log_jenkins_201303251203_1966873059.txt>
    [junit] FAILED: ParseException line 0:-1 cannot recognize input near '<EOF>' '<EOF>'
'<EOF>'
    [junit] 
    [junit] FAILED: ParseException line 1:33 cannot recognize input near '(' ')' '<EOF>'
    [junit] 
    [junit] Hive history file=<https://builds.apache.org/job/Hive-0.10.0-SNAPSHOT-h0.20.1/104/artifact/hive/build/service/tmp/hive_job_log_jenkins_201303251203_1158730632.txt>
    [junit] Hive history file=<https://builds.apache.org/job/Hive-0.10.0-SNAPSHOT-h0.20.1/104/artifact/hive/build/service/tmp/hive_job_log_jenkins_201303251203_2022032666.txt>
    [junit] FAILED: ParseException line 0:-1 cannot recognize input near '<EOF>' '<EOF>'
'<EOF>'
    [junit] 
    [junit] FAILED: ParseException line 1:33 cannot recognize input near '(' ')' '<EOF>'
    [junit] 
    [junit] Hive history file=<https://builds.apache.org/job/Hive-0.10.0-SNAPSHOT-h0.20.1/104/artifact/hive/build/service/tmp/hive_job_log_jenkins_201303251203_1020591974.txt>
    [junit] FAILED: ParseException line 0:-1 cannot recognize input near '<EOF>' '<EOF>'
'<EOF>'
    [junit] 
    [junit] FAILED: ParseException line 1:33 cannot recognize input near '(' ')' '<EOF>'
    [junit] 
    [junit] Hive history file=<https://builds.apache.org/job/Hive-0.10.0-SNAPSHOT-h0.20.1/104/artifact/hive/build/service/tmp/hive_job_log_jenkins_201303251203_725623996.txt>
    [junit] <https://builds.apache.org/job/Hive-0.10.0-SNAPSHOT-h0.20.1/ws/hive/service/../data/files/invalidpath/sample.jar>
does not exist
    [junit] Hive history file=<https://builds.apache.org/job/Hive-0.10.0-SNAPSHOT-h0.20.1/104/artifact/hive/build/service/tmp/hive_job_log_jenkins_201303251203_322538871.txt>
    [junit] <https://builds.apache.org/job/Hive-0.10.0-SNAPSHOT-h0.20.1/ws/hive/service/../data/files/invalidpath/sample.txt>
does not exist
    [junit] Hive history file=<https://builds.apache.org/job/Hive-0.10.0-SNAPSHOT-h0.20.1/104/artifact/hive/build/service/tmp/hive_job_log_jenkins_201303251203_1361830738.txt>
    [junit] <https://builds.apache.org/job/Hive-0.10.0-SNAPSHOT-h0.20.1/ws/hive/service/../data/files/invalidpath/sample.zip>
does not exist
    [junit] Hive history file=<https://builds.apache.org/job/Hive-0.10.0-SNAPSHOT-h0.20.1/104/artifact/hive/build/service/tmp/hive_job_log_jenkins_201303251203_651947851.txt>
    [junit] Hive history file=<https://builds.apache.org/job/Hive-0.10.0-SNAPSHOT-h0.20.1/104/artifact/hive/build/service/tmp/hive_job_log_jenkins_201303251203_90159648.txt>
    [junit] Tests run: 11, Failures: 0, Errors: 4, Time elapsed: 27.629 sec
    [junit] Test org.apache.hadoop.hive.service.TestHiveServer FAILED
    [junit] Running org.apache.hadoop.hive.service.TestHiveServerSessions
    [junit] Hive history file=<https://builds.apache.org/job/Hive-0.10.0-SNAPSHOT-h0.20.1/104/artifact/hive/build/service/tmp/hive_job_log_jenkins_201303251204_390107579.txt>
    [junit] Hive history file=<https://builds.apache.org/job/Hive-0.10.0-SNAPSHOT-h0.20.1/104/artifact/hive/build/service/tmp/hive_job_log_jenkins_201303251204_779858215.txt>
    [junit] Tests run: 1, Failures: 0, Errors: 0, Time elapsed: 9.92 sec
      [for] <https://builds.apache.org/job/Hive-0.10.0-SNAPSHOT-h0.20.1/ws/hive/service/build.xml>:
The following error occurred while executing this line:
      [for] <https://builds.apache.org/job/Hive-0.10.0-SNAPSHOT-h0.20.1/ws/hive/build.xml>:325:
The following error occurred while executing this line:
      [for] <https://builds.apache.org/job/Hive-0.10.0-SNAPSHOT-h0.20.1/ws/hive/build-common.xml>:455:
Tests failed!

BUILD FAILED
<https://builds.apache.org/job/Hive-0.10.0-SNAPSHOT-h0.20.1/ws/hive/build.xml>:320:
Keepgoing execution: 9 of 12 iterations failed.

Total time: 102 minutes 16 seconds
Build step 'Invoke Ant' marked build as failure
Archiving artifacts
Recording test results

Mime
View raw message