hive-dev mailing list archives

Site index · List index
Message view « Date » · « Thread »
Top « Date » · « Thread »
From Apache Jenkins Server <jenk...@builds.apache.org>
Subject Build failed in Jenkins: Hive-0.10.0-SNAPSHOT-h0.20.1 #92
Date Wed, 13 Mar 2013 16:13:45 GMT
See <https://builds.apache.org/job/Hive-0.10.0-SNAPSHOT-h0.20.1/92/>

------------------------------------------
[...truncated 8197 lines...]
     [copy] Warning: <https://builds.apache.org/job/Hive-0.10.0-SNAPSHOT-h0.20.1/ws/hive/hwi/src/test/resources>
does not exist.

init:
     [echo] Project: hwi

create-dirs:
     [echo] Project: hbase-handler
     [copy] Warning: <https://builds.apache.org/job/Hive-0.10.0-SNAPSHOT-h0.20.1/ws/hive/hbase-handler/src/test/resources>
does not exist.

init:
     [echo] Project: hbase-handler

create-dirs:
     [echo] Project: pdk
     [copy] Warning: <https://builds.apache.org/job/Hive-0.10.0-SNAPSHOT-h0.20.1/ws/hive/pdk/src/test/resources>
does not exist.

init:
     [echo] Project: pdk

create-dirs:
     [echo] Project: builtins
     [copy] Warning: <https://builds.apache.org/job/Hive-0.10.0-SNAPSHOT-h0.20.1/ws/hive/builtins/src/test/resources>
does not exist.

init:
     [echo] Project: builtins

jar:
     [echo] Project: hive

create-dirs:
     [echo] Project: shims
     [copy] Warning: <https://builds.apache.org/job/Hive-0.10.0-SNAPSHOT-h0.20.1/ws/hive/shims/src/test/resources>
does not exist.

init:
     [echo] Project: shims

ivy-init-settings:
     [echo] Project: shims

ivy-resolve:
     [echo] Project: shims
[ivy:resolve] :: loading settings :: file = <https://builds.apache.org/job/Hive-0.10.0-SNAPSHOT-h0.20.1/ws/hive/ivy/ivysettings.xml>
[ivy:report] Processing <https://builds.apache.org/job/Hive-0.10.0-SNAPSHOT-h0.20.1/92/artifact/hive/build/ivy/resolution-cache/org.apache.hive-hive-shims-default.xml>
to <https://builds.apache.org/job/Hive-0.10.0-SNAPSHOT-h0.20.1/92/artifact/hive/build/ivy/report/org.apache.hive-hive-shims-default.html>

ivy-retrieve:
     [echo] Project: shims

compile:
     [echo] Project: shims
     [echo] Building shims 0.20

build-shims:
     [echo] Project: shims
     [echo] Compiling <https://builds.apache.org/job/Hive-0.10.0-SNAPSHOT-h0.20.1/ws/hive/shims/src/common/java;/home/jenkins/jenkins-slave/workspace/Hive-0.10.0-SNAPSHOT-h0.20.1/hive/shims/src/0.20/java>
against hadoop 0.20.2 (<https://builds.apache.org/job/Hive-0.10.0-SNAPSHOT-h0.20.1/92/artifact/hive/build/hadoopcore/hadoop-0.20.2)>

ivy-init-settings:
     [echo] Project: shims

ivy-resolve-hadoop-shim:
     [echo] Project: shims
[ivy:resolve] :: loading settings :: file = <https://builds.apache.org/job/Hive-0.10.0-SNAPSHOT-h0.20.1/ws/hive/ivy/ivysettings.xml>

ivy-retrieve-hadoop-shim:
     [echo] Project: shims
     [echo] Building shims 0.20S

build-shims:
     [echo] Project: shims
     [echo] Compiling <https://builds.apache.org/job/Hive-0.10.0-SNAPSHOT-h0.20.1/ws/hive/shims/src/common/java;/home/jenkins/jenkins-slave/workspace/Hive-0.10.0-SNAPSHOT-h0.20.1/hive/shims/src/common-secure/java;/home/jenkins/jenkins-slave/workspace/Hive-0.10.0-SNAPSHOT-h0.20.1/hive/shims/src/0.20S/java>
against hadoop 1.0.0 (<https://builds.apache.org/job/Hive-0.10.0-SNAPSHOT-h0.20.1/92/artifact/hive/build/hadoopcore/hadoop-1.0.0)>

ivy-init-settings:
     [echo] Project: shims

ivy-resolve-hadoop-shim:
     [echo] Project: shims
[ivy:resolve] :: loading settings :: file = <https://builds.apache.org/job/Hive-0.10.0-SNAPSHOT-h0.20.1/ws/hive/ivy/ivysettings.xml>
[ivy:resolve] downloading http://repo1.maven.org/maven2/org/apache/hadoop/hadoop-core/1.0.0/hadoop-core-1.0.0.jar
...
[ivy:resolve] ...................................................................................................................................................................................................................................................................................................................................................................................................................................................................................................................................................................................................................................
(3652kB)
[ivy:resolve] .. (0kB)
[ivy:resolve] 	[SUCCESSFUL ] org.apache.hadoop#hadoop-core;1.0.0!hadoop-core.jar (89ms)
[ivy:resolve] downloading http://repo1.maven.org/maven2/org/apache/hadoop/hadoop-tools/1.0.0/hadoop-tools-1.0.0.jar
...
[ivy:resolve] ..................................................... (281kB)
[ivy:resolve] .. (0kB)
[ivy:resolve] 	[SUCCESSFUL ] org.apache.hadoop#hadoop-tools;1.0.0!hadoop-tools.jar (17ms)
[ivy:resolve] downloading http://repo1.maven.org/maven2/org/apache/hadoop/hadoop-test/1.0.0/hadoop-test-1.0.0.jar
...
[ivy:resolve] .................................................................................................................................................................................................................................................................................................................................................................................................................................................
(2471kB)
[ivy:resolve] .. (0kB)
[ivy:resolve] 	[SUCCESSFUL ] org.apache.hadoop#hadoop-test;1.0.0!hadoop-test.jar (74ms)
[ivy:resolve] downloading http://repo1.maven.org/maven2/org/codehaus/jackson/jackson-mapper-asl/1.0.1/jackson-mapper-asl-1.0.1.jar
...
[ivy:resolve] ..................................................... (264kB)
[ivy:resolve] .. (0kB)
[ivy:resolve] 	[SUCCESSFUL ] org.codehaus.jackson#jackson-mapper-asl;1.0.1!jackson-mapper-asl.jar
(19ms)
[ivy:resolve] downloading http://repo1.maven.org/maven2/org/codehaus/jackson/jackson-core-asl/1.0.1/jackson-core-asl-1.0.1.jar
...
[ivy:resolve] ........................ (132kB)
[ivy:resolve] .. (0kB)
[ivy:resolve] 	[SUCCESSFUL ] org.codehaus.jackson#jackson-core-asl;1.0.1!jackson-core-asl.jar
(13ms)

ivy-retrieve-hadoop-shim:
     [echo] Project: shims
     [echo] Building shims 0.23

build-shims:
     [echo] Project: shims
     [echo] Compiling <https://builds.apache.org/job/Hive-0.10.0-SNAPSHOT-h0.20.1/ws/hive/shims/src/common/java;/home/jenkins/jenkins-slave/workspace/Hive-0.10.0-SNAPSHOT-h0.20.1/hive/shims/src/common-secure/java;/home/jenkins/jenkins-slave/workspace/Hive-0.10.0-SNAPSHOT-h0.20.1/hive/shims/src/0.23/java>
against hadoop 2.0.0-alpha (<https://builds.apache.org/job/Hive-0.10.0-SNAPSHOT-h0.20.1/92/artifact/hive/build/hadoopcore/hadoop-2.0.0-alpha)>

ivy-init-settings:
     [echo] Project: shims

ivy-resolve-hadoop-shim:
     [echo] Project: shims
[ivy:resolve] :: loading settings :: file = <https://builds.apache.org/job/Hive-0.10.0-SNAPSHOT-h0.20.1/ws/hive/ivy/ivysettings.xml>
[ivy:resolve] downloading http://repo1.maven.org/maven2/com/google/guava/guava/11.0.2/guava-11.0.2.jar
...
[ivy:resolve] .....................................................................................................................................................................................................................................................................................................................................................................
(1609kB)
[ivy:resolve] .. (0kB)
[ivy:resolve] downloading http://repo1.maven.org/maven2/org/apache/hadoop/hadoop-common/2.0.0-alpha/hadoop-common-2.0.0-alpha.jar
...
[ivy:resolve] ..............................................................................................................................................................................................................................................................................................................................................
(2051kB)
[ivy:resolve] .. (0kB)
[ivy:resolve] downloading http://repo1.maven.org/maven2/org/apache/hadoop/hadoop-archives/2.0.0-alpha/hadoop-archives-2.0.0-alpha.jar
...
[ivy:resolve] .... (20kB)
[ivy:resolve] .. (0kB)
[ivy:resolve] downloading http://repo1.maven.org/maven2/org/apache/hadoop/hadoop-hdfs/2.0.0-alpha/hadoop-hdfs-2.0.0-alpha.jar
...
[ivy:resolve] ...............................................................................................................................................................................................................................................................................................................................................................................................................................................................................................................................................................................................................................................................................................................................................................................................................................
(3790kB)
[ivy:resolve] .. (0kB)
[ivy:resolve] downloading http://repo1.maven.org/maven2/org/apache/hadoop/hadoop-hdfs/2.0.0-alpha/hadoop-hdfs-2.0.0-alpha-tests.jar
...
[ivy:resolve] .........................................................................................................................................................................................................................................................................................................................................................................................................
(1365kB)
[ivy:resolve] .. (0kB)
[ivy:resolve] 	[SUCCESSFUL ] org.apache.hadoop#hadoop-hdfs;2.0.0-alpha!hadoop-hdfs.jar(tests)
(74ms)
[ivy:resolve] downloading http://repo1.maven.org/maven2/org/apache/hadoop/hadoop-mapreduce-client-jobclient/2.0.0-alpha/hadoop-mapreduce-client-jobclient-2.0.0-alpha.jar
...
[ivy:resolve] .... (33kB)
[ivy:resolve] .. (0kB)
[ivy:resolve] 	[SUCCESSFUL ] org.apache.hadoop#hadoop-mapreduce-client-jobclient;2.0.0-alpha!hadoop-mapreduce-client-jobclient.jar
(51ms)
[ivy:resolve] downloading http://repo1.maven.org/maven2/org/apache/hadoop/hadoop-mapreduce-client-jobclient/2.0.0-alpha/hadoop-mapreduce-client-jobclient-2.0.0-alpha-tests.jar
...
[ivy:resolve] .................................................................................................................................................................................................................................................................................................................................................................................................
(1272kB)
[ivy:resolve] .. (0kB)
[ivy:resolve] downloading http://repo1.maven.org/maven2/tomcat/jasper-runtime/5.5.23/jasper-runtime-5.5.23.jar
...
[ivy:resolve] .............. (75kB)
[ivy:resolve] .. (0kB)
[ivy:resolve] 	[SUCCESSFUL ] tomcat#jasper-runtime;5.5.23!jasper-runtime.jar (41ms)
[ivy:resolve] downloading http://repo1.maven.org/maven2/com/google/protobuf/protobuf-java/2.4.0a/protobuf-java-2.4.0a.jar
...
[ivy:resolve] .............................................................................................
(439kB)
[ivy:resolve] .. (0kB)
[ivy:resolve] 	[SUCCESSFUL ] com.google.protobuf#protobuf-java;2.4.0a!protobuf-java.jar (31ms)
[ivy:resolve] downloading http://repo1.maven.org/maven2/org/apache/hadoop/hadoop-auth/2.0.0-alpha/hadoop-auth-2.0.0-alpha.jar
...
[ivy:resolve] ......... (42kB)
[ivy:resolve] .. (0kB)
[ivy:resolve] 	[SUCCESSFUL ] org.apache.hadoop#hadoop-auth;2.0.0-alpha!hadoop-auth.jar (11ms)
[ivy:resolve] downloading http://repo1.maven.org/maven2/com/googlecode/json-simple/json-simple/1.1/json-simple-1.1.jar
...
[ivy:resolve] .. (15kB)
[ivy:resolve] .. (0kB)
[ivy:resolve] downloading http://repo1.maven.org/maven2/com/jcraft/jsch/0.1.42/jsch-0.1.42.jar
...
[ivy:resolve] .............................................. (181kB)
[ivy:resolve] .. (0kB)
[ivy:resolve] 	[SUCCESSFUL ] com.jcraft#jsch;0.1.42!jsch.jar (30ms)
[ivy:resolve] downloading http://repo1.maven.org/maven2/org/apache/zookeeper/zookeeper/3.4.2/zookeeper-3.4.2.jar
...
[ivy:resolve] .................................................................................................................
(746kB)
[ivy:resolve] .. (0kB)
[ivy:resolve] 	[SUCCESSFUL ] org.apache.zookeeper#zookeeper;3.4.2!zookeeper.jar (27ms)
[ivy:resolve] downloading http://repo1.maven.org/maven2/org/xerial/snappy/snappy-java/1.0.3.2/snappy-java-1.0.3.2.jar
...
[ivy:resolve] ..........................................................................................................................................................
(972kB)
[ivy:resolve] .. (0kB)
[ivy:resolve] downloading http://repo1.maven.org/maven2/jline/jline/0.9.94/jline-0.9.94.jar
...
[ivy:resolve] .................. (85kB)
[ivy:resolve] .. (0kB)
[ivy:resolve] 	[SUCCESSFUL ] jline#jline;0.9.94!jline.jar (18ms)
[ivy:resolve] downloading http://repo1.maven.org/maven2/org/jboss/netty/netty/3.2.3.Final/netty-3.2.3.Final.jar
...
[ivy:resolve] ...........................................................................................................................................
(767kB)
[ivy:resolve] .. (0kB)
[ivy:resolve] 	[SUCCESSFUL ] org.jboss.netty#netty;3.2.3.Final!netty.jar(bundle) (54ms)
[ivy:resolve] downloading http://repo1.maven.org/maven2/com/google/inject/extensions/guice-servlet/3.0/guice-servlet-3.0.jar
...
[ivy:resolve] ................. (63kB)
[ivy:resolve] .. (0kB)
[ivy:resolve] 	[SUCCESSFUL ] com.google.inject.extensions#guice-servlet;3.0!guice-servlet.jar
(83ms)
[ivy:resolve] downloading http://repo1.maven.org/maven2/com/google/inject/guice/3.0/guice-3.0.jar
...
[ivy:resolve] ..............................................................................................................
(693kB)
[ivy:resolve] downloading http://repo1.maven.org/maven2/org/apache/hadoop/hadoop-mapreduce-client-shuffle/2.0.0-alpha/hadoop-mapreduce-client-shuffle-2.0.0-alpha.jar
...
[ivy:resolve] .. (15kB)
[ivy:resolve] .. (0kB)
[ivy:resolve] downloading http://repo1.maven.org/maven2/org/apache/hadoop/hadoop-yarn-server-nodemanager/2.0.0-alpha/hadoop-yarn-server-nodemanager-2.0.0-alpha.jar
...
[ivy:resolve] ....................................................................... (379kB)
[ivy:resolve] .. (0kB)
[ivy:resolve] 	[SUCCESSFUL ] org.apache.hadoop#hadoop-yarn-server-nodemanager;2.0.0-alpha!hadoop-yarn-server-nodemanager.jar
(54ms)
[ivy:resolve] 
[ivy:resolve] :: problems summary ::
[ivy:resolve] :::: WARNINGS
[ivy:resolve] 	problem while downloading module descriptor: http://repo1.maven.org/maven2/org/apache/hadoop/hadoop-yarn-server-common/2.0.0-alpha/hadoop-yarn-server-common-2.0.0-alpha.pom:
/home/jenkins/.ivy2/cache/org.apache.hadoop/hadoop-yarn-server-common/ivy-2.0.0-alpha.xml.original.part
(No such file or directory) (10ms)
[ivy:resolve] 		module not found: org.apache.hadoop#hadoop-yarn-server-common;2.0.0-alpha
[ivy:resolve] 	==== local: tried
[ivy:resolve] 	  /home/jenkins/.ivy2/local/org.apache.hadoop/hadoop-yarn-server-common/2.0.0-alpha/ivys/ivy.xml
[ivy:resolve] 	  -- artifact org.apache.hadoop#hadoop-yarn-server-common;2.0.0-alpha!hadoop-yarn-server-common.jar:
[ivy:resolve] 	  /home/jenkins/.ivy2/local/org.apache.hadoop/hadoop-yarn-server-common/2.0.0-alpha/jars/hadoop-yarn-server-common.jar
[ivy:resolve] 	==== apache-snapshot: tried
[ivy:resolve] 	  https://repository.apache.org/content/repositories/snapshots/org/apache/hadoop/hadoop-yarn-server-common/2.0.0-alpha/hadoop-yarn-server-common-2.0.0-alpha.pom
[ivy:resolve] 	  -- artifact org.apache.hadoop#hadoop-yarn-server-common;2.0.0-alpha!hadoop-yarn-server-common.jar:
[ivy:resolve] 	  https://repository.apache.org/content/repositories/snapshots/org/apache/hadoop/hadoop-yarn-server-common/2.0.0-alpha/hadoop-yarn-server-common-2.0.0-alpha.jar
[ivy:resolve] 	==== maven2: tried
[ivy:resolve] 	  http://repo1.maven.org/maven2/org/apache/hadoop/hadoop-yarn-server-common/2.0.0-alpha/hadoop-yarn-server-common-2.0.0-alpha.pom
[ivy:resolve] 	==== datanucleus-repo: tried
[ivy:resolve] 	  -- artifact org.apache.hadoop#hadoop-yarn-server-common;2.0.0-alpha!hadoop-yarn-server-common.jar:
[ivy:resolve] 	  http://www.datanucleus.org/downloads/maven2/org/apache/hadoop/hadoop-yarn-server-common/2.0.0-alpha/hadoop-yarn-server-common-2.0.0-alpha.jar
[ivy:resolve] 	==== sourceforge: tried
[ivy:resolve] 	  -- artifact org.apache.hadoop#hadoop-yarn-server-common;2.0.0-alpha!hadoop-yarn-server-common.jar:
[ivy:resolve] 	  http://www.sourceforge.net/projects/hadoop-yarn-server-common/files/hadoop-yarn-server-common//hadoop-yarn-server-common-2.0.0-alpha.jar
[ivy:resolve] 		[FAILED     ] com.google.guava#guava;11.0.2!guava.jar: impossible to move
part file to definitive one: /home/jenkins/.ivy2/cache/com.google.guava/guava/jars/guava-11.0.2.jar.part
-> /home/jenkins/.ivy2/cache/com.google.guava/guava/jars/guava-11.0.2.jar (59ms)
[ivy:resolve] 		[FAILED     ] org.apache.hadoop#hadoop-common;2.0.0-alpha!hadoop-common.jar:
/home/jenkins/.ivy2/cache/org.apache.hadoop/hadoop-common/jars/hadoop-common-2.0.0-alpha.jar.part
(No such file or directory) (39ms)
[ivy:resolve] 		[FAILED     ] org.apache.hadoop#hadoop-archives;2.0.0-alpha!hadoop-archives.jar:
/home/jenkins/.ivy2/cache/org.apache.hadoop/hadoop-archives/jars/hadoop-archives-2.0.0-alpha.jar.part
(No such file or directory) (15ms)
[ivy:resolve] 		[FAILED     ] org.apache.hadoop#hadoop-hdfs;2.0.0-alpha!hadoop-hdfs.jar: impossible
to move part file to definitive one: /home/jenkins/.ivy2/cache/org.apache.hadoop/hadoop-hdfs/jars/hadoop-hdfs-2.0.0-alpha.jar.part
-> /home/jenkins/.ivy2/cache/org.apache.hadoop/hadoop-hdfs/jars/hadoop-hdfs-2.0.0-alpha.jar
(129ms)
[ivy:resolve] 		[FAILED     ] org.apache.hadoop#hadoop-mapreduce-client-jobclient;2.0.0-alpha!hadoop-mapreduce-client-jobclient.jar(tests):
impossible to move part file to definitive one: /home/jenkins/.ivy2/cache/org.apache.hadoop/hadoop-mapreduce-client-jobclient/testss/hadoop-mapreduce-client-jobclient-2.0.0-alpha-tests.jar.part
-> /home/jenkins/.ivy2/cache/org.apache.hadoop/hadoop-mapreduce-client-jobclient/testss/hadoop-mapreduce-client-jobclient-2.0.0-alpha-tests.jar
(52ms)
[ivy:resolve] 		[FAILED     ] com.googlecode.json-simple#json-simple;1.1!json-simple.jar:
/home/jenkins/.ivy2/cache/com.googlecode.json-simple/json-simple/jars/json-simple-1.1.jar.part
(No such file or directory) (11ms)
[ivy:resolve] 		[FAILED     ] org.xerial.snappy#snappy-java;1.0.3.2!snappy-java.jar(bundle):
/home/jenkins/.ivy2/cache/org.xerial.snappy/snappy-java/bundles/snappy-java-1.0.3.2.jar.part
(No such file or directory) (26ms)
[ivy:resolve] 		[FAILED     ] com.google.inject#guice;3.0!guice.jar: Downloaded file size
doesn't match expected Content Length for http://repo1.maven.org/maven2/com/google/inject/guice/3.0/guice-3.0.jar.
Please retry. (12ms)
[ivy:resolve] 		[FAILED     ] com.google.inject#guice;3.0!guice.jar:  (0ms)
[ivy:resolve] 	==== local: tried
[ivy:resolve] 	  /home/jenkins/.ivy2/local/com.google.inject/guice/3.0/jars/guice.jar
[ivy:resolve] 	==== apache-snapshot: tried
[ivy:resolve] 	  https://repository.apache.org/content/repositories/snapshots/com/google/inject/guice/3.0/guice-3.0.jar
[ivy:resolve] 	==== maven2: tried
[ivy:resolve] 	  http://repo1.maven.org/maven2/com/google/inject/guice/3.0/guice-3.0.jar
[ivy:resolve] 	==== datanucleus-repo: tried
[ivy:resolve] 	  http://www.datanucleus.org/downloads/maven2/com/google/inject/guice/3.0/guice-3.0.jar
[ivy:resolve] 	==== sourceforge: tried
[ivy:resolve] 	  http://www.sourceforge.net/projects/guice/files/guice//guice-3.0.jar
[ivy:resolve] 		[FAILED     ] org.apache.hadoop#hadoop-mapreduce-client-shuffle;2.0.0-alpha!hadoop-mapreduce-client-shuffle.jar:
/home/jenkins/.ivy2/cache/org.apache.hadoop/hadoop-mapreduce-client-shuffle/jars/hadoop-mapreduce-client-shuffle-2.0.0-alpha.jar.part
(No such file or directory) (10ms)
[ivy:resolve] 		::::::::::::::::::::::::::::::::::::::::::::::
[ivy:resolve] 		::          UNRESOLVED DEPENDENCIES         ::
[ivy:resolve] 		::::::::::::::::::::::::::::::::::::::::::::::
[ivy:resolve] 		:: org.apache.hadoop#hadoop-yarn-server-common;2.0.0-alpha: not found
[ivy:resolve] 		::::::::::::::::::::::::::::::::::::::::::::::
[ivy:resolve] 		::::::::::::::::::::::::::::::::::::::::::::::
[ivy:resolve] 		::              FAILED DOWNLOADS            ::
[ivy:resolve] 		:: ^ see resolution messages for details  ^ ::
[ivy:resolve] 		::::::::::::::::::::::::::::::::::::::::::::::
[ivy:resolve] 		:: com.google.inject#guice;3.0!guice.jar
[ivy:resolve] 		::::::::::::::::::::::::::::::::::::::::::::::
[ivy:resolve] 
[ivy:resolve] :: USE VERBOSE OR DEBUG MESSAGE LEVEL FOR MORE DETAILS

BUILD FAILED
<https://builds.apache.org/job/Hive-0.10.0-SNAPSHOT-h0.20.1/ws/hive/build.xml>:302:
The following error occurred while executing this line:
<https://builds.apache.org/job/Hive-0.10.0-SNAPSHOT-h0.20.1/ws/hive/build.xml>:152:
The following error occurred while executing this line:
<https://builds.apache.org/job/Hive-0.10.0-SNAPSHOT-h0.20.1/ws/hive/shims/build.xml>:73:
The following error occurred while executing this line:
<https://builds.apache.org/job/Hive-0.10.0-SNAPSHOT-h0.20.1/ws/hive/shims/build.xml>:76:
The following error occurred while executing this line:
<https://builds.apache.org/job/Hive-0.10.0-SNAPSHOT-h0.20.1/ws/hive/shims/build.xml>:48:
The following error occurred while executing this line:
<https://builds.apache.org/job/Hive-0.10.0-SNAPSHOT-h0.20.1/ws/hive/build-common.xml>:168:
impossible to resolve dependencies:
	resolve failed - see output for details

Total time: 9 minutes 1 second
Build step 'Invoke Ant' marked build as failure
Archiving artifacts
Recording test results

Mime
View raw message