hive-dev mailing list archives

Site index · List index
Message view « Date » · « Thread »
Top « Date » · « Thread »
From Apache Jenkins Server <jenk...@builds.apache.org>
Subject Build failed in Jenkins: Hive-0.9.1-SNAPSHOT-h0.21 #290
Date Tue, 12 Feb 2013 16:04:56 GMT
See <https://builds.apache.org/job/Hive-0.9.1-SNAPSHOT-h0.21/290/>

------------------------------------------
[...truncated 5492 lines...]
     [copy] Warning: /x1/jenkins/jenkins-slave/workspace/Hive-0.9.1-SNAPSHOT-h0.21/hive/pdk/src/test/resources
does not exist.

init:
     [echo] Project: pdk

create-dirs:
     [echo] Project: builtins
    [mkdir] Created dir: /x1/jenkins/jenkins-slave/workspace/Hive-0.9.1-SNAPSHOT-h0.21/hive/build/builtins
    [mkdir] Created dir: /x1/jenkins/jenkins-slave/workspace/Hive-0.9.1-SNAPSHOT-h0.21/hive/build/builtins/classes
    [mkdir] Created dir: /x1/jenkins/jenkins-slave/workspace/Hive-0.9.1-SNAPSHOT-h0.21/hive/build/builtins/test
    [mkdir] Created dir: /x1/jenkins/jenkins-slave/workspace/Hive-0.9.1-SNAPSHOT-h0.21/hive/build/builtins/test/src
    [mkdir] Created dir: /x1/jenkins/jenkins-slave/workspace/Hive-0.9.1-SNAPSHOT-h0.21/hive/build/builtins/test/classes
    [mkdir] Created dir: /x1/jenkins/jenkins-slave/workspace/Hive-0.9.1-SNAPSHOT-h0.21/hive/build/builtins/test/resources
     [copy] Warning: /x1/jenkins/jenkins-slave/workspace/Hive-0.9.1-SNAPSHOT-h0.21/hive/builtins/src/test/resources
does not exist.

init:
     [echo] Project: builtins

jar:
     [echo] Project: hive

create-dirs:
     [echo] Project: shims
     [copy] Warning: /x1/jenkins/jenkins-slave/workspace/Hive-0.9.1-SNAPSHOT-h0.21/hive/shims/src/test/resources
does not exist.

init:
     [echo] Project: shims

ivy-init-settings:
     [echo] Project: shims

ivy-resolve:
     [echo] Project: shims
[ivy:resolve] :: loading settings :: file = /x1/jenkins/jenkins-slave/workspace/Hive-0.9.1-SNAPSHOT-h0.21/hive/ivy/ivysettings.xml
[ivy:resolve] downloading http://repo1.maven.org/maven2/org/apache/thrift/libthrift/0.7.0/libthrift-0.7.0.jar
...
[ivy:resolve] ............................................ (294kB)
[ivy:resolve] .. (0kB)
[ivy:resolve] 	[SUCCESSFUL ] org.apache.thrift#libthrift;0.7.0!libthrift.jar (155ms)
[ivy:report] Processing /x1/jenkins/jenkins-slave/workspace/Hive-0.9.1-SNAPSHOT-h0.21/hive/build/ivy/resolution-cache/org.apache.hive-hive-shims-default.xml
to /x1/jenkins/jenkins-slave/workspace/Hive-0.9.1-SNAPSHOT-h0.21/hive/build/ivy/report/org.apache.hive-hive-shims-default.html

ivy-retrieve:
     [echo] Project: shims

compile:
     [echo] Project: shims
     [echo] Building shims 0.20

build_shims:
     [echo] Project: shims
     [echo] Compiling /x1/jenkins/jenkins-slave/workspace/Hive-0.9.1-SNAPSHOT-h0.21/hive/shims/src/common/java;/x1/jenkins/jenkins-slave/workspace/Hive-0.9.1-SNAPSHOT-h0.21/hive/shims/src/0.20/java
against hadoop 0.20.2 (/x1/jenkins/jenkins-slave/workspace/Hive-0.9.1-SNAPSHOT-h0.21/hive/build/hadoopcore/hadoop-0.20.2)

ivy-init-settings:
     [echo] Project: shims

ivy-resolve-hadoop-shim:
     [echo] Project: shims
[ivy:resolve] :: loading settings :: file = /x1/jenkins/jenkins-slave/workspace/Hive-0.9.1-SNAPSHOT-h0.21/hive/ivy/ivysettings.xml
[ivy:resolve] downloading http://repo1.maven.org/maven2/com/google/guava/guava/r09/guava-r09.jar
...
[ivy:resolve] ...........................................................................................................................
(1117kB)
[ivy:resolve] .. (0kB)
[ivy:resolve] 	[SUCCESSFUL ] com.google.guava#guava;r09!guava.jar (165ms)
[ivy:resolve] downloading http://repo1.maven.org/maven2/org/apache/hadoop/hadoop-core/0.20.2/hadoop-core-0.20.2.jar
...
[ivy:resolve] ........................................................................................................................................................................................................................................................................................................................
(2624kB)
[ivy:resolve] .. (0kB)
[ivy:resolve] 	[SUCCESSFUL ] org.apache.hadoop#hadoop-core;0.20.2!hadoop-core.jar (160ms)
[ivy:resolve] downloading http://repo1.maven.org/maven2/org/apache/hadoop/hadoop-tools/0.20.2/hadoop-tools-0.20.2.jar
...
[ivy:resolve] ....... (68kB)
[ivy:resolve] .. (0kB)
[ivy:resolve] 	[SUCCESSFUL ] org.apache.hadoop#hadoop-tools;0.20.2!hadoop-tools.jar (211ms)
[ivy:resolve] downloading http://repo1.maven.org/maven2/org/apache/hadoop/hadoop-test/0.20.2/hadoop-test-0.20.2.jar
...
[ivy:resolve] ................................................................................................................................................................
(1527kB)
[ivy:resolve] .. (0kB)
[ivy:resolve] 	[SUCCESSFUL ] org.apache.hadoop#hadoop-test;0.20.2!hadoop-test.jar (245ms)
[ivy:resolve] downloading http://repo1.maven.org/maven2/commons-cli/commons-cli/1.2/commons-cli-1.2.jar
...
[ivy:resolve] ....... (40kB)
[ivy:resolve] .. (0kB)
[ivy:resolve] 	[SUCCESSFUL ] commons-cli#commons-cli;1.2!commons-cli.jar (32ms)
[ivy:resolve] downloading http://repo1.maven.org/maven2/xmlenc/xmlenc/0.52/xmlenc-0.52.jar
...
[ivy:resolve] .. (14kB)
[ivy:resolve] .. (0kB)
[ivy:resolve] 	[SUCCESSFUL ] xmlenc#xmlenc;0.52!xmlenc.jar (90ms)
[ivy:resolve] downloading http://repo1.maven.org/maven2/commons-httpclient/commons-httpclient/3.0.1/commons-httpclient-3.0.1.jar
...
[ivy:resolve] ......................... (273kB)
[ivy:resolve] .. (0kB)
[ivy:resolve] 	[SUCCESSFUL ] commons-httpclient#commons-httpclient;3.0.1!commons-httpclient.jar
(154ms)
[ivy:resolve] downloading http://repo1.maven.org/maven2/commons-codec/commons-codec/1.3/commons-codec-1.3.jar
...
[ivy:resolve] ...... (45kB)
[ivy:resolve] .. (0kB)
[ivy:resolve] 	[SUCCESSFUL ] commons-codec#commons-codec;1.3!commons-codec.jar (30ms)
[ivy:resolve] downloading http://repo1.maven.org/maven2/commons-net/commons-net/1.4.1/commons-net-1.4.1.jar
...
[ivy:resolve] ................ (176kB)
[ivy:resolve] .. (0kB)
[ivy:resolve] 	[SUCCESSFUL ] commons-net#commons-net;1.4.1!commons-net.jar (42ms)
[ivy:resolve] downloading http://repo1.maven.org/maven2/org/mortbay/jetty/jetty/6.1.14/jetty-6.1.14.jar
...
[ivy:resolve] ........................................... (504kB)
[ivy:resolve] .. (0kB)
[ivy:resolve] downloading http://repo1.maven.org/maven2/org/mortbay/jetty/jetty-util/6.1.14/jetty-util-6.1.14.jar
...
[ivy:resolve] ........................... (159kB)
[ivy:resolve] .. (0kB)
[ivy:resolve] 	[SUCCESSFUL ] org.mortbay.jetty#jetty-util;6.1.14!jetty-util.jar (72ms)
[ivy:resolve] downloading http://repo1.maven.org/maven2/tomcat/jasper-runtime/5.5.12/jasper-runtime-5.5.12.jar
...
[ivy:resolve] ...... (74kB)
[ivy:resolve] .. (0kB)
[ivy:resolve] 	[SUCCESSFUL ] tomcat#jasper-runtime;5.5.12!jasper-runtime.jar (152ms)
[ivy:resolve] downloading http://repo1.maven.org/maven2/tomcat/jasper-compiler/5.5.12/jasper-compiler-5.5.12.jar
...
[ivy:resolve] .............................. (395kB)
[ivy:resolve] .. (0kB)
[ivy:resolve] 	[SUCCESSFUL ] tomcat#jasper-compiler;5.5.12!jasper-compiler.jar (102ms)
[ivy:resolve] downloading http://repo1.maven.org/maven2/org/mortbay/jetty/jsp-2.1/6.1.14/jsp-2.1-6.1.14.jar
...
[ivy:resolve] ........................................................................................................
(1000kB)
[ivy:resolve] .. (0kB)
[ivy:resolve] 	[SUCCESSFUL ] org.mortbay.jetty#jsp-2.1;6.1.14!jsp-2.1.jar (108ms)
[ivy:resolve] downloading http://repo1.maven.org/maven2/commons-el/commons-el/1.0/commons-el-1.0.jar
...
[ivy:resolve] ............. (109kB)
[ivy:resolve] .. (0kB)
[ivy:resolve] 	[SUCCESSFUL ] commons-el#commons-el;1.0!commons-el.jar (60ms)
[ivy:resolve] downloading http://repo1.maven.org/maven2/net/java/dev/jets3t/jets3t/0.7.1/jets3t-0.7.1.jar
...
[ivy:resolve] ........................... (368kB)
[ivy:resolve] .. (0kB)
[ivy:resolve] downloading http://repo1.maven.org/maven2/org/mortbay/jetty/servlet-api-2.5/6.1.14/servlet-api-2.5-6.1.14.jar
...
[ivy:resolve] ............ (129kB)
[ivy:resolve] .. (0kB)
[ivy:resolve] 	[SUCCESSFUL ] org.mortbay.jetty#servlet-api-2.5;6.1.14!servlet-api-2.5.jar
(87ms)
[ivy:resolve] downloading http://repo1.maven.org/maven2/net/sf/kosmosfs/kfs/0.3/kfs-0.3.jar
...
[ivy:resolve] .. (11kB)
[ivy:resolve] .. (0kB)
[ivy:resolve] 	[SUCCESSFUL ] net.sf.kosmosfs#kfs;0.3!kfs.jar (63ms)
[ivy:resolve] downloading http://repo1.maven.org/maven2/junit/junit/4.5/junit-4.5.jar ...
[ivy:resolve] .............................. (194kB)
[ivy:resolve] .. (0kB)
[ivy:resolve] 	[SUCCESSFUL ] junit#junit;4.5!junit.jar (82ms)
[ivy:resolve] downloading http://repo1.maven.org/maven2/hsqldb/hsqldb/1.8.0.10/hsqldb-1.8.0.10.jar
...
[ivy:resolve] .......................................................... (690kB)
[ivy:resolve] .. (0kB)
[ivy:resolve] 	[SUCCESSFUL ] hsqldb#hsqldb;1.8.0.10!hsqldb.jar (80ms)
[ivy:resolve] downloading http://repo1.maven.org/maven2/oro/oro/2.0.8/oro-2.0.8.jar ...
[ivy:resolve] ......... (63kB)
[ivy:resolve] .. (0kB)
[ivy:resolve] 	[SUCCESSFUL ] oro#oro;2.0.8!oro.jar (30ms)
[ivy:resolve] downloading http://repo1.maven.org/maven2/org/eclipse/jdt/core/3.1.1/core-3.1.1.jar
...
[ivy:resolve] .......................................................................................................................................................................................................................................................................................................................
(3483kB)
[ivy:resolve] .. (0kB)
[ivy:resolve] 	[SUCCESSFUL ] org.eclipse.jdt#core;3.1.1!core.jar (166ms)
[ivy:resolve] downloading http://repo1.maven.org/maven2/ant/ant/1.6.5/ant-1.6.5.jar ...
[ivy:resolve] .......................................................................................
(1009kB)
[ivy:resolve] .. (0kB)
[ivy:resolve] 	[SUCCESSFUL ] ant#ant;1.6.5!ant.jar (47ms)
[ivy:resolve] downloading http://repo1.maven.org/maven2/commons-logging/commons-logging/1.1.1/commons-logging-1.1.1.jar
...
[ivy:resolve] .... (59kB)
[ivy:resolve] .. (0kB)
[ivy:resolve] 	[SUCCESSFUL ] commons-logging#commons-logging;1.1.1!commons-logging.jar (31ms)
[ivy:resolve] downloading http://repo1.maven.org/maven2/org/apache/ftpserver/ftplet-api/1.0.0/ftplet-api-1.0.0.jar
...
[ivy:resolve] ... (22kB)
[ivy:resolve] .. (0kB)
[ivy:resolve] downloading http://repo1.maven.org/maven2/org/apache/mina/mina-core/2.0.0-M5/mina-core-2.0.0-M5.jar
...
[ivy:resolve] .................................................................. (622kB)
[ivy:resolve] .. (0kB)
[ivy:resolve] 	[SUCCESSFUL ] org.apache.mina#mina-core;2.0.0-M5!mina-core.jar(bundle) (273ms)
[ivy:resolve] downloading http://repo1.maven.org/maven2/org/apache/ftpserver/ftpserver-deprecated/1.0.0-M2/ftpserver-deprecated-1.0.0-M2.jar
...
[ivy:resolve] ... (31kB)
[ivy:resolve] .. (0kB)
[ivy:resolve] 	[SUCCESSFUL ] org.apache.ftpserver#ftpserver-deprecated;1.0.0-M2!ftpserver-deprecated.jar
(44ms)
[ivy:resolve] downloading http://repo1.maven.org/maven2/org/slf4j/slf4j-api/1.5.2/slf4j-api-1.5.2.jar
...
[ivy:resolve] .. (16kB)
[ivy:resolve] .. (0kB)
[ivy:resolve] 
[ivy:resolve] :: problems summary ::
[ivy:resolve] :::: WARNINGS
[ivy:resolve] 	problem while downloading module descriptor: http://repo1.maven.org/maven2/org/mortbay/jetty/jsp-api-2.1/6.1.14/jsp-api-2.1-6.1.14.pom:
/home/jenkins/.ivy2/cache/org.mortbay.jetty/jsp-api-2.1/ivy-6.1.14.xml.original.part (No such
file or directory) (59ms)
[ivy:resolve] 		module not found: org.mortbay.jetty#jsp-api-2.1;6.1.14
[ivy:resolve] 	==== local: tried
[ivy:resolve] 	  /home/jenkins/.ivy2/local/org.mortbay.jetty/jsp-api-2.1/6.1.14/ivys/ivy.xml
[ivy:resolve] 	  -- artifact org.mortbay.jetty#jsp-api-2.1;6.1.14!jsp-api-2.1.jar:
[ivy:resolve] 	  /home/jenkins/.ivy2/local/org.mortbay.jetty/jsp-api-2.1/6.1.14/jars/jsp-api-2.1.jar
[ivy:resolve] 	==== apache-snapshot: tried
[ivy:resolve] 	  https://repository.apache.org/content/repositories/snapshots/org/mortbay/jetty/jsp-api-2.1/6.1.14/jsp-api-2.1-6.1.14.pom
[ivy:resolve] 	  -- artifact org.mortbay.jetty#jsp-api-2.1;6.1.14!jsp-api-2.1.jar:
[ivy:resolve] 	  https://repository.apache.org/content/repositories/snapshots/org/mortbay/jetty/jsp-api-2.1/6.1.14/jsp-api-2.1-6.1.14.jar
[ivy:resolve] 	==== maven2: tried
[ivy:resolve] 	  http://repo1.maven.org/maven2/org/mortbay/jetty/jsp-api-2.1/6.1.14/jsp-api-2.1-6.1.14.pom
[ivy:resolve] 	==== datanucleus-repo: tried
[ivy:resolve] 	  -- artifact org.mortbay.jetty#jsp-api-2.1;6.1.14!jsp-api-2.1.jar:
[ivy:resolve] 	  http://www.datanucleus.org/downloads/maven2/org/mortbay/jetty/jsp-api-2.1/6.1.14/jsp-api-2.1-6.1.14.jar
[ivy:resolve] 	==== hadoop-source: tried
[ivy:resolve] 	  -- artifact org.mortbay.jetty#jsp-api-2.1;6.1.14!jsp-api-2.1.jar:
[ivy:resolve] 	  http://mirror.facebook.net/facebook/hive-deps/hadoop/core/jsp-api-2.1-6.1.14/jsp-api-2.1-6.1.14.jar
[ivy:resolve] 	==== hadoop-source2: tried
[ivy:resolve] 	  -- artifact org.mortbay.jetty#jsp-api-2.1;6.1.14!jsp-api-2.1.jar:
[ivy:resolve] 	  http://archive.cloudera.com/hive-deps/hadoop/core/jsp-api-2.1-6.1.14/jsp-api-2.1-6.1.14.jar
[ivy:resolve] 	impossible to put metadata file in cache: http://repo1.maven.org/maven2/commons-logging/commons-logging/1.1.1/commons-logging-1.1.1.pom
(1.1.1). java.io.FileNotFoundException: /home/jenkins/.ivy2/cache/commons-logging/commons-logging/ivy-1.1.1.xml.original
(No such file or directory)
[ivy:resolve] 	impossible to put metadata file in cache: http://repo1.maven.org/maven2/org/apache/ftpserver/ftpserver-parent/1.0.0/ftpserver-parent-1.0.0.pom
(1.0.0). java.io.FileNotFoundException: /home/jenkins/.ivy2/cache/org.apache.ftpserver/ftpserver-parent/ivy-1.0.0.xml.original
(No such file or directory)
[ivy:resolve] 		[FAILED     ] org.mortbay.jetty#jetty;6.1.14!jetty.jar: invalid sha1: expected=5ded67b609e59c27e82ff61b510773d28c9bef56
computed=b6b7204a84bd12ab29c8812dc37bd24439cc2696 (76ms)
[ivy:resolve] 		[FAILED     ] org.mortbay.jetty#jetty;6.1.14!jetty.jar:  (0ms)
[ivy:resolve] 	==== local: tried
[ivy:resolve] 	  /home/jenkins/.ivy2/local/org.mortbay.jetty/jetty/6.1.14/jars/jetty.jar
[ivy:resolve] 	==== apache-snapshot: tried
[ivy:resolve] 	  https://repository.apache.org/content/repositories/snapshots/org/mortbay/jetty/jetty/6.1.14/jetty-6.1.14.jar
[ivy:resolve] 	==== maven2: tried
[ivy:resolve] 	  http://repo1.maven.org/maven2/org/mortbay/jetty/jetty/6.1.14/jetty-6.1.14.jar
[ivy:resolve] 	==== datanucleus-repo: tried
[ivy:resolve] 	  http://www.datanucleus.org/downloads/maven2/org/mortbay/jetty/jetty/6.1.14/jetty-6.1.14.jar
[ivy:resolve] 	==== hadoop-source: tried
[ivy:resolve] 	  http://mirror.facebook.net/facebook/hive-deps/hadoop/core/jetty-6.1.14/jetty-6.1.14.jar
[ivy:resolve] 	==== hadoop-source2: tried
[ivy:resolve] 	  http://archive.cloudera.com/hive-deps/hadoop/core/jetty-6.1.14/jetty-6.1.14.jar
[ivy:resolve] 		[FAILED     ] net.java.dev.jets3t#jets3t;0.7.1!jets3t.jar: invalid sha1: expected=2d10b62398360c674b4039ea4f2d1c697f46f6cd
computed=9721a9277feb5323b50d91246f369ebc62b2633b (194ms)
[ivy:resolve] 		[FAILED     ] net.java.dev.jets3t#jets3t;0.7.1!jets3t.jar:  (0ms)
[ivy:resolve] 	==== local: tried
[ivy:resolve] 	  /home/jenkins/.ivy2/local/net.java.dev.jets3t/jets3t/0.7.1/jars/jets3t.jar
[ivy:resolve] 	==== apache-snapshot: tried
[ivy:resolve] 	  https://repository.apache.org/content/repositories/snapshots/net/java/dev/jets3t/jets3t/0.7.1/jets3t-0.7.1.jar
[ivy:resolve] 	==== maven2: tried
[ivy:resolve] 	  http://repo1.maven.org/maven2/net/java/dev/jets3t/jets3t/0.7.1/jets3t-0.7.1.jar
[ivy:resolve] 	==== datanucleus-repo: tried
[ivy:resolve] 	  http://www.datanucleus.org/downloads/maven2/net/java/dev/jets3t/jets3t/0.7.1/jets3t-0.7.1.jar
[ivy:resolve] 	==== hadoop-source: tried
[ivy:resolve] 	  http://mirror.facebook.net/facebook/hive-deps/hadoop/core/jets3t-0.7.1/jets3t-0.7.1.jar
[ivy:resolve] 	==== hadoop-source2: tried
[ivy:resolve] 	  http://archive.cloudera.com/hive-deps/hadoop/core/jets3t-0.7.1/jets3t-0.7.1.jar
[ivy:resolve] 		[FAILED     ] org.apache.ftpserver#ftplet-api;1.0.0!ftplet-api.jar(bundle):
impossible to move part file to definitive one: /home/jenkins/.ivy2/cache/org.apache.ftpserver/ftplet-api/bundles/ftplet-api-1.0.0.jar.part
-> /home/jenkins/.ivy2/cache/org.apache.ftpserver/ftplet-api/bundles/ftplet-api-1.0.0.jar
(184ms)
[ivy:resolve] 		[FAILED     ] org.slf4j#slf4j-api;1.5.2!slf4j-api.jar: /home/jenkins/.ivy2/cache/org.slf4j/slf4j-api/jars/slf4j-api-1.5.2.jar.part
(No such file or directory) (65ms)
[ivy:resolve] 		::::::::::::::::::::::::::::::::::::::::::::::
[ivy:resolve] 		::          UNRESOLVED DEPENDENCIES         ::
[ivy:resolve] 		::::::::::::::::::::::::::::::::::::::::::::::
[ivy:resolve] 		:: org.mortbay.jetty#jsp-api-2.1;6.1.14: not found
[ivy:resolve] 		::::::::::::::::::::::::::::::::::::::::::::::
[ivy:resolve] 		::::::::::::::::::::::::::::::::::::::::::::::
[ivy:resolve] 		::              FAILED DOWNLOADS            ::
[ivy:resolve] 		:: ^ see resolution messages for details  ^ ::
[ivy:resolve] 		::::::::::::::::::::::::::::::::::::::::::::::
[ivy:resolve] 		:: org.mortbay.jetty#jetty;6.1.14!jetty.jar
[ivy:resolve] 		:: net.java.dev.jets3t#jets3t;0.7.1!jets3t.jar
[ivy:resolve] 		::::::::::::::::::::::::::::::::::::::::::::::
[ivy:resolve] 
[ivy:resolve] :: USE VERBOSE OR DEBUG MESSAGE LEVEL FOR MORE DETAILS

BUILD FAILED
/x1/jenkins/jenkins-slave/workspace/Hive-0.9.1-SNAPSHOT-h0.21/hive/build.xml:302: The following
error occurred while executing this line:
/x1/jenkins/jenkins-slave/workspace/Hive-0.9.1-SNAPSHOT-h0.21/hive/build.xml:152: The following
error occurred while executing this line:
/x1/jenkins/jenkins-slave/workspace/Hive-0.9.1-SNAPSHOT-h0.21/hive/shims/build.xml:90: The
following error occurred while executing this line:
/x1/jenkins/jenkins-slave/workspace/Hive-0.9.1-SNAPSHOT-h0.21/hive/shims/build.xml:93: The
following error occurred while executing this line:
/x1/jenkins/jenkins-slave/workspace/Hive-0.9.1-SNAPSHOT-h0.21/hive/shims/build.xml:65: The
following error occurred while executing this line:
/x1/jenkins/jenkins-slave/workspace/Hive-0.9.1-SNAPSHOT-h0.21/hive/build-common.xml:171: impossible
to resolve dependencies:
	resolve failed - see output for details

Total time: 37 seconds
Build step 'Invoke Ant' marked build as failure
Archiving artifacts
Recording test results

Mime
View raw message