hive-dev mailing list archives

Site index · List index
Message view « Date » · « Thread »
Top « Date » · « Thread »
From Apache Jenkins Server <jenk...@builds.apache.org>
Subject Hive-trunk-h0.21 - Build # 1824 - Still Failing
Date Thu, 29 Nov 2012 11:21:20 GMT
Changes for Build #1781
[namit] HIVE-3687 smb_mapjoin_13.q is nondeterministic
(Kevin Wilfong via namit)


Changes for Build #1782
[hashutosh] HIVE-2715: Upgrade Thrift dependency to 0.9.0 (Ashutosh Chauhan)


Changes for Build #1783
[kevinwilfong] HIVE-3654. block relative path access in hive. (njain via kevinwilfong)

[hashutosh] HIVE-3658 : Unable to generate the Hbase related unit tests using velocity templates
on Windows (Kanna Karanam via Ashutosh Chauhan)

[hashutosh] HIVE-3661 : Remove the Windows specific = related swizzle path changes from Proxy
FileSystems (Kanna Karanam via Ashutosh Chauhan)

[hashutosh] HIVE-3480 : <Resource leak>: Fix the file handle leaks in Symbolic &
Symlink related input formats. (Kanna Karanam via Ashutosh Chauhan)


Changes for Build #1784
[kevinwilfong] HIVE-3675. NaN does not work correctly for round(n). (njain via kevinwilfong)

[cws] HIVE-3651. bucketmapjoin?.q tests fail with hadoop 0.23 (Prasad Mujumdar via cws)


Changes for Build #1785
[namit] HIVE-3613 Implement grouping_id function
(Ian Gorbachev via namit)

[namit] HIVE-3692 Update parallel test documentation
(Ivan Gorbachev via namit)

[namit] HIVE-3649 Hive List Bucketing - enhance DDL to specify list bucketing table
(Gang Tim Liu via namit)


Changes for Build #1786
[namit] HIVE-3696 Revert HIVE-3483 which causes performance regression
(Gang Tim Liu via namit)


Changes for Build #1787
[kevinwilfong] HIVE-3621. Make prompt in Hive CLI configurable. (Jingwei Lu via kevinwilfong)

[kevinwilfong] HIVE-3695. TestParse breaks due to HIVE-3675. (njain via kevinwilfong)


Changes for Build #1788
[kevinwilfong] HIVE-3557. Access to external URLs in hivetest.py. (Ivan Gorbachev via kevinwilfong)


Changes for Build #1789
[hashutosh] HIVE-3662 : TestHiveServer: testScratchDirShouldClearWhileStartup is failing on
Windows (Kanna Karanam via Ashutosh Chauhan)

[hashutosh] HIVE-3659 : TestHiveHistory::testQueryloglocParentDirNotExist Test fails on Windows
because of some resource leaks in ZK (Kanna Karanam via Ashutosh Chauhan)

[hashutosh] HIVE-3663 Unable to display the MR Job file path on Windows in case of MR job
failures.  (Kanna Karanam via Ashutosh Chauhan)


Changes for Build #1790

Changes for Build #1791

Changes for Build #1792

Changes for Build #1793
[hashutosh] HIVE-3704 : name of some metastore scripts are not per convention (Ashutosh Chauhan)


Changes for Build #1794
[hashutosh] HIVE-3243 : ignore white space between entries of hive/hbase table mapping (Shengsheng
Huang via Ashutosh Chauhan)

[hashutosh] HIVE-3215 : JobDebugger should use RunningJob.getTrackingURL (Bhushan Mandhani
via Ashutosh Chauhan)


Changes for Build #1795
[cws] HIVE-3437. 0.23 compatibility: fix unit tests when building against 0.23 (Chris Drome
via cws)

[hashutosh] HIVE-3626 : RetryingHMSHandler should wrap JDOException inside MetaException (Bhushan
Mandhani via Ashutosh Chauhan)

[hashutosh] HIVE-3560 : Hive always prints a warning message when using remote metastore (Travis
Crawford via Ashutosh Chauhan)


Changes for Build #1796

Changes for Build #1797
[hashutosh] HIVE-3664 : Avoid to create a symlink for hive-contrib.jar file in dist\lib folder.
(Kanna Karanam via Ashutosh Chauhan)


Changes for Build #1798
[namit] HIVE-3706 getBoolVar in FileSinkOperator can be optimized
(Kevin Wilfong via namit)

[namit] HIVE-3707 Round map/reduce progress down when it is in the range [99.5, 100)
(Kevin Wilfong via namit)

[namit] HIVE-3471 Implement grouping sets in hive
(Ivan Gorbachev via namit)


Changes for Build #1799
[hashutosh] HIVE-3291 : fix fs resolvers (Ashish Singh via Ashutosh Chauhan)

[hashutosh] HIVE-3680 : Include Table information in Hive's AddPartitionEvent. (Mithun Radhakrishnan
via Ashutosh Chauhan)


Changes for Build #1800
[hashutosh] HIVE-3520 : ivysettings.xml does not let you override .m2/repository (Raja Aluri
via Ashutosh Chauhan)

[hashutosh] HIVE-3435 : Get pdk pluginTest passed when triggered from both builtin tests and
pdk tests on hadoop23  (Zhenxiao Luo via Ashutosh Chauhan)


Changes for Build #1801

Changes for Build #1802

Changes for Build #1803

Changes for Build #1804

Changes for Build #1805

Changes for Build #1806
[hashutosh] Preparing for 0.11 development

[kevinwilfong] HIVE-3647. map-side groupby wrongly due to HIVE-3432. (njain via kevinwilfong)


Changes for Build #1807
[kevinwilfong] HIVE-3679. Unescape partition names returned by show partitions. (Wonho Kim
via kevinwilfong)


Changes for Build #1808
[kevinwilfong] Remove extra files accidentally committed with HIVE-3679. (kevinwilfong)


Changes for Build #1809

Changes for Build #1810

Changes for Build #1811
[namit] HIVE-3735 PTest doesn't work due to hive snapshot version upgrade to 11
(Gang Tim Liu via namit)

[namit] HIVE-3722 Create index fails on CLI using remote metastore
(Kevin Wilfong via namit)


Changes for Build #1812
[namit] HIVE-3703 Hive Query Explain Plan JSON not being created properly
(Mayank Garg via namit)

[namit] HIVE-3721 ALTER TABLE ADD PARTS should check for valid partition spec and throw a
SemanticException
if part spec is not valid (Pamela Vagata via namit)


Changes for Build #1813

Changes for Build #1814
[hashutosh] HIVE-3698 : enhanceModel.notRequired is incorrectly determined (Chris Drome via
Ashutosh Chauhan)


Changes for Build #1815

Changes for Build #1816

Changes for Build #1817
[hashutosh] HIVE-3736 : hive unit test case build failure. (Ashish Singh via Ashutosh Chauhan)


Changes for Build #1818

Changes for Build #1819

Changes for Build #1820

Changes for Build #1821
[hashutosh] HIVE-3749 : New test cases added by HIVE-3676 in insert1.q is not deterministic
(Navis via Ashutosh Chauhan)

[hashutosh] HIVE-3648 : HiveMetaStoreFsImpl is not compatible with hadoop viewfs (Arup Malakar
via Ashutosh Chauhan)

[hashutosh] HIVE-3742 : The derby metastore schema script for 0.10.0 doesn't run (Prasad Mujumdar
via Ashutosh Chauhan)

[hashutosh] HIVE-3645 : RCFileWriter does not implement the right function to support Federation
(Arup Malakar via Ashutosh Chauhan)

[hashutosh] HIVE-3723 : Hive Driver leaks ZooKeeper connections (Gunther Hagleitner via Ashutosh
Chauhan)

[hashutosh] HIVE-3234 : getting the reporter in the recordwriter (Owen Omalley via Ashutosh
Chauhan)


Changes for Build #1822
[namit] HIVE-3729 Error in groupSetExpression rule in Hive grammar
(Harish Butani via namit)

[cws] HIVE-3531 [jira] Simple lock manager for dedicated hive server
(Navis Ryu via Carl Steinbach)

Summary:
DPAL-1906 Implement simple lock manager for hive server

In many cases, we uses hive server as a sole proxy for executing all the queries. For that,
current default lock manager based on zookeeper seemed a little heavy. Simple in-memory lock
manager could be enough.

Test Plan: TestDedicatedLockManager

Reviewers: JIRA, cwsteinbach

Reviewed By: cwsteinbach

Differential Revision: https://reviews.facebook.net/D5871

[hashutosh] HIVE-3665: Allow URIs without port to be specified in metatool (Shreepadma via
Ashutosh Chauhan)

[hashutosh] HIVE-3678 : Add metastore upgrade scripts for column stats schema changes (Shreepadma
via Ashutosh Chauhan)


Changes for Build #1823

Changes for Build #1824
[cws] HIVE-3709. Stop storing default ConfVars in temp file (Kevin Wilfong via cws)




3 tests failed.
FAILED:  org.apache.hadoop.hive.metastore.TestMetaStoreEndFunctionListener.testEndFunctionListener

Error Message:
-1

Stack Trace:
java.lang.ArrayIndexOutOfBoundsException: -1
	at java.util.ArrayList.get(ArrayList.java:324)
	at org.apache.hadoop.hive.metastore.TestMetaStoreEndFunctionListener.testEndFunctionListener(TestMetaStoreEndFunctionListener.java:99)
	at sun.reflect.NativeMethodAccessorImpl.invoke0(Native Method)
	at sun.reflect.NativeMethodAccessorImpl.invoke(NativeMethodAccessorImpl.java:39)
	at sun.reflect.DelegatingMethodAccessorImpl.invoke(DelegatingMethodAccessorImpl.java:25)
	at java.lang.reflect.Method.invoke(Method.java:597)
	at junit.framework.TestCase.runTest(TestCase.java:168)
	at junit.framework.TestCase.runBare(TestCase.java:134)
	at junit.framework.TestResult$1.protect(TestResult.java:110)
	at junit.framework.TestResult.runProtected(TestResult.java:128)
	at junit.framework.TestResult.run(TestResult.java:113)
	at junit.framework.TestCase.run(TestCase.java:124)
	at junit.framework.TestSuite.runTest(TestSuite.java:232)
	at junit.framework.TestSuite.run(TestSuite.java:227)
	at org.apache.tools.ant.taskdefs.optional.junit.JUnitTestRunner.run(JUnitTestRunner.java:518)
	at org.apache.tools.ant.taskdefs.optional.junit.JUnitTestRunner.launch(JUnitTestRunner.java:1052)
	at org.apache.tools.ant.taskdefs.optional.junit.JUnitTestRunner.main(JUnitTestRunner.java:906)


FAILED:  org.apache.hadoop.hive.metastore.TestMetaStoreEventListener.testListener

Error Message:
null

Stack Trace:
org.apache.thrift.transport.TTransportException
	at org.apache.thrift.transport.TIOStreamTransport.read(TIOStreamTransport.java:132)
	at org.apache.thrift.transport.TTransport.readAll(TTransport.java:84)
	at org.apache.thrift.protocol.TBinaryProtocol.readAll(TBinaryProtocol.java:378)
	at org.apache.thrift.protocol.TBinaryProtocol.readI32(TBinaryProtocol.java:297)
	at org.apache.thrift.protocol.TBinaryProtocol.readMessageBegin(TBinaryProtocol.java:204)
	at org.apache.thrift.TServiceClient.receiveBase(TServiceClient.java:69)
	at org.apache.hadoop.hive.metastore.api.ThriftHiveMetastore$Client.recv_get_database(ThriftHiveMetastore.java:412)
	at org.apache.hadoop.hive.metastore.api.ThriftHiveMetastore$Client.get_database(ThriftHiveMetastore.java:399)
	at org.apache.hadoop.hive.metastore.HiveMetaStoreClient.getDatabase(HiveMetaStoreClient.java:715)
	at org.apache.hadoop.hive.metastore.TestMetaStoreEventListener.testListener(TestMetaStoreEventListener.java:208)
	at sun.reflect.NativeMethodAccessorImpl.invoke0(Native Method)
	at sun.reflect.NativeMethodAccessorImpl.invoke(NativeMethodAccessorImpl.java:39)
	at sun.reflect.DelegatingMethodAccessorImpl.invoke(DelegatingMethodAccessorImpl.java:25)
	at java.lang.reflect.Method.invoke(Method.java:597)
	at junit.framework.TestCase.runTest(TestCase.java:168)
	at junit.framework.TestCase.runBare(TestCase.java:134)
	at junit.framework.TestResult$1.protect(TestResult.java:110)
	at junit.framework.TestResult.runProtected(TestResult.java:128)
	at junit.framework.TestResult.run(TestResult.java:113)
	at junit.framework.TestCase.run(TestCase.java:124)
	at junit.framework.TestSuite.runTest(TestSuite.java:232)
	at junit.framework.TestSuite.run(TestSuite.java:227)
	at org.apache.tools.ant.taskdefs.optional.junit.JUnitTestRunner.run(JUnitTestRunner.java:518)
	at org.apache.tools.ant.taskdefs.optional.junit.JUnitTestRunner.launch(JUnitTestRunner.java:1052)
	at org.apache.tools.ant.taskdefs.optional.junit.JUnitTestRunner.main(JUnitTestRunner.java:906)


FAILED:  org.apache.hadoop.hive.cli.TestNegativeCliDriver.testNegativeCliDriver_script_broken_pipe1

Error Message:
Unexpected exception See build/ql/tmp/hive.log, or try "ant test ... -Dtest.silent=false"
to get more logs.

Stack Trace:
junit.framework.AssertionFailedError: Unexpected exception
See build/ql/tmp/hive.log, or try "ant test ... -Dtest.silent=false" to get more logs.
	at junit.framework.Assert.fail(Assert.java:47)
	at org.apache.hadoop.hive.cli.TestNegativeCliDriver.testNegativeCliDriver_script_broken_pipe1(TestNegativeCliDriver.java:12255)
	at sun.reflect.NativeMethodAccessorImpl.invoke0(Native Method)
	at sun.reflect.NativeMethodAccessorImpl.invoke(NativeMethodAccessorImpl.java:39)
	at sun.reflect.DelegatingMethodAccessorImpl.invoke(DelegatingMethodAccessorImpl.java:25)
	at java.lang.reflect.Method.invoke(Method.java:597)
	at junit.framework.TestCase.runTest(TestCase.java:168)
	at junit.framework.TestCase.runBare(TestCase.java:134)
	at junit.framework.TestResult$1.protect(TestResult.java:110)
	at junit.framework.TestResult.runProtected(TestResult.java:128)
	at junit.framework.TestResult.run(TestResult.java:113)
	at junit.framework.TestCase.run(TestCase.java:124)
	at junit.framework.TestSuite.runTest(TestSuite.java:232)
	at junit.framework.TestSuite.run(TestSuite.java:227)
	at org.apache.tools.ant.taskdefs.optional.junit.JUnitTestRunner.run(JUnitTestRunner.java:518)
	at org.apache.tools.ant.taskdefs.optional.junit.JUnitTestRunner.launch(JUnitTestRunner.java:1052)
	at org.apache.tools.ant.taskdefs.optional.junit.JUnitTestRunner.main(JUnitTestRunner.java:906)




The Apache Jenkins build system has built Hive-trunk-h0.21 (build #1824)

Status: Still Failing

Check console output at https://builds.apache.org/job/Hive-trunk-h0.21/1824/ to view the results.
Mime
  • Unnamed multipart/mixed (inline, None, 0 bytes)
View raw message