hive-dev mailing list archives

Site index · List index
Message view « Date » · « Thread »
Top « Date » · « Thread »
From Apache Jenkins Server <jenk...@builds.apache.org>
Subject Build failed in Jenkins: Hive-0.9.1-SNAPSHOT-h0.21 #209
Date Sat, 24 Nov 2012 16:07:31 GMT
See <https://builds.apache.org/job/Hive-0.9.1-SNAPSHOT-h0.21/209/>

------------------------------------------
[...truncated 5774 lines...]
[ivy:resolve] 	[SUCCESSFUL ] com.google.inject#guice;3.0!guice.jar (71ms)
[ivy:resolve] downloading http://repo1.maven.org/maven2/com/sun/jersey/contribs/jersey-guice/1.8/jersey-guice-1.8.jar
...
[ivy:resolve] .. (14kB)
[ivy:resolve] .. (0kB)
[ivy:resolve] 	[SUCCESSFUL ] com.sun.jersey.contribs#jersey-guice;1.8!jersey-guice.jar (217ms)
[ivy:resolve] downloading http://repo1.maven.org/maven2/javax/inject/javax.inject/1/javax.inject-1.jar
...
[ivy:resolve] .. (2kB)
[ivy:resolve] .. (0kB)
[ivy:resolve] 	[SUCCESSFUL ] javax.inject#javax.inject;1!javax.inject.jar (43ms)
[ivy:resolve] downloading http://repo1.maven.org/maven2/aopalliance/aopalliance/1.0/aopalliance-1.0.jar
...
[ivy:resolve] .. (4kB)
[ivy:resolve] .. (0kB)
[ivy:resolve] 	[SUCCESSFUL ] aopalliance#aopalliance;1.0!aopalliance.jar (58ms)
[ivy:resolve] downloading http://repo1.maven.org/maven2/org/sonatype/sisu/inject/cglib/2.2.1-v20090111/cglib-2.2.1-v20090111.jar
...
[ivy:resolve] ...................... (272kB)
[ivy:resolve] .. (0kB)
[ivy:resolve] 	[SUCCESSFUL ] org.sonatype.sisu.inject#cglib;2.2.1-v20090111!cglib.jar (109ms)
[ivy:resolve] downloading http://repo1.maven.org/maven2/org/apache/hadoop/hadoop-mapreduce-client-shuffle/0.23.3/hadoop-mapreduce-client-shuffle-0.23.3.jar
...
[ivy:resolve] .. (15kB)
[ivy:resolve] .. (0kB)
[ivy:resolve] 	[SUCCESSFUL ] org.apache.hadoop#hadoop-mapreduce-client-shuffle;0.23.3!hadoop-mapreduce-client-shuffle.jar
(279ms)
[ivy:resolve] downloading http://repo1.maven.org/maven2/org/apache/hadoop/hadoop-yarn-server-nodemanager/0.23.3/hadoop-yarn-server-nodemanager-0.23.3.jar
...
[ivy:resolve] ............................ (385kB)
[ivy:resolve] .. (0kB)
[ivy:resolve] 	[SUCCESSFUL ] org.apache.hadoop#hadoop-yarn-server-nodemanager;0.23.3!hadoop-yarn-server-nodemanager.jar
(244ms)
[ivy:resolve] 
[ivy:resolve] :: problems summary ::
[ivy:resolve] :::: WARNINGS
[ivy:resolve] 	problem while downloading module descriptor: http://repo1.maven.org/maven2/org/codehaus/jackson/jackson-xc/1.8.8/jackson-xc-1.8.8.pom:
/home/jenkins/.ivy2/cache/org.codehaus.jackson/jackson-xc/ivy-1.8.8.xml.original.part (No
such file or directory) (30ms)
[ivy:resolve] 		module not found: org.codehaus.jackson#jackson-xc;1.8.8
[ivy:resolve] 	==== local: tried
[ivy:resolve] 	  /home/jenkins/.ivy2/local/org.codehaus.jackson/jackson-xc/1.8.8/ivys/ivy.xml
[ivy:resolve] 	  -- artifact org.codehaus.jackson#jackson-xc;1.8.8!jackson-xc.jar:
[ivy:resolve] 	  /home/jenkins/.ivy2/local/org.codehaus.jackson/jackson-xc/1.8.8/jars/jackson-xc.jar
[ivy:resolve] 	==== apache-snapshot: tried
[ivy:resolve] 	  https://repository.apache.org/content/repositories/snapshots/org/codehaus/jackson/jackson-xc/1.8.8/jackson-xc-1.8.8.pom
[ivy:resolve] 	  -- artifact org.codehaus.jackson#jackson-xc;1.8.8!jackson-xc.jar:
[ivy:resolve] 	  https://repository.apache.org/content/repositories/snapshots/org/codehaus/jackson/jackson-xc/1.8.8/jackson-xc-1.8.8.jar
[ivy:resolve] 	==== maven2: tried
[ivy:resolve] 	  http://repo1.maven.org/maven2/org/codehaus/jackson/jackson-xc/1.8.8/jackson-xc-1.8.8.pom
[ivy:resolve] 	==== datanucleus-repo: tried
[ivy:resolve] 	  -- artifact org.codehaus.jackson#jackson-xc;1.8.8!jackson-xc.jar:
[ivy:resolve] 	  http://www.datanucleus.org/downloads/maven2/org/codehaus/jackson/jackson-xc/1.8.8/jackson-xc-1.8.8.jar
[ivy:resolve] 	==== hadoop-source: tried
[ivy:resolve] 	  -- artifact org.codehaus.jackson#jackson-xc;1.8.8!jackson-xc.jar:
[ivy:resolve] 	  http://mirror.facebook.net/facebook/hive-deps/hadoop/core/jackson-xc-1.8.8/jackson-xc-1.8.8.jar
[ivy:resolve] 	==== hadoop-source2: tried
[ivy:resolve] 	  -- artifact org.codehaus.jackson#jackson-xc;1.8.8!jackson-xc.jar:
[ivy:resolve] 	  http://archive.cloudera.com/hive-deps/hadoop/core/jackson-xc-1.8.8/jackson-xc-1.8.8.jar
[ivy:resolve] 	problem while downloading module descriptor: http://repo1.maven.org/maven2/tomcat/jasper-compiler/5.5.23/jasper-compiler-5.5.23.pom:
/home/jenkins/.ivy2/cache/tomcat/jasper-compiler/ivy-5.5.23.xml.original.part (No such file
or directory) (124ms)
[ivy:resolve] 		module not found: tomcat#jasper-compiler;5.5.23
[ivy:resolve] 	==== local: tried
[ivy:resolve] 	  /home/jenkins/.ivy2/local/tomcat/jasper-compiler/5.5.23/ivys/ivy.xml
[ivy:resolve] 	  -- artifact tomcat#jasper-compiler;5.5.23!jasper-compiler.jar:
[ivy:resolve] 	  /home/jenkins/.ivy2/local/tomcat/jasper-compiler/5.5.23/jars/jasper-compiler.jar
[ivy:resolve] 	==== apache-snapshot: tried
[ivy:resolve] 	  https://repository.apache.org/content/repositories/snapshots/tomcat/jasper-compiler/5.5.23/jasper-compiler-5.5.23.pom
[ivy:resolve] 	  -- artifact tomcat#jasper-compiler;5.5.23!jasper-compiler.jar:
[ivy:resolve] 	  https://repository.apache.org/content/repositories/snapshots/tomcat/jasper-compiler/5.5.23/jasper-compiler-5.5.23.jar
[ivy:resolve] 	==== maven2: tried
[ivy:resolve] 	  http://repo1.maven.org/maven2/tomcat/jasper-compiler/5.5.23/jasper-compiler-5.5.23.pom
[ivy:resolve] 	==== datanucleus-repo: tried
[ivy:resolve] 	  -- artifact tomcat#jasper-compiler;5.5.23!jasper-compiler.jar:
[ivy:resolve] 	  http://www.datanucleus.org/downloads/maven2/tomcat/jasper-compiler/5.5.23/jasper-compiler-5.5.23.jar
[ivy:resolve] 	==== hadoop-source: tried
[ivy:resolve] 	  -- artifact tomcat#jasper-compiler;5.5.23!jasper-compiler.jar:
[ivy:resolve] 	  http://mirror.facebook.net/facebook/hive-deps/hadoop/core/jasper-compiler-5.5.23/jasper-compiler-5.5.23.jar
[ivy:resolve] 	==== hadoop-source2: tried
[ivy:resolve] 	  -- artifact tomcat#jasper-compiler;5.5.23!jasper-compiler.jar:
[ivy:resolve] 	  http://archive.cloudera.com/hive-deps/hadoop/core/jasper-compiler-5.5.23/jasper-compiler-5.5.23.jar
[ivy:resolve] 	problem while downloading module descriptor: http://repo1.maven.org/maven2/org/aspectj/aspectjrt/1.6.5/aspectjrt-1.6.5.pom:
/home/jenkins/.ivy2/cache/org.aspectj/aspectjrt/ivy-1.6.5.xml.original.part (No such file
or directory) (68ms)
[ivy:resolve] 		module not found: org.aspectj#aspectjrt;1.6.5
[ivy:resolve] 	==== local: tried
[ivy:resolve] 	  /home/jenkins/.ivy2/local/org.aspectj/aspectjrt/1.6.5/ivys/ivy.xml
[ivy:resolve] 	  -- artifact org.aspectj#aspectjrt;1.6.5!aspectjrt.jar:
[ivy:resolve] 	  /home/jenkins/.ivy2/local/org.aspectj/aspectjrt/1.6.5/jars/aspectjrt.jar
[ivy:resolve] 	==== apache-snapshot: tried
[ivy:resolve] 	  https://repository.apache.org/content/repositories/snapshots/org/aspectj/aspectjrt/1.6.5/aspectjrt-1.6.5.pom
[ivy:resolve] 	  -- artifact org.aspectj#aspectjrt;1.6.5!aspectjrt.jar:
[ivy:resolve] 	  https://repository.apache.org/content/repositories/snapshots/org/aspectj/aspectjrt/1.6.5/aspectjrt-1.6.5.jar
[ivy:resolve] 	==== maven2: tried
[ivy:resolve] 	  http://repo1.maven.org/maven2/org/aspectj/aspectjrt/1.6.5/aspectjrt-1.6.5.pom
[ivy:resolve] 	==== datanucleus-repo: tried
[ivy:resolve] 	  -- artifact org.aspectj#aspectjrt;1.6.5!aspectjrt.jar:
[ivy:resolve] 	  http://www.datanucleus.org/downloads/maven2/org/aspectj/aspectjrt/1.6.5/aspectjrt-1.6.5.jar
[ivy:resolve] 	==== hadoop-source: tried
[ivy:resolve] 	  -- artifact org.aspectj#aspectjrt;1.6.5!aspectjrt.jar:
[ivy:resolve] 	  http://mirror.facebook.net/facebook/hive-deps/hadoop/core/aspectjrt-1.6.5/aspectjrt-1.6.5.jar
[ivy:resolve] 	==== hadoop-source2: tried
[ivy:resolve] 	  -- artifact org.aspectj#aspectjrt;1.6.5!aspectjrt.jar:
[ivy:resolve] 	  http://archive.cloudera.com/hive-deps/hadoop/core/aspectjrt-1.6.5/aspectjrt-1.6.5.jar
[ivy:resolve] 	impossible to put metadata file in cache: http://repo1.maven.org/maven2/org/apache/avro/avro-parent/1.5.3/avro-parent-1.5.3.pom
(1.5.3). java.io.FileNotFoundException: /home/jenkins/.ivy2/cache/org.apache.avro/avro-parent/ivy-1.5.3.xml.original
(No such file or directory)
[ivy:resolve] 	problem while downloading module descriptor: http://repo1.maven.org/maven2/org/apache/hadoop/hadoop-auth/0.23.3/hadoop-auth-0.23.3.pom:
/home/jenkins/.ivy2/cache/org.apache.hadoop/hadoop-auth/ivy-0.23.3.xml.original.part (No such
file or directory) (204ms)
[ivy:resolve] 		module not found: org.apache.hadoop#hadoop-auth;0.23.3
[ivy:resolve] 	==== local: tried
[ivy:resolve] 	  /home/jenkins/.ivy2/local/org.apache.hadoop/hadoop-auth/0.23.3/ivys/ivy.xml
[ivy:resolve] 	  -- artifact org.apache.hadoop#hadoop-auth;0.23.3!hadoop-auth.jar:
[ivy:resolve] 	  /home/jenkins/.ivy2/local/org.apache.hadoop/hadoop-auth/0.23.3/jars/hadoop-auth.jar
[ivy:resolve] 	==== apache-snapshot: tried
[ivy:resolve] 	  https://repository.apache.org/content/repositories/snapshots/org/apache/hadoop/hadoop-auth/0.23.3/hadoop-auth-0.23.3.pom
[ivy:resolve] 	  -- artifact org.apache.hadoop#hadoop-auth;0.23.3!hadoop-auth.jar:
[ivy:resolve] 	  https://repository.apache.org/content/repositories/snapshots/org/apache/hadoop/hadoop-auth/0.23.3/hadoop-auth-0.23.3.jar
[ivy:resolve] 	==== maven2: tried
[ivy:resolve] 	  http://repo1.maven.org/maven2/org/apache/hadoop/hadoop-auth/0.23.3/hadoop-auth-0.23.3.pom
[ivy:resolve] 	==== datanucleus-repo: tried
[ivy:resolve] 	  -- artifact org.apache.hadoop#hadoop-auth;0.23.3!hadoop-auth.jar:
[ivy:resolve] 	  http://www.datanucleus.org/downloads/maven2/org/apache/hadoop/hadoop-auth/0.23.3/hadoop-auth-0.23.3.jar
[ivy:resolve] 	==== hadoop-source: tried
[ivy:resolve] 	  -- artifact org.apache.hadoop#hadoop-auth;0.23.3!hadoop-auth.jar:
[ivy:resolve] 	  http://mirror.facebook.net/facebook/hive-deps/hadoop/core/hadoop-auth-0.23.3/hadoop-auth-0.23.3.jar
[ivy:resolve] 	==== hadoop-source2: tried
[ivy:resolve] 	  -- artifact org.apache.hadoop#hadoop-auth;0.23.3!hadoop-auth.jar:
[ivy:resolve] 	  http://archive.cloudera.com/hive-deps/hadoop/core/hadoop-auth-0.23.3/hadoop-auth-0.23.3.jar
[ivy:resolve] 	problem while downloading module descriptor: http://repo1.maven.org/maven2/org/apache/hadoop/hadoop-yarn-api/0.23.3/hadoop-yarn-api-0.23.3.pom:
/home/jenkins/.ivy2/cache/org.apache.hadoop/hadoop-yarn-api/ivy-0.23.3.xml.original.part (No
such file or directory) (181ms)
[ivy:resolve] 		module not found: org.apache.hadoop#hadoop-yarn-api;0.23.3
[ivy:resolve] 	==== local: tried
[ivy:resolve] 	  /home/jenkins/.ivy2/local/org.apache.hadoop/hadoop-yarn-api/0.23.3/ivys/ivy.xml
[ivy:resolve] 	  -- artifact org.apache.hadoop#hadoop-yarn-api;0.23.3!hadoop-yarn-api.jar:
[ivy:resolve] 	  /home/jenkins/.ivy2/local/org.apache.hadoop/hadoop-yarn-api/0.23.3/jars/hadoop-yarn-api.jar
[ivy:resolve] 	==== apache-snapshot: tried
[ivy:resolve] 	  https://repository.apache.org/content/repositories/snapshots/org/apache/hadoop/hadoop-yarn-api/0.23.3/hadoop-yarn-api-0.23.3.pom
[ivy:resolve] 	  -- artifact org.apache.hadoop#hadoop-yarn-api;0.23.3!hadoop-yarn-api.jar:
[ivy:resolve] 	  https://repository.apache.org/content/repositories/snapshots/org/apache/hadoop/hadoop-yarn-api/0.23.3/hadoop-yarn-api-0.23.3.jar
[ivy:resolve] 	==== maven2: tried
[ivy:resolve] 	  http://repo1.maven.org/maven2/org/apache/hadoop/hadoop-yarn-api/0.23.3/hadoop-yarn-api-0.23.3.pom
[ivy:resolve] 	==== datanucleus-repo: tried
[ivy:resolve] 	  -- artifact org.apache.hadoop#hadoop-yarn-api;0.23.3!hadoop-yarn-api.jar:
[ivy:resolve] 	  http://www.datanucleus.org/downloads/maven2/org/apache/hadoop/hadoop-yarn-api/0.23.3/hadoop-yarn-api-0.23.3.jar
[ivy:resolve] 	==== hadoop-source: tried
[ivy:resolve] 	  -- artifact org.apache.hadoop#hadoop-yarn-api;0.23.3!hadoop-yarn-api.jar:
[ivy:resolve] 	  http://mirror.facebook.net/facebook/hive-deps/hadoop/core/hadoop-yarn-api-0.23.3/hadoop-yarn-api-0.23.3.jar
[ivy:resolve] 	==== hadoop-source2: tried
[ivy:resolve] 	  -- artifact org.apache.hadoop#hadoop-yarn-api;0.23.3!hadoop-yarn-api.jar:
[ivy:resolve] 	  http://archive.cloudera.com/hive-deps/hadoop/core/hadoop-yarn-api-0.23.3/hadoop-yarn-api-0.23.3.jar
[ivy:resolve] 	problem while downloading module descriptor: http://repo1.maven.org/maven2/com/sun/jersey/jersey-test-framework/1.8/jersey-test-framework-1.8.pom:
/home/jenkins/.ivy2/cache/com.sun.jersey/jersey-test-framework/ivy-1.8.xml.original.part (No
such file or directory) (158ms)
[ivy:resolve] 	io problem while parsing ivy file: http://repo1.maven.org/maven2/com/sun/jersey/jersey-test-framework/jersey-test-framework-grizzly2/1.8/jersey-test-framework-grizzly2-1.8.pom:
Impossible to load parent for file:/home/jenkins/.ivy2/cache/com.sun.jersey.jersey-test-framework/jersey-test-framework-grizzly2/ivy-1.8.xml.original.
Parent=com.sun.jersey#jersey-test-framework;1.8
[ivy:resolve] 		module not found: com.sun.jersey.jersey-test-framework#jersey-test-framework-grizzly2;1.8
[ivy:resolve] 	==== local: tried
[ivy:resolve] 	  /home/jenkins/.ivy2/local/com.sun.jersey/jersey-test-framework/1.8/ivys/ivy.xml
[ivy:resolve] 	  -- artifact com.sun.jersey#jersey-test-framework;1.8!jersey-test-framework.jar:
[ivy:resolve] 	  /home/jenkins/.ivy2/local/com.sun.jersey/jersey-test-framework/1.8/jars/jersey-test-framework.jar
[ivy:resolve] 	==== apache-snapshot: tried
[ivy:resolve] 	  https://repository.apache.org/content/repositories/snapshots/com/sun/jersey/jersey-test-framework/1.8/jersey-test-framework-1.8.pom
[ivy:resolve] 	  -- artifact com.sun.jersey#jersey-test-framework;1.8!jersey-test-framework.jar:
[ivy:resolve] 	  https://repository.apache.org/content/repositories/snapshots/com/sun/jersey/jersey-test-framework/1.8/jersey-test-framework-1.8.jar
[ivy:resolve] 	==== maven2: tried
[ivy:resolve] 	  http://repo1.maven.org/maven2/com/sun/jersey/jersey-test-framework/1.8/jersey-test-framework-1.8.pom
[ivy:resolve] 	==== datanucleus-repo: tried
[ivy:resolve] 	  -- artifact com.sun.jersey.jersey-test-framework#jersey-test-framework-grizzly2;1.8!jersey-test-framework-grizzly2.jar:
[ivy:resolve] 	  http://www.datanucleus.org/downloads/maven2/com/sun/jersey/jersey-test-framework/jersey-test-framework-grizzly2/1.8/jersey-test-framework-grizzly2-1.8.jar
[ivy:resolve] 	==== hadoop-source: tried
[ivy:resolve] 	  -- artifact com.sun.jersey.jersey-test-framework#jersey-test-framework-grizzly2;1.8!jersey-test-framework-grizzly2.jar:
[ivy:resolve] 	  http://mirror.facebook.net/facebook/hive-deps/hadoop/core/jersey-test-framework-grizzly2-1.8/jersey-test-framework-grizzly2-1.8.jar
[ivy:resolve] 	==== hadoop-source2: tried
[ivy:resolve] 	  -- artifact com.sun.jersey.jersey-test-framework#jersey-test-framework-grizzly2;1.8!jersey-test-framework-grizzly2.jar:
[ivy:resolve] 	  http://archive.cloudera.com/hive-deps/hadoop/core/jersey-test-framework-grizzly2-1.8/jersey-test-framework-grizzly2-1.8.jar
[ivy:resolve] 	problem while downloading module descriptor: http://repo1.maven.org/maven2/org/apache/zookeeper/zookeeper/3.4.2/zookeeper-3.4.2.pom:
/home/jenkins/.ivy2/cache/org.apache.zookeeper/zookeeper/ivy-3.4.2.xml.original.part (No such
file or directory) (30ms)
[ivy:resolve] 		module not found: org.apache.zookeeper#zookeeper;3.4.2
[ivy:resolve] 	==== local: tried
[ivy:resolve] 	  /home/jenkins/.ivy2/local/org.apache.zookeeper/zookeeper/3.4.2/ivys/ivy.xml
[ivy:resolve] 	  -- artifact org.apache.zookeeper#zookeeper;3.4.2!zookeeper.jar:
[ivy:resolve] 	  /home/jenkins/.ivy2/local/org.apache.zookeeper/zookeeper/3.4.2/jars/zookeeper.jar
[ivy:resolve] 	==== apache-snapshot: tried
[ivy:resolve] 	  https://repository.apache.org/content/repositories/snapshots/org/apache/zookeeper/zookeeper/3.4.2/zookeeper-3.4.2.pom
[ivy:resolve] 	  -- artifact org.apache.zookeeper#zookeeper;3.4.2!zookeeper.jar:
[ivy:resolve] 	  https://repository.apache.org/content/repositories/snapshots/org/apache/zookeeper/zookeeper/3.4.2/zookeeper-3.4.2.jar
[ivy:resolve] 	==== maven2: tried
[ivy:resolve] 	  http://repo1.maven.org/maven2/org/apache/zookeeper/zookeeper/3.4.2/zookeeper-3.4.2.pom
[ivy:resolve] 	==== datanucleus-repo: tried
[ivy:resolve] 	  -- artifact org.apache.zookeeper#zookeeper;3.4.2!zookeeper.jar:
[ivy:resolve] 	  http://www.datanucleus.org/downloads/maven2/org/apache/zookeeper/zookeeper/3.4.2/zookeeper-3.4.2.jar
[ivy:resolve] 	==== hadoop-source: tried
[ivy:resolve] 	  -- artifact org.apache.zookeeper#zookeeper;3.4.2!zookeeper.jar:
[ivy:resolve] 	  http://mirror.facebook.net/facebook/hive-deps/hadoop/core/zookeeper-3.4.2/zookeeper-3.4.2.jar
[ivy:resolve] 	==== hadoop-source2: tried
[ivy:resolve] 	  -- artifact org.apache.zookeeper#zookeeper;3.4.2!zookeeper.jar:
[ivy:resolve] 	  http://archive.cloudera.com/hive-deps/hadoop/core/zookeeper-3.4.2/zookeeper-3.4.2.jar
[ivy:resolve] 		[FAILED     ] org.apache.hadoop#hadoop-hdfs;0.23.3!hadoop-hdfs.jar(tests):
impossible to move part file to definitive one: /home/jenkins/.ivy2/cache/org.apache.hadoop/hadoop-hdfs/testss/hadoop-hdfs-0.23.3-tests.jar.part
-> /home/jenkins/.ivy2/cache/org.apache.hadoop/hadoop-hdfs/testss/hadoop-hdfs-0.23.3-tests.jar
(313ms)
[ivy:resolve] 		[FAILED     ] org.apache.hadoop#hadoop-mapreduce-client-common;0.23.3!hadoop-mapreduce-client-common.jar:
impossible to move part file to definitive one: /home/jenkins/.ivy2/cache/org.apache.hadoop/hadoop-mapreduce-client-common/jars/hadoop-mapreduce-client-common-0.23.3.jar.part
-> /home/jenkins/.ivy2/cache/org.apache.hadoop/hadoop-mapreduce-client-common/jars/hadoop-mapreduce-client-common-0.23.3.jar
(180ms)
[ivy:resolve] 		[FAILED     ] org.apache.hadoop#hadoop-annotations;0.23.3!hadoop-annotations.jar:
/home/jenkins/.ivy2/cache/org.apache.hadoop/hadoop-annotations/jars/hadoop-annotations-0.23.3.jar.part
(No such file or directory) (200ms)
[ivy:resolve] 		[FAILED     ] commons-httpclient#commons-httpclient;3.1!commons-httpclient.jar:
impossible to move part file to definitive one: /home/jenkins/.ivy2/cache/commons-httpclient/commons-httpclient/jars/commons-httpclient-3.1.jar.part
-> /home/jenkins/.ivy2/cache/commons-httpclient/commons-httpclient/jars/commons-httpclient-3.1.jar
(53ms)
[ivy:resolve] 		[FAILED     ] commons-io#commons-io;2.1!commons-io.jar: impossible to move
part file to definitive one: /home/jenkins/.ivy2/cache/commons-io/commons-io/jars/commons-io-2.1.jar.part
-> /home/jenkins/.ivy2/cache/commons-io/commons-io/jars/commons-io-2.1.jar (60ms)
[ivy:resolve] 		[FAILED     ] javax.servlet#servlet-api;2.5!servlet-api.jar: /home/jenkins/.ivy2/cache/javax.servlet/servlet-api/jars/servlet-api-2.5.jar.part
(No such file or directory) (39ms)
[ivy:resolve] 		[FAILED     ] com.sun.jersey#jersey-server;1.8!jersey-server.jar(bundle):
impossible to move part file to definitive one: /home/jenkins/.ivy2/cache/com.sun.jersey/jersey-server/bundles/jersey-server-1.8.jar.part
-> /home/jenkins/.ivy2/cache/com.sun.jersey/jersey-server/bundles/jersey-server-1.8.jar
(114ms)
[ivy:resolve] 		[FAILED     ] org.apache.avro#avro-ipc;1.5.3!avro-ipc.jar: impossible to move
part file to definitive one: /home/jenkins/.ivy2/cache/org.apache.avro/avro-ipc/jars/avro-ipc-1.5.3.jar.part
-> /home/jenkins/.ivy2/cache/org.apache.avro/avro-ipc/jars/avro-ipc-1.5.3.jar (73ms)
[ivy:resolve] 		[FAILED     ] com.sun.xml.bind#jaxb-impl;2.2.3-1!jaxb-impl.jar: impossible
to move part file to definitive one: /home/jenkins/.ivy2/cache/com.sun.xml.bind/jaxb-impl/jars/jaxb-impl-2.2.3-1.jar.part
-> /home/jenkins/.ivy2/cache/com.sun.xml.bind/jaxb-impl/jars/jaxb-impl-2.2.3-1.jar (165ms)
[ivy:resolve] 		[FAILED     ] org.codehaus.jackson#jackson-jaxrs;1.8.8!jackson-jaxrs.jar:
/home/jenkins/.ivy2/cache/org.codehaus.jackson/jackson-jaxrs/jars/jackson-jaxrs-1.8.8.jar.part
(No such file or directory) (185ms)
[ivy:resolve] 		[FAILED     ] org.apache.velocity#velocity;1.7!velocity.jar: Downloaded file
size doesn't match expected Content Length for http://repo1.maven.org/maven2/org/apache/velocity/velocity/1.7/velocity-1.7.jar.
Please retry. (20ms)
[ivy:resolve] 		[FAILED     ] org.apache.velocity#velocity;1.7!velocity.jar:  (0ms)
[ivy:resolve] 	==== local: tried
[ivy:resolve] 	  /home/jenkins/.ivy2/local/org.apache.velocity/velocity/1.7/jars/velocity.jar
[ivy:resolve] 	==== apache-snapshot: tried
[ivy:resolve] 	  https://repository.apache.org/content/repositories/snapshots/org/apache/velocity/velocity/1.7/velocity-1.7.jar
[ivy:resolve] 	==== maven2: tried
[ivy:resolve] 	  http://repo1.maven.org/maven2/org/apache/velocity/velocity/1.7/velocity-1.7.jar
[ivy:resolve] 	==== datanucleus-repo: tried
[ivy:resolve] 	  http://www.datanucleus.org/downloads/maven2/org/apache/velocity/velocity/1.7/velocity-1.7.jar
[ivy:resolve] 	==== hadoop-source: tried
[ivy:resolve] 	  http://mirror.facebook.net/facebook/hive-deps/hadoop/core/velocity-1.7/velocity-1.7.jar
[ivy:resolve] 	==== hadoop-source2: tried
[ivy:resolve] 	  http://archive.cloudera.com/hive-deps/hadoop/core/velocity-1.7/velocity-1.7.jar
[ivy:resolve] 		[FAILED     ] com.cenqua.clover#clover;3.0.2!clover.jar: Downloaded file size
doesn't match expected Content Length for http://repo1.maven.org/maven2/com/cenqua/clover/clover/3.0.2/clover-3.0.2.jar.
Please retry. (226ms)
[ivy:resolve] 		[FAILED     ] com.cenqua.clover#clover;3.0.2!clover.jar:  (0ms)
[ivy:resolve] 	==== local: tried
[ivy:resolve] 	  /home/jenkins/.ivy2/local/com.cenqua.clover/clover/3.0.2/jars/clover.jar
[ivy:resolve] 	==== apache-snapshot: tried
[ivy:resolve] 	  https://repository.apache.org/content/repositories/snapshots/com/cenqua/clover/clover/3.0.2/clover-3.0.2.jar
[ivy:resolve] 	==== maven2: tried
[ivy:resolve] 	  http://repo1.maven.org/maven2/com/cenqua/clover/clover/3.0.2/clover-3.0.2.jar
[ivy:resolve] 	==== datanucleus-repo: tried
[ivy:resolve] 	  http://www.datanucleus.org/downloads/maven2/com/cenqua/clover/clover/3.0.2/clover-3.0.2.jar
[ivy:resolve] 	==== hadoop-source: tried
[ivy:resolve] 	  http://mirror.facebook.net/facebook/hive-deps/hadoop/core/clover-3.0.2/clover-3.0.2.jar
[ivy:resolve] 	==== hadoop-source2: tried
[ivy:resolve] 	  http://archive.cloudera.com/hive-deps/hadoop/core/clover-3.0.2/clover-3.0.2.jar
[ivy:resolve] 		::::::::::::::::::::::::::::::::::::::::::::::
[ivy:resolve] 		::          UNRESOLVED DEPENDENCIES         ::
[ivy:resolve] 		::::::::::::::::::::::::::::::::::::::::::::::
[ivy:resolve] 		:: org.codehaus.jackson#jackson-xc;1.8.8: not found
[ivy:resolve] 		:: tomcat#jasper-compiler;5.5.23: not found
[ivy:resolve] 		:: org.aspectj#aspectjrt;1.6.5: not found
[ivy:resolve] 		:: org.apache.hadoop#hadoop-auth;0.23.3: not found
[ivy:resolve] 		:: org.apache.hadoop#hadoop-yarn-api;0.23.3: not found
[ivy:resolve] 		:: com.sun.jersey.jersey-test-framework#jersey-test-framework-grizzly2;1.8:
not found
[ivy:resolve] 		:: org.apache.zookeeper#zookeeper;3.4.2: not found
[ivy:resolve] 		::::::::::::::::::::::::::::::::::::::::::::::
[ivy:resolve] 		::::::::::::::::::::::::::::::::::::::::::::::
[ivy:resolve] 		::              FAILED DOWNLOADS            ::
[ivy:resolve] 		:: ^ see resolution messages for details  ^ ::
[ivy:resolve] 		::::::::::::::::::::::::::::::::::::::::::::::
[ivy:resolve] 		:: org.apache.velocity#velocity;1.7!velocity.jar
[ivy:resolve] 		:: com.cenqua.clover#clover;3.0.2!clover.jar
[ivy:resolve] 		::::::::::::::::::::::::::::::::::::::::::::::
[ivy:resolve] 
[ivy:resolve] :: USE VERBOSE OR DEBUG MESSAGE LEVEL FOR MORE DETAILS

BUILD FAILED
/x1/jenkins/jenkins-slave/workspace/Hive-0.9.1-SNAPSHOT-h0.21/hive/build.xml:302: The following
error occurred while executing this line:
/x1/jenkins/jenkins-slave/workspace/Hive-0.9.1-SNAPSHOT-h0.21/hive/build.xml:152: The following
error occurred while executing this line:
/x1/jenkins/jenkins-slave/workspace/Hive-0.9.1-SNAPSHOT-h0.21/hive/shims/build.xml:90: The
following error occurred while executing this line:
/x1/jenkins/jenkins-slave/workspace/Hive-0.9.1-SNAPSHOT-h0.21/hive/shims/build.xml:93: The
following error occurred while executing this line:
/x1/jenkins/jenkins-slave/workspace/Hive-0.9.1-SNAPSHOT-h0.21/hive/shims/build.xml:65: The
following error occurred while executing this line:
/x1/jenkins/jenkins-slave/workspace/Hive-0.9.1-SNAPSHOT-h0.21/hive/build-common.xml:171: impossible
to resolve dependencies:
	resolve failed - see output for details

Total time: 1 minute 13 seconds
Build step 'Invoke Ant' marked build as failure
Archiving artifacts
Recording test results

Mime
View raw message