hive-dev mailing list archives

Site index · List index
Message view « Date » · « Thread »
Top « Date » · « Thread »
From Apache Jenkins Server <jenk...@builds.apache.org>
Subject Build failed in Jenkins: Hive-0.9.1-SNAPSHOT-h0.21 #199
Date Thu, 15 Nov 2012 13:08:46 GMT
See <https://builds.apache.org/job/Hive-0.9.1-SNAPSHOT-h0.21/199/changes>

Changes:

[cws] HIVE-3437. 0.23 compatibility: fix unit tests when building against 0.23 (Chris Drome
via cws)

------------------------------------------
[...truncated 5860 lines...]
[ivy:resolve] 	[SUCCESSFUL ] org.apache.hadoop#hadoop-yarn-server-common;0.23.3!hadoop-yarn-server-common.jar
(263ms)
[ivy:resolve] downloading http://repo1.maven.org/maven2/com/google/inject/extensions/guice-servlet/3.0/guice-servlet-3.0.jar
...
[ivy:resolve] .......... (63kB)
[ivy:resolve] .. (0kB)
[ivy:resolve] 	[SUCCESSFUL ] com.google.inject.extensions#guice-servlet;3.0!guice-servlet.jar
(39ms)
[ivy:resolve] downloading http://repo1.maven.org/maven2/com/google/inject/guice/3.0/guice-3.0.jar
...
[ivy:resolve] ..............................................................................................................................
(693kB)
[ivy:resolve] .. (0kB)
[ivy:resolve] 	[SUCCESSFUL ] com.google.inject#guice;3.0!guice.jar (98ms)
[ivy:resolve] downloading http://repo1.maven.org/maven2/com/sun/jersey/jersey-test-framework/jersey-test-framework-grizzly2/1.8/jersey-test-framework-grizzly2-1.8.jar
...
[ivy:resolve] .. (12kB)
[ivy:resolve] .. (0kB)
[ivy:resolve] 	[SUCCESSFUL ] com.sun.jersey.jersey-test-framework#jersey-test-framework-grizzly2;1.8!jersey-test-framework-grizzly2.jar
(76ms)
[ivy:resolve] downloading http://repo1.maven.org/maven2/com/sun/jersey/contribs/jersey-guice/1.8/jersey-guice-1.8.jar
...
[ivy:resolve] .. (14kB)
[ivy:resolve] .. (0kB)
[ivy:resolve] 	[SUCCESSFUL ] com.sun.jersey.contribs#jersey-guice;1.8!jersey-guice.jar (79ms)
[ivy:resolve] downloading http://repo1.maven.org/maven2/javax/inject/javax.inject/1/javax.inject-1.jar
...
[ivy:resolve] .. (2kB)
[ivy:resolve] .. (0kB)
[ivy:resolve] 	[SUCCESSFUL ] javax.inject#javax.inject;1!javax.inject.jar (13ms)
[ivy:resolve] downloading http://repo1.maven.org/maven2/aopalliance/aopalliance/1.0/aopalliance-1.0.jar
...
[ivy:resolve] .. (4kB)
[ivy:resolve] .. (0kB)
[ivy:resolve] downloading http://repo1.maven.org/maven2/org/sonatype/sisu/inject/cglib/2.2.1-v20090111/cglib-2.2.1-v20090111.jar
...
[ivy:resolve] ........................................................ (272kB)
[ivy:resolve] .. (0kB)
[ivy:resolve] 	[SUCCESSFUL ] org.sonatype.sisu.inject#cglib;2.2.1-v20090111!cglib.jar (66ms)
[ivy:resolve] downloading http://repo1.maven.org/maven2/org/apache/zookeeper/zookeeper/3.4.2/zookeeper-3.4.2.jar
...
[ivy:resolve] ..............................................................................................................................................
(746kB)
[ivy:resolve] .. (0kB)
[ivy:resolve] 	[SUCCESSFUL ] org.apache.zookeeper#zookeeper;3.4.2!zookeeper.jar (105ms)
[ivy:resolve] downloading http://repo1.maven.org/maven2/jline/jline/0.9.94/jline-0.9.94.jar
...
[ivy:resolve] ............ (85kB)
[ivy:resolve] .. (0kB)
[ivy:resolve] 	[SUCCESSFUL ] jline#jline;0.9.94!jline.jar (47ms)
[ivy:resolve] downloading http://repo1.maven.org/maven2/org/apache/hadoop/hadoop-mapreduce-client-shuffle/0.23.3/hadoop-mapreduce-client-shuffle-0.23.3.jar
...
[ivy:resolve] .. (15kB)
[ivy:resolve] .. (0kB)
[ivy:resolve] 
[ivy:resolve] :: problems summary ::
[ivy:resolve] :::: WARNINGS
[ivy:resolve] 	problem while downloading module descriptor: http://repo1.maven.org/maven2/org/apache/hadoop/hadoop-annotations/0.23.3/hadoop-annotations-0.23.3.pom:
/home/jenkins/.ivy2/cache/org.apache.hadoop/hadoop-annotations/ivy-0.23.3.xml.original.part
(No such file or directory) (193ms)
[ivy:resolve] 		module not found: org.apache.hadoop#hadoop-annotations;0.23.3
[ivy:resolve] 	==== local: tried
[ivy:resolve] 	  /home/jenkins/.ivy2/local/org.apache.hadoop/hadoop-annotations/0.23.3/ivys/ivy.xml
[ivy:resolve] 	  -- artifact org.apache.hadoop#hadoop-annotations;0.23.3!hadoop-annotations.jar:
[ivy:resolve] 	  /home/jenkins/.ivy2/local/org.apache.hadoop/hadoop-annotations/0.23.3/jars/hadoop-annotations.jar
[ivy:resolve] 	==== apache-snapshot: tried
[ivy:resolve] 	  https://repository.apache.org/content/repositories/snapshots/org/apache/hadoop/hadoop-annotations/0.23.3/hadoop-annotations-0.23.3.pom
[ivy:resolve] 	  -- artifact org.apache.hadoop#hadoop-annotations;0.23.3!hadoop-annotations.jar:
[ivy:resolve] 	  https://repository.apache.org/content/repositories/snapshots/org/apache/hadoop/hadoop-annotations/0.23.3/hadoop-annotations-0.23.3.jar
[ivy:resolve] 	==== maven2: tried
[ivy:resolve] 	  http://repo1.maven.org/maven2/org/apache/hadoop/hadoop-annotations/0.23.3/hadoop-annotations-0.23.3.pom
[ivy:resolve] 	==== datanucleus-repo: tried
[ivy:resolve] 	  -- artifact org.apache.hadoop#hadoop-annotations;0.23.3!hadoop-annotations.jar:
[ivy:resolve] 	  http://www.datanucleus.org/downloads/maven2/org/apache/hadoop/hadoop-annotations/0.23.3/hadoop-annotations-0.23.3.jar
[ivy:resolve] 	==== hadoop-source: tried
[ivy:resolve] 	  -- artifact org.apache.hadoop#hadoop-annotations;0.23.3!hadoop-annotations.jar:
[ivy:resolve] 	  http://mirror.facebook.net/facebook/hive-deps/hadoop/core/hadoop-annotations-0.23.3/hadoop-annotations-0.23.3.jar
[ivy:resolve] 	==== hadoop-source2: tried
[ivy:resolve] 	  -- artifact org.apache.hadoop#hadoop-annotations;0.23.3!hadoop-annotations.jar:
[ivy:resolve] 	  http://archive.cloudera.com/hive-deps/hadoop/core/hadoop-annotations-0.23.3/hadoop-annotations-0.23.3.jar
[ivy:resolve] 	problem while downloading module descriptor: http://repo1.maven.org/maven2/com/sun/jersey/jersey-core/1.8/jersey-core-1.8.pom:
/home/jenkins/.ivy2/cache/com.sun.jersey/jersey-core/ivy-1.8.xml.original.part (No such file
or directory) (69ms)
[ivy:resolve] 		module not found: com.sun.jersey#jersey-core;1.8
[ivy:resolve] 	==== local: tried
[ivy:resolve] 	  /home/jenkins/.ivy2/local/com.sun.jersey/jersey-core/1.8/ivys/ivy.xml
[ivy:resolve] 	  -- artifact com.sun.jersey#jersey-core;1.8!jersey-core.jar:
[ivy:resolve] 	  /home/jenkins/.ivy2/local/com.sun.jersey/jersey-core/1.8/jars/jersey-core.jar
[ivy:resolve] 	==== apache-snapshot: tried
[ivy:resolve] 	  https://repository.apache.org/content/repositories/snapshots/com/sun/jersey/jersey-core/1.8/jersey-core-1.8.pom
[ivy:resolve] 	  -- artifact com.sun.jersey#jersey-core;1.8!jersey-core.jar:
[ivy:resolve] 	  https://repository.apache.org/content/repositories/snapshots/com/sun/jersey/jersey-core/1.8/jersey-core-1.8.jar
[ivy:resolve] 	==== maven2: tried
[ivy:resolve] 	  http://repo1.maven.org/maven2/com/sun/jersey/jersey-core/1.8/jersey-core-1.8.pom
[ivy:resolve] 	==== datanucleus-repo: tried
[ivy:resolve] 	  -- artifact com.sun.jersey#jersey-core;1.8!jersey-core.jar:
[ivy:resolve] 	  http://www.datanucleus.org/downloads/maven2/com/sun/jersey/jersey-core/1.8/jersey-core-1.8.jar
[ivy:resolve] 	==== hadoop-source: tried
[ivy:resolve] 	  -- artifact com.sun.jersey#jersey-core;1.8!jersey-core.jar:
[ivy:resolve] 	  http://mirror.facebook.net/facebook/hive-deps/hadoop/core/jersey-core-1.8/jersey-core-1.8.jar
[ivy:resolve] 	==== hadoop-source2: tried
[ivy:resolve] 	  -- artifact com.sun.jersey#jersey-core;1.8!jersey-core.jar:
[ivy:resolve] 	  http://archive.cloudera.com/hive-deps/hadoop/core/jersey-core-1.8/jersey-core-1.8.jar
[ivy:resolve] 	problem while downloading module descriptor: http://repo1.maven.org/maven2/commons-lang/commons-lang/2.5/commons-lang-2.5.pom:
/home/jenkins/.ivy2/cache/commons-lang/commons-lang/ivy-2.5.xml.original.part (No such file
or directory) (27ms)
[ivy:resolve] 		module not found: commons-lang#commons-lang;2.5
[ivy:resolve] 	==== local: tried
[ivy:resolve] 	  /home/jenkins/.ivy2/local/commons-lang/commons-lang/2.5/ivys/ivy.xml
[ivy:resolve] 	  -- artifact commons-lang#commons-lang;2.5!commons-lang.jar:
[ivy:resolve] 	  /home/jenkins/.ivy2/local/commons-lang/commons-lang/2.5/jars/commons-lang.jar
[ivy:resolve] 	==== apache-snapshot: tried
[ivy:resolve] 	  https://repository.apache.org/content/repositories/snapshots/commons-lang/commons-lang/2.5/commons-lang-2.5.pom
[ivy:resolve] 	  -- artifact commons-lang#commons-lang;2.5!commons-lang.jar:
[ivy:resolve] 	  https://repository.apache.org/content/repositories/snapshots/commons-lang/commons-lang/2.5/commons-lang-2.5.jar
[ivy:resolve] 	==== maven2: tried
[ivy:resolve] 	  http://repo1.maven.org/maven2/commons-lang/commons-lang/2.5/commons-lang-2.5.pom
[ivy:resolve] 	==== datanucleus-repo: tried
[ivy:resolve] 	  -- artifact commons-lang#commons-lang;2.5!commons-lang.jar:
[ivy:resolve] 	  http://www.datanucleus.org/downloads/maven2/commons-lang/commons-lang/2.5/commons-lang-2.5.jar
[ivy:resolve] 	==== hadoop-source: tried
[ivy:resolve] 	  -- artifact commons-lang#commons-lang;2.5!commons-lang.jar:
[ivy:resolve] 	  http://mirror.facebook.net/facebook/hive-deps/hadoop/core/commons-lang-2.5/commons-lang-2.5.jar
[ivy:resolve] 	==== hadoop-source2: tried
[ivy:resolve] 	  -- artifact commons-lang#commons-lang;2.5!commons-lang.jar:
[ivy:resolve] 	  http://archive.cloudera.com/hive-deps/hadoop/core/commons-lang-2.5/commons-lang-2.5.jar
[ivy:resolve] 	problem while downloading module descriptor: http://repo1.maven.org/maven2/org/apache/avro/avro/1.5.3/avro-1.5.3.pom:
/home/jenkins/.ivy2/cache/org.apache.avro/avro/ivy-1.5.3.xml.original.part (No such file or
directory) (28ms)
[ivy:resolve] 		module not found: org.apache.avro#avro;1.5.3
[ivy:resolve] 	==== local: tried
[ivy:resolve] 	  /home/jenkins/.ivy2/local/org.apache.avro/avro/1.5.3/ivys/ivy.xml
[ivy:resolve] 	  -- artifact org.apache.avro#avro;1.5.3!avro.jar:
[ivy:resolve] 	  /home/jenkins/.ivy2/local/org.apache.avro/avro/1.5.3/jars/avro.jar
[ivy:resolve] 	==== apache-snapshot: tried
[ivy:resolve] 	  https://repository.apache.org/content/repositories/snapshots/org/apache/avro/avro/1.5.3/avro-1.5.3.pom
[ivy:resolve] 	  -- artifact org.apache.avro#avro;1.5.3!avro.jar:
[ivy:resolve] 	  https://repository.apache.org/content/repositories/snapshots/org/apache/avro/avro/1.5.3/avro-1.5.3.jar
[ivy:resolve] 	==== maven2: tried
[ivy:resolve] 	  http://repo1.maven.org/maven2/org/apache/avro/avro/1.5.3/avro-1.5.3.pom
[ivy:resolve] 	==== datanucleus-repo: tried
[ivy:resolve] 	  -- artifact org.apache.avro#avro;1.5.3!avro.jar:
[ivy:resolve] 	  http://www.datanucleus.org/downloads/maven2/org/apache/avro/avro/1.5.3/avro-1.5.3.jar
[ivy:resolve] 	==== hadoop-source: tried
[ivy:resolve] 	  -- artifact org.apache.avro#avro;1.5.3!avro.jar:
[ivy:resolve] 	  http://mirror.facebook.net/facebook/hive-deps/hadoop/core/avro-1.5.3/avro-1.5.3.jar
[ivy:resolve] 	==== hadoop-source2: tried
[ivy:resolve] 	  -- artifact org.apache.avro#avro;1.5.3!avro.jar:
[ivy:resolve] 	  http://archive.cloudera.com/hive-deps/hadoop/core/avro-1.5.3/avro-1.5.3.jar
[ivy:resolve] 	problem while downloading module descriptor: http://repo1.maven.org/maven2/com/google/protobuf/protobuf-java/2.4.0a/protobuf-java-2.4.0a.pom:
Downloaded file size doesn't match expected Content Length for http://repo1.maven.org/maven2/com/google/protobuf/protobuf-java/2.4.0a/protobuf-java-2.4.0a.pom.
Please retry. (16ms)
[ivy:resolve] 		module not found: com.google.protobuf#protobuf-java;2.4.0a
[ivy:resolve] 	==== local: tried
[ivy:resolve] 	  /home/jenkins/.ivy2/local/com.google.protobuf/protobuf-java/2.4.0a/ivys/ivy.xml
[ivy:resolve] 	  -- artifact com.google.protobuf#protobuf-java;2.4.0a!protobuf-java.jar:
[ivy:resolve] 	  /home/jenkins/.ivy2/local/com.google.protobuf/protobuf-java/2.4.0a/jars/protobuf-java.jar
[ivy:resolve] 	==== apache-snapshot: tried
[ivy:resolve] 	  https://repository.apache.org/content/repositories/snapshots/com/google/protobuf/protobuf-java/2.4.0a/protobuf-java-2.4.0a.pom
[ivy:resolve] 	  -- artifact com.google.protobuf#protobuf-java;2.4.0a!protobuf-java.jar:
[ivy:resolve] 	  https://repository.apache.org/content/repositories/snapshots/com/google/protobuf/protobuf-java/2.4.0a/protobuf-java-2.4.0a.jar
[ivy:resolve] 	==== maven2: tried
[ivy:resolve] 	  http://repo1.maven.org/maven2/com/google/protobuf/protobuf-java/2.4.0a/protobuf-java-2.4.0a.pom
[ivy:resolve] 	==== datanucleus-repo: tried
[ivy:resolve] 	  -- artifact com.google.protobuf#protobuf-java;2.4.0a!protobuf-java.jar:
[ivy:resolve] 	  http://www.datanucleus.org/downloads/maven2/com/google/protobuf/protobuf-java/2.4.0a/protobuf-java-2.4.0a.jar
[ivy:resolve] 	==== hadoop-source: tried
[ivy:resolve] 	  -- artifact com.google.protobuf#protobuf-java;2.4.0a!protobuf-java.jar:
[ivy:resolve] 	  http://mirror.facebook.net/facebook/hive-deps/hadoop/core/protobuf-java-2.4.0a/protobuf-java-2.4.0a.jar
[ivy:resolve] 	==== hadoop-source2: tried
[ivy:resolve] 	  -- artifact com.google.protobuf#protobuf-java;2.4.0a!protobuf-java.jar:
[ivy:resolve] 	  http://archive.cloudera.com/hive-deps/hadoop/core/protobuf-java-2.4.0a/protobuf-java-2.4.0a.jar
[ivy:resolve] 	problem while downloading module descriptor: http://repo1.maven.org/maven2/org/apache/hadoop/hadoop-mapreduce-client-core/0.23.3/hadoop-mapreduce-client-core-0.23.3.pom:
/home/jenkins/.ivy2/cache/org.apache.hadoop/hadoop-mapreduce-client-core/ivy-0.23.3.xml.original.part
(No such file or directory) (181ms)
[ivy:resolve] 		module not found: org.apache.hadoop#hadoop-mapreduce-client-core;0.23.3
[ivy:resolve] 	==== local: tried
[ivy:resolve] 	  /home/jenkins/.ivy2/local/org.apache.hadoop/hadoop-mapreduce-client-core/0.23.3/ivys/ivy.xml
[ivy:resolve] 	  -- artifact org.apache.hadoop#hadoop-mapreduce-client-core;0.23.3!hadoop-mapreduce-client-core.jar:
[ivy:resolve] 	  /home/jenkins/.ivy2/local/org.apache.hadoop/hadoop-mapreduce-client-core/0.23.3/jars/hadoop-mapreduce-client-core.jar
[ivy:resolve] 	==== apache-snapshot: tried
[ivy:resolve] 	  https://repository.apache.org/content/repositories/snapshots/org/apache/hadoop/hadoop-mapreduce-client-core/0.23.3/hadoop-mapreduce-client-core-0.23.3.pom
[ivy:resolve] 	  -- artifact org.apache.hadoop#hadoop-mapreduce-client-core;0.23.3!hadoop-mapreduce-client-core.jar:
[ivy:resolve] 	  https://repository.apache.org/content/repositories/snapshots/org/apache/hadoop/hadoop-mapreduce-client-core/0.23.3/hadoop-mapreduce-client-core-0.23.3.jar
[ivy:resolve] 	==== maven2: tried
[ivy:resolve] 	  http://repo1.maven.org/maven2/org/apache/hadoop/hadoop-mapreduce-client-core/0.23.3/hadoop-mapreduce-client-core-0.23.3.pom
[ivy:resolve] 	==== datanucleus-repo: tried
[ivy:resolve] 	  -- artifact org.apache.hadoop#hadoop-mapreduce-client-core;0.23.3!hadoop-mapreduce-client-core.jar:
[ivy:resolve] 	  http://www.datanucleus.org/downloads/maven2/org/apache/hadoop/hadoop-mapreduce-client-core/0.23.3/hadoop-mapreduce-client-core-0.23.3.jar
[ivy:resolve] 	==== hadoop-source: tried
[ivy:resolve] 	  -- artifact org.apache.hadoop#hadoop-mapreduce-client-core;0.23.3!hadoop-mapreduce-client-core.jar:
[ivy:resolve] 	  http://mirror.facebook.net/facebook/hive-deps/hadoop/core/hadoop-mapreduce-client-core-0.23.3/hadoop-mapreduce-client-core-0.23.3.jar
[ivy:resolve] 	==== hadoop-source2: tried
[ivy:resolve] 	  -- artifact org.apache.hadoop#hadoop-mapreduce-client-core;0.23.3!hadoop-mapreduce-client-core.jar:
[ivy:resolve] 	  http://archive.cloudera.com/hive-deps/hadoop/core/hadoop-mapreduce-client-core-0.23.3/hadoop-mapreduce-client-core-0.23.3.jar
[ivy:resolve] 	problem while downloading module descriptor: http://repo1.maven.org/maven2/org/apache/hadoop/hadoop-yarn-api/0.23.3/hadoop-yarn-api-0.23.3.pom:
/home/jenkins/.ivy2/cache/org.apache.hadoop/hadoop-yarn-api/ivy-0.23.3.xml.original.part (No
such file or directory) (118ms)
[ivy:resolve] 		module not found: org.apache.hadoop#hadoop-yarn-api;0.23.3
[ivy:resolve] 	==== local: tried
[ivy:resolve] 	  /home/jenkins/.ivy2/local/org.apache.hadoop/hadoop-yarn-api/0.23.3/ivys/ivy.xml
[ivy:resolve] 	  -- artifact org.apache.hadoop#hadoop-yarn-api;0.23.3!hadoop-yarn-api.jar:
[ivy:resolve] 	  /home/jenkins/.ivy2/local/org.apache.hadoop/hadoop-yarn-api/0.23.3/jars/hadoop-yarn-api.jar
[ivy:resolve] 	==== apache-snapshot: tried
[ivy:resolve] 	  https://repository.apache.org/content/repositories/snapshots/org/apache/hadoop/hadoop-yarn-api/0.23.3/hadoop-yarn-api-0.23.3.pom
[ivy:resolve] 	  -- artifact org.apache.hadoop#hadoop-yarn-api;0.23.3!hadoop-yarn-api.jar:
[ivy:resolve] 	  https://repository.apache.org/content/repositories/snapshots/org/apache/hadoop/hadoop-yarn-api/0.23.3/hadoop-yarn-api-0.23.3.jar
[ivy:resolve] 	==== maven2: tried
[ivy:resolve] 	  http://repo1.maven.org/maven2/org/apache/hadoop/hadoop-yarn-api/0.23.3/hadoop-yarn-api-0.23.3.pom
[ivy:resolve] 	==== datanucleus-repo: tried
[ivy:resolve] 	  -- artifact org.apache.hadoop#hadoop-yarn-api;0.23.3!hadoop-yarn-api.jar:
[ivy:resolve] 	  http://www.datanucleus.org/downloads/maven2/org/apache/hadoop/hadoop-yarn-api/0.23.3/hadoop-yarn-api-0.23.3.jar
[ivy:resolve] 	==== hadoop-source: tried
[ivy:resolve] 	  -- artifact org.apache.hadoop#hadoop-yarn-api;0.23.3!hadoop-yarn-api.jar:
[ivy:resolve] 	  http://mirror.facebook.net/facebook/hive-deps/hadoop/core/hadoop-yarn-api-0.23.3/hadoop-yarn-api-0.23.3.jar
[ivy:resolve] 	==== hadoop-source2: tried
[ivy:resolve] 	  -- artifact org.apache.hadoop#hadoop-yarn-api;0.23.3!hadoop-yarn-api.jar:
[ivy:resolve] 	  http://archive.cloudera.com/hive-deps/hadoop/core/hadoop-yarn-api-0.23.3/hadoop-yarn-api-0.23.3.jar
[ivy:resolve] 	problem while downloading module descriptor: http://repo1.maven.org/maven2/org/apache/hadoop/hadoop-yarn-server-nodemanager/0.23.3/hadoop-yarn-server-nodemanager-0.23.3.pom:
/home/jenkins/.ivy2/cache/org.apache.hadoop/hadoop-yarn-server-nodemanager/ivy-0.23.3.xml.original.part
(No such file or directory) (125ms)
[ivy:resolve] 		module not found: org.apache.hadoop#hadoop-yarn-server-nodemanager;0.23.3
[ivy:resolve] 	==== local: tried
[ivy:resolve] 	  /home/jenkins/.ivy2/local/org.apache.hadoop/hadoop-yarn-server-nodemanager/0.23.3/ivys/ivy.xml
[ivy:resolve] 	  -- artifact org.apache.hadoop#hadoop-yarn-server-nodemanager;0.23.3!hadoop-yarn-server-nodemanager.jar:
[ivy:resolve] 	  /home/jenkins/.ivy2/local/org.apache.hadoop/hadoop-yarn-server-nodemanager/0.23.3/jars/hadoop-yarn-server-nodemanager.jar
[ivy:resolve] 	==== apache-snapshot: tried
[ivy:resolve] 	  https://repository.apache.org/content/repositories/snapshots/org/apache/hadoop/hadoop-yarn-server-nodemanager/0.23.3/hadoop-yarn-server-nodemanager-0.23.3.pom
[ivy:resolve] 	  -- artifact org.apache.hadoop#hadoop-yarn-server-nodemanager;0.23.3!hadoop-yarn-server-nodemanager.jar:
[ivy:resolve] 	  https://repository.apache.org/content/repositories/snapshots/org/apache/hadoop/hadoop-yarn-server-nodemanager/0.23.3/hadoop-yarn-server-nodemanager-0.23.3.jar
[ivy:resolve] 	==== maven2: tried
[ivy:resolve] 	  http://repo1.maven.org/maven2/org/apache/hadoop/hadoop-yarn-server-nodemanager/0.23.3/hadoop-yarn-server-nodemanager-0.23.3.pom
[ivy:resolve] 	==== datanucleus-repo: tried
[ivy:resolve] 	  -- artifact org.apache.hadoop#hadoop-yarn-server-nodemanager;0.23.3!hadoop-yarn-server-nodemanager.jar:
[ivy:resolve] 	  http://www.datanucleus.org/downloads/maven2/org/apache/hadoop/hadoop-yarn-server-nodemanager/0.23.3/hadoop-yarn-server-nodemanager-0.23.3.jar
[ivy:resolve] 	==== hadoop-source: tried
[ivy:resolve] 	  -- artifact org.apache.hadoop#hadoop-yarn-server-nodemanager;0.23.3!hadoop-yarn-server-nodemanager.jar:
[ivy:resolve] 	  http://mirror.facebook.net/facebook/hive-deps/hadoop/core/hadoop-yarn-server-nodemanager-0.23.3/hadoop-yarn-server-nodemanager-0.23.3.jar
[ivy:resolve] 	==== hadoop-source2: tried
[ivy:resolve] 	  -- artifact org.apache.hadoop#hadoop-yarn-server-nodemanager;0.23.3!hadoop-yarn-server-nodemanager.jar:
[ivy:resolve] 	  http://archive.cloudera.com/hive-deps/hadoop/core/hadoop-yarn-server-nodemanager-0.23.3/hadoop-yarn-server-nodemanager-0.23.3.jar
[ivy:resolve] 		[FAILED     ] org.apache.hadoop#hadoop-mapreduce-client-jobclient;0.23.3!hadoop-mapreduce-client-jobclient.jar:
/home/jenkins/.ivy2/cache/org.apache.hadoop/hadoop-mapreduce-client-jobclient/jars/hadoop-mapreduce-client-jobclient-0.23.3.jar.part
(No such file or directory) (130ms)
[ivy:resolve] 		[FAILED     ] org.apache.hadoop#hadoop-mapreduce-client-jobclient;0.23.3!hadoop-mapreduce-client-jobclient.jar(tests):
/home/jenkins/.ivy2/cache/org.apache.hadoop/hadoop-mapreduce-client-jobclient/testss/hadoop-mapreduce-client-jobclient-0.23.3-tests.jar.part
(No such file or directory) (449ms)
[ivy:resolve] 		[FAILED     ] javax.servlet#servlet-api;2.5!servlet-api.jar: impossible to
move part file to definitive one: /home/jenkins/.ivy2/cache/javax.servlet/servlet-api/jars/servlet-api-2.5.jar.part
-> /home/jenkins/.ivy2/cache/javax.servlet/servlet-api/jars/servlet-api-2.5.jar (40ms)
[ivy:resolve] 		[FAILED     ] asm#asm;3.2!asm.jar: impossible to move part file to definitive
one: /home/jenkins/.ivy2/cache/asm/asm/jars/asm-3.2.jar.part -> /home/jenkins/.ivy2/cache/asm/asm/jars/asm-3.2.jar
(23ms)
[ivy:resolve] 		[FAILED     ] log4j#log4j;1.2.15!log4j.jar: /home/jenkins/.ivy2/cache/log4j/log4j/jars/log4j-1.2.15.jar.part
(No such file or directory) (27ms)
[ivy:resolve] 		[FAILED     ] org.slf4j#slf4j-log4j12;1.6.1!slf4j-log4j12.jar: /home/jenkins/.ivy2/cache/org.slf4j/slf4j-log4j12/jars/slf4j-log4j12-1.6.1.jar.part
(No such file or directory) (103ms)
[ivy:resolve] 		[FAILED     ] com.google.code.findbugs#jsr305;1.3.9!jsr305.jar: impossible
to move part file to definitive one: /home/jenkins/.ivy2/cache/com.google.code.findbugs/jsr305/jars/jsr305-1.3.9.jar.part
-> /home/jenkins/.ivy2/cache/com.google.code.findbugs/jsr305/jars/jsr305-1.3.9.jar (22ms)
[ivy:resolve] 		[FAILED     ] org.apache.hadoop#hadoop-yarn-common;0.23.3!hadoop-yarn-common.jar:
impossible to move part file to definitive one: /home/jenkins/.ivy2/cache/org.apache.hadoop/hadoop-yarn-common/jars/hadoop-yarn-common-0.23.3.jar.part
-> /home/jenkins/.ivy2/cache/org.apache.hadoop/hadoop-yarn-common/jars/hadoop-yarn-common-0.23.3.jar
(188ms)
[ivy:resolve] 		[FAILED     ] aopalliance#aopalliance;1.0!aopalliance.jar: /home/jenkins/.ivy2/cache/aopalliance/aopalliance/jars/aopalliance-1.0.jar.part
(No such file or directory) (12ms)
[ivy:resolve] 		[FAILED     ] org.apache.hadoop#hadoop-mapreduce-client-shuffle;0.23.3!hadoop-mapreduce-client-shuffle.jar:
/home/jenkins/.ivy2/cache/org.apache.hadoop/hadoop-mapreduce-client-shuffle/jars/hadoop-mapreduce-client-shuffle-0.23.3.jar.part
(No such file or directory) (133ms)
[ivy:resolve] 		::::::::::::::::::::::::::::::::::::::::::::::
[ivy:resolve] 		::          UNRESOLVED DEPENDENCIES         ::
[ivy:resolve] 		::::::::::::::::::::::::::::::::::::::::::::::
[ivy:resolve] 		:: org.apache.hadoop#hadoop-annotations;0.23.3: not found
[ivy:resolve] 		:: com.sun.jersey#jersey-core;1.8: not found
[ivy:resolve] 		:: commons-lang#commons-lang;2.5: not found
[ivy:resolve] 		:: org.apache.avro#avro;1.5.3: not found
[ivy:resolve] 		:: com.google.protobuf#protobuf-java;2.4.0a: not found
[ivy:resolve] 		:: org.apache.hadoop#hadoop-mapreduce-client-core;0.23.3: not found
[ivy:resolve] 		:: org.apache.hadoop#hadoop-yarn-api;0.23.3: not found
[ivy:resolve] 		:: org.apache.hadoop#hadoop-yarn-server-nodemanager;0.23.3: not found
[ivy:resolve] 		::::::::::::::::::::::::::::::::::::::::::::::
[ivy:resolve] 
[ivy:resolve] :: USE VERBOSE OR DEBUG MESSAGE LEVEL FOR MORE DETAILS

BUILD FAILED
<https://builds.apache.org/job/Hive-0.9.1-SNAPSHOT-h0.21/ws/hive/build.xml>:302: The
following error occurred while executing this line:
<https://builds.apache.org/job/Hive-0.9.1-SNAPSHOT-h0.21/ws/hive/build.xml>:152: The
following error occurred while executing this line:
<https://builds.apache.org/job/Hive-0.9.1-SNAPSHOT-h0.21/ws/hive/shims/build.xml>:90:
The following error occurred while executing this line:
<https://builds.apache.org/job/Hive-0.9.1-SNAPSHOT-h0.21/ws/hive/shims/build.xml>:93:
The following error occurred while executing this line:
<https://builds.apache.org/job/Hive-0.9.1-SNAPSHOT-h0.21/ws/hive/shims/build.xml>:65:
The following error occurred while executing this line:
<https://builds.apache.org/job/Hive-0.9.1-SNAPSHOT-h0.21/ws/hive/build-common.xml>:171:
impossible to resolve dependencies:
	resolve failed - see output for details

Total time: 1 minute 15 seconds
Build step 'Invoke Ant' marked build as failure
Archiving artifacts
Updating HIVE-3437
Recording test results

Mime
View raw message