hive-dev mailing list archives

Site index · List index
Message view « Date » · « Thread »
Top « Date » · « Thread »
From Apache Jenkins Server <jenk...@builds.apache.org>
Subject Build failed in Jenkins: Hive-0.9.1-SNAPSHOT-h0.21-keepgoing=false #200
Date Thu, 15 Nov 2012 16:06:13 GMT
See <https://builds.apache.org/job/Hive-0.9.1-SNAPSHOT-h0.21-keepgoing=false/200/>

------------------------------------------
[...truncated 5959 lines...]
[ivy:resolve] downloading http://repo1.maven.org/maven2/com/google/inject/extensions/guice-servlet/3.0/guice-servlet-3.0.jar
...
[ivy:resolve] .... (63kB)
[ivy:resolve] .. (0kB)
[ivy:resolve] downloading http://repo1.maven.org/maven2/com/cenqua/clover/clover/3.0.2/clover-3.0.2.jar
...
[ivy:resolve] ..................................................................................................................................................................................................................................................................................................................................................................................................................................................................................................................................................................................................................................................................................................................................................................................
(11446kB)
[ivy:resolve] .. (0kB)
[ivy:resolve] 	[SUCCESSFUL ] com.cenqua.clover#clover;3.0.2!clover.jar (979ms)
[ivy:resolve] downloading http://repo1.maven.org/maven2/org/apache/hadoop/hadoop-yarn-api/0.23.3/hadoop-yarn-api-0.23.3.jar
...
[ivy:resolve] ................................................................ (871kB)
[ivy:resolve] downloading http://repo1.maven.org/maven2/com/google/inject/guice/3.0/guice-3.0.jar
...
[ivy:resolve] .......................................... (693kB)
[ivy:resolve] downloading http://repo1.maven.org/maven2/com/sun/jersey/jersey-test-framework/jersey-test-framework-grizzly2/1.8/jersey-test-framework-grizzly2-1.8.jar
...
[ivy:resolve] .. (12kB)
[ivy:resolve] downloading http://repo1.maven.org/maven2/com/sun/jersey/contribs/jersey-guice/1.8/jersey-guice-1.8.jar
...
[ivy:resolve] .. (14kB)
[ivy:resolve] .. (0kB)
[ivy:resolve] downloading http://repo1.maven.org/maven2/javax/inject/javax.inject/1/javax.inject-1.jar
...
[ivy:resolve] .. (2kB)
[ivy:resolve] .. (0kB)
[ivy:resolve] 	[SUCCESSFUL ] javax.inject#javax.inject;1!javax.inject.jar (102ms)
[ivy:resolve] downloading http://repo1.maven.org/maven2/aopalliance/aopalliance/1.0/aopalliance-1.0.jar
...
[ivy:resolve] .. (4kB)
[ivy:resolve] .. (0kB)
[ivy:resolve] downloading http://repo1.maven.org/maven2/org/sonatype/sisu/inject/cglib/2.2.1-v20090111/cglib-2.2.1-v20090111.jar
...
[ivy:resolve] .................... (272kB)
[ivy:resolve] downloading http://repo1.maven.org/maven2/org/apache/hadoop/hadoop-yarn-server-common/0.23.3/hadoop-yarn-server-common-0.23.3.jar
...
[ivy:resolve] .......... (147kB)
[ivy:resolve] .. (0kB)
[ivy:resolve] 	[SUCCESSFUL ] org.apache.hadoop#hadoop-yarn-server-common;0.23.3!hadoop-yarn-server-common.jar
(289ms)
[ivy:resolve] downloading http://repo1.maven.org/maven2/org/apache/hadoop/hadoop-mapreduce-client-shuffle/0.23.3/hadoop-mapreduce-client-shuffle-0.23.3.jar
...
[ivy:resolve] .. (15kB)
[ivy:resolve] .. (0kB)
[ivy:resolve] 	[SUCCESSFUL ] org.apache.hadoop#hadoop-mapreduce-client-shuffle;0.23.3!hadoop-mapreduce-client-shuffle.jar
(252ms)
[ivy:resolve] downloading http://repo1.maven.org/maven2/org/apache/hadoop/hadoop-yarn-server-nodemanager/0.23.3/hadoop-yarn-server-nodemanager-0.23.3.jar
...
[ivy:resolve] .......................... (385kB)
[ivy:resolve] .. (0kB)
[ivy:resolve] 	[SUCCESSFUL ] org.apache.hadoop#hadoop-yarn-server-nodemanager;0.23.3!hadoop-yarn-server-nodemanager.jar
(410ms)
[ivy:resolve] 
[ivy:resolve] :: problems summary ::
[ivy:resolve] :::: WARNINGS
[ivy:resolve] 	impossible to put metadata file in cache: http://repo1.maven.org/maven2/jdiff/jdiff/1.0.9/jdiff-1.0.9.pom
(1.0.9). java.io.FileNotFoundException: /home/jenkins/.ivy2/cache/jdiff/jdiff/ivy-1.0.9.xml.original
(No such file or directory)
[ivy:resolve] 	problem while downloading module descriptor: http://repo1.maven.org/maven2/org/apache/zookeeper/zookeeper/3.4.2/zookeeper-3.4.2.pom:
/home/jenkins/.ivy2/cache/org.apache.zookeeper/zookeeper/ivy-3.4.2.xml.original.part (No such
file or directory) (101ms)
[ivy:resolve] 		module not found: org.apache.zookeeper#zookeeper;3.4.2
[ivy:resolve] 	==== local: tried
[ivy:resolve] 	  /home/jenkins/.ivy2/local/org.apache.zookeeper/zookeeper/3.4.2/ivys/ivy.xml
[ivy:resolve] 	  -- artifact org.apache.zookeeper#zookeeper;3.4.2!zookeeper.jar:
[ivy:resolve] 	  /home/jenkins/.ivy2/local/org.apache.zookeeper/zookeeper/3.4.2/jars/zookeeper.jar
[ivy:resolve] 	==== apache-snapshot: tried
[ivy:resolve] 	  https://repository.apache.org/content/repositories/snapshots/org/apache/zookeeper/zookeeper/3.4.2/zookeeper-3.4.2.pom
[ivy:resolve] 	  -- artifact org.apache.zookeeper#zookeeper;3.4.2!zookeeper.jar:
[ivy:resolve] 	  https://repository.apache.org/content/repositories/snapshots/org/apache/zookeeper/zookeeper/3.4.2/zookeeper-3.4.2.jar
[ivy:resolve] 	==== maven2: tried
[ivy:resolve] 	  http://repo1.maven.org/maven2/org/apache/zookeeper/zookeeper/3.4.2/zookeeper-3.4.2.pom
[ivy:resolve] 	==== datanucleus-repo: tried
[ivy:resolve] 	  -- artifact org.apache.zookeeper#zookeeper;3.4.2!zookeeper.jar:
[ivy:resolve] 	  http://www.datanucleus.org/downloads/maven2/org/apache/zookeeper/zookeeper/3.4.2/zookeeper-3.4.2.jar
[ivy:resolve] 	==== hadoop-source: tried
[ivy:resolve] 	  -- artifact org.apache.zookeeper#zookeeper;3.4.2!zookeeper.jar:
[ivy:resolve] 	  http://mirror.facebook.net/facebook/hive-deps/hadoop/core/zookeeper-3.4.2/zookeeper-3.4.2.jar
[ivy:resolve] 	==== hadoop-source2: tried
[ivy:resolve] 	  -- artifact org.apache.zookeeper#zookeeper;3.4.2!zookeeper.jar:
[ivy:resolve] 	  http://archive.cloudera.com/hive-deps/hadoop/core/zookeeper-3.4.2/zookeeper-3.4.2.jar
[ivy:resolve] 		[FAILED     ] org.apache.hadoop#hadoop-common;0.23.3!hadoop-common.jar(tests):
/home/jenkins/.ivy2/cache/org.apache.hadoop/hadoop-common/testss/hadoop-common-0.23.3-tests.jar.part
(No such file or directory) (1093ms)
[ivy:resolve] 		[FAILED     ] org.apache.hadoop#hadoop-mapreduce-client-core;0.23.3!hadoop-mapreduce-client-core.jar:
/home/jenkins/.ivy2/cache/org.apache.hadoop/hadoop-mapreduce-client-core/jars/hadoop-mapreduce-client-core-0.23.3.jar.part
(No such file or directory) (410ms)
[ivy:resolve] 		[FAILED     ] org.apache.hadoop#hadoop-archives;0.23.3!hadoop-archives.jar:
/home/jenkins/.ivy2/cache/org.apache.hadoop/hadoop-archives/jars/hadoop-archives-0.23.3.jar.part
(No such file or directory) (229ms)
[ivy:resolve] 		[FAILED     ] org.apache.hadoop#hadoop-hdfs;0.23.3!hadoop-hdfs.jar: /home/jenkins/.ivy2/cache/org.apache.hadoop/hadoop-hdfs/jars/hadoop-hdfs-0.23.3.jar.part
(No such file or directory) (362ms)
[ivy:resolve] 		[FAILED     ] org.apache.hadoop#hadoop-hdfs;0.23.3!hadoop-hdfs.jar(tests):
/home/jenkins/.ivy2/cache/org.apache.hadoop/hadoop-hdfs/testss/hadoop-hdfs-0.23.3-tests.jar.part
(No such file or directory) (457ms)
[ivy:resolve] 		[FAILED     ] com.sun.jersey#jersey-core;1.8!jersey-core.jar(bundle): invalid
sha1: expected=b6a0553c0eb3da45a9b8947a0a7283b3b9266d0d computed=5e9e67d626f812d2b4c4d597f5fb6fe382049cdd
(134ms)
[ivy:resolve] 		[FAILED     ] com.sun.jersey#jersey-core;1.8!jersey-core.jar(bundle):  (0ms)
[ivy:resolve] 	==== local: tried
[ivy:resolve] 	  /home/jenkins/.ivy2/local/com.sun.jersey/jersey-core/1.8/bundles/jersey-core.jar
[ivy:resolve] 	==== apache-snapshot: tried
[ivy:resolve] 	  https://repository.apache.org/content/repositories/snapshots/com/sun/jersey/jersey-core/1.8/jersey-core-1.8.jar
[ivy:resolve] 	==== maven2: tried
[ivy:resolve] 	  http://repo1.maven.org/maven2/com/sun/jersey/jersey-core/1.8/jersey-core-1.8.jar
[ivy:resolve] 	==== datanucleus-repo: tried
[ivy:resolve] 	  http://www.datanucleus.org/downloads/maven2/com/sun/jersey/jersey-core/1.8/jersey-core-1.8.jar
[ivy:resolve] 	==== hadoop-source: tried
[ivy:resolve] 	  http://mirror.facebook.net/facebook/hive-deps/hadoop/core/jersey-core-1.8/jersey-core-1.8.jar
[ivy:resolve] 	==== hadoop-source2: tried
[ivy:resolve] 	  http://archive.cloudera.com/hive-deps/hadoop/core/jersey-core-1.8/jersey-core-1.8.jar
[ivy:resolve] 		[FAILED     ] tomcat#jasper-compiler;5.5.23!jasper-compiler.jar: invalid sha1:
expected=6d35bd7fb8c4fbc1f5401fb3678aa976d2e4c241 computed=bbddb22a95c7a6423d73fc66fef60622d79efd70
(132ms)
[ivy:resolve] 		[FAILED     ] tomcat#jasper-compiler;5.5.23!jasper-compiler.jar:  (0ms)
[ivy:resolve] 	==== local: tried
[ivy:resolve] 	  /home/jenkins/.ivy2/local/tomcat/jasper-compiler/5.5.23/jars/jasper-compiler.jar
[ivy:resolve] 	==== apache-snapshot: tried
[ivy:resolve] 	  https://repository.apache.org/content/repositories/snapshots/tomcat/jasper-compiler/5.5.23/jasper-compiler-5.5.23.jar
[ivy:resolve] 	==== maven2: tried
[ivy:resolve] 	  http://repo1.maven.org/maven2/tomcat/jasper-compiler/5.5.23/jasper-compiler-5.5.23.jar
[ivy:resolve] 	==== datanucleus-repo: tried
[ivy:resolve] 	  http://www.datanucleus.org/downloads/maven2/tomcat/jasper-compiler/5.5.23/jasper-compiler-5.5.23.jar
[ivy:resolve] 	==== hadoop-source: tried
[ivy:resolve] 	  http://mirror.facebook.net/facebook/hive-deps/hadoop/core/jasper-compiler-5.5.23/jasper-compiler-5.5.23.jar
[ivy:resolve] 	==== hadoop-source2: tried
[ivy:resolve] 	  http://archive.cloudera.com/hive-deps/hadoop/core/jasper-compiler-5.5.23/jasper-compiler-5.5.23.jar
[ivy:resolve] 		[FAILED     ] log4j#log4j;1.2.15!log4j.jar: invalid sha1: expected=f0a0d2e29ed910808c33135a3a5a51bba6358f7b
computed=a350c4c55d2188eed1815d7a7b6d5ba8deb55bc7 (332ms)
[ivy:resolve] 		[FAILED     ] log4j#log4j;1.2.15!log4j.jar:  (0ms)
[ivy:resolve] 	==== local: tried
[ivy:resolve] 	  /home/jenkins/.ivy2/local/log4j/log4j/1.2.15/jars/log4j.jar
[ivy:resolve] 	==== apache-snapshot: tried
[ivy:resolve] 	  https://repository.apache.org/content/repositories/snapshots/log4j/log4j/1.2.15/log4j-1.2.15.jar
[ivy:resolve] 	==== maven2: tried
[ivy:resolve] 	  http://repo1.maven.org/maven2/log4j/log4j/1.2.15/log4j-1.2.15.jar
[ivy:resolve] 	==== datanucleus-repo: tried
[ivy:resolve] 	  http://www.datanucleus.org/downloads/maven2/log4j/log4j/1.2.15/log4j-1.2.15.jar
[ivy:resolve] 	==== hadoop-source: tried
[ivy:resolve] 	  http://mirror.facebook.net/facebook/hive-deps/hadoop/core/log4j-1.2.15/log4j-1.2.15.jar
[ivy:resolve] 	==== hadoop-source2: tried
[ivy:resolve] 	  http://archive.cloudera.com/hive-deps/hadoop/core/log4j-1.2.15/log4j-1.2.15.jar
[ivy:resolve] 		[FAILED     ] org.apache.avro#avro;1.5.3!avro.jar: invalid sha1: expected=cf5fdd237bea5f20f0a8087d23a3f9decb5b99ae
computed=91dcda31d19a25a8ef1c538930890bfedcbffa8e (130ms)
[ivy:resolve] 		[FAILED     ] org.apache.avro#avro;1.5.3!avro.jar:  (0ms)
[ivy:resolve] 	==== local: tried
[ivy:resolve] 	  /home/jenkins/.ivy2/local/org.apache.avro/avro/1.5.3/jars/avro.jar
[ivy:resolve] 	==== apache-snapshot: tried
[ivy:resolve] 	  https://repository.apache.org/content/repositories/snapshots/org/apache/avro/avro/1.5.3/avro-1.5.3.jar
[ivy:resolve] 	==== maven2: tried
[ivy:resolve] 	  http://repo1.maven.org/maven2/org/apache/avro/avro/1.5.3/avro-1.5.3.jar
[ivy:resolve] 	==== datanucleus-repo: tried
[ivy:resolve] 	  http://www.datanucleus.org/downloads/maven2/org/apache/avro/avro/1.5.3/avro-1.5.3.jar
[ivy:resolve] 	==== hadoop-source: tried
[ivy:resolve] 	  http://mirror.facebook.net/facebook/hive-deps/hadoop/core/avro-1.5.3/avro-1.5.3.jar
[ivy:resolve] 	==== hadoop-source2: tried
[ivy:resolve] 	  http://archive.cloudera.com/hive-deps/hadoop/core/avro-1.5.3/avro-1.5.3.jar
[ivy:resolve] 		[FAILED     ] org.apache.avro#avro-ipc;1.5.3!avro-ipc.jar: invalid sha1: expected=6abd69834582ed8f2d5f3e2a3e69e03b6c9ee24a
computed=cfa4d2cd3536470c7545605e3a77ec1e96564e1c (193ms)
[ivy:resolve] 		[FAILED     ] org.apache.avro#avro-ipc;1.5.3!avro-ipc.jar:  (0ms)
[ivy:resolve] 	==== local: tried
[ivy:resolve] 	  /home/jenkins/.ivy2/local/org.apache.avro/avro-ipc/1.5.3/jars/avro-ipc.jar
[ivy:resolve] 	==== apache-snapshot: tried
[ivy:resolve] 	  https://repository.apache.org/content/repositories/snapshots/org/apache/avro/avro-ipc/1.5.3/avro-ipc-1.5.3.jar
[ivy:resolve] 	==== maven2: tried
[ivy:resolve] 	  http://repo1.maven.org/maven2/org/apache/avro/avro-ipc/1.5.3/avro-ipc-1.5.3.jar
[ivy:resolve] 	==== datanucleus-repo: tried
[ivy:resolve] 	  http://www.datanucleus.org/downloads/maven2/org/apache/avro/avro-ipc/1.5.3/avro-ipc-1.5.3.jar
[ivy:resolve] 	==== hadoop-source: tried
[ivy:resolve] 	  http://mirror.facebook.net/facebook/hive-deps/hadoop/core/avro-ipc-1.5.3/avro-ipc-1.5.3.jar
[ivy:resolve] 	==== hadoop-source2: tried
[ivy:resolve] 	  http://archive.cloudera.com/hive-deps/hadoop/core/avro-ipc-1.5.3/avro-ipc-1.5.3.jar
[ivy:resolve] 		[FAILED     ] jdiff#jdiff;1.0.9!jdiff.jar: /home/jenkins/.ivy2/cache/jdiff/jdiff/jars/jdiff-1.0.9.jar.part
(No such file or directory) (271ms)
[ivy:resolve] 		[FAILED     ] com.sun.xml.bind#jaxb-impl;2.2.3-1!jaxb-impl.jar: invalid sha1:
expected=56baae106392040a45a06d4a41099173425da1e6 computed=97e725334e0bfc8b0eeed5b49b2233b6fa54acb3
(240ms)
[ivy:resolve] 		[FAILED     ] com.sun.xml.bind#jaxb-impl;2.2.3-1!jaxb-impl.jar:  (0ms)
[ivy:resolve] 	==== local: tried
[ivy:resolve] 	  /home/jenkins/.ivy2/local/com.sun.xml.bind/jaxb-impl/2.2.3-1/jars/jaxb-impl.jar
[ivy:resolve] 	==== apache-snapshot: tried
[ivy:resolve] 	  https://repository.apache.org/content/repositories/snapshots/com/sun/xml/bind/jaxb-impl/2.2.3-1/jaxb-impl-2.2.3-1.jar
[ivy:resolve] 	==== maven2: tried
[ivy:resolve] 	  http://repo1.maven.org/maven2/com/sun/xml/bind/jaxb-impl/2.2.3-1/jaxb-impl-2.2.3-1.jar
[ivy:resolve] 	==== datanucleus-repo: tried
[ivy:resolve] 	  http://www.datanucleus.org/downloads/maven2/com/sun/xml/bind/jaxb-impl/2.2.3-1/jaxb-impl-2.2.3-1.jar
[ivy:resolve] 	==== hadoop-source: tried
[ivy:resolve] 	  http://mirror.facebook.net/facebook/hive-deps/hadoop/core/jaxb-impl-2.2.3-1/jaxb-impl-2.2.3-1.jar
[ivy:resolve] 	==== hadoop-source2: tried
[ivy:resolve] 	  http://archive.cloudera.com/hive-deps/hadoop/core/jaxb-impl-2.2.3-1/jaxb-impl-2.2.3-1.jar
[ivy:resolve] 		[FAILED     ] org.jboss.netty#netty;3.2.4.Final!netty.jar(bundle): invalid
sha1: expected=d0112ab5206185ca5701f88d25c84927bf53dde1 computed=cc4a46d51fb68520936918d48a0d2cec0b9b00ee
(160ms)
[ivy:resolve] 		[FAILED     ] org.jboss.netty#netty;3.2.4.Final!netty.jar(bundle):  (0ms)
[ivy:resolve] 	==== local: tried
[ivy:resolve] 	  /home/jenkins/.ivy2/local/org.jboss.netty/netty/3.2.4.Final/bundles/netty.jar
[ivy:resolve] 	==== apache-snapshot: tried
[ivy:resolve] 	  https://repository.apache.org/content/repositories/snapshots/org/jboss/netty/netty/3.2.4.Final/netty-3.2.4.Final.jar
[ivy:resolve] 	==== maven2: tried
[ivy:resolve] 	  http://repo1.maven.org/maven2/org/jboss/netty/netty/3.2.4.Final/netty-3.2.4.Final.jar
[ivy:resolve] 	==== datanucleus-repo: tried
[ivy:resolve] 	  http://www.datanucleus.org/downloads/maven2/org/jboss/netty/netty/3.2.4.Final/netty-3.2.4.Final.jar
[ivy:resolve] 	==== hadoop-source: tried
[ivy:resolve] 	  http://mirror.facebook.net/facebook/hive-deps/hadoop/core/netty-3.2.4.Final/netty-3.2.4.Final.jar
[ivy:resolve] 	==== hadoop-source2: tried
[ivy:resolve] 	  http://archive.cloudera.com/hive-deps/hadoop/core/netty-3.2.4.Final/netty-3.2.4.Final.jar
[ivy:resolve] 		[FAILED     ] org.apache.hadoop#hadoop-yarn-common;0.23.3!hadoop-yarn-common.jar:
invalid sha1: expected=66a04e21871c8df56efb7b1e73415c7f168d75f3 computed=3925d425b9c7b36b3bbb319d283cf6f5a25ba9b0
(297ms)
[ivy:resolve] 		[FAILED     ] org.apache.hadoop#hadoop-yarn-common;0.23.3!hadoop-yarn-common.jar:
 (0ms)
[ivy:resolve] 	==== local: tried
[ivy:resolve] 	  /home/jenkins/.ivy2/local/org.apache.hadoop/hadoop-yarn-common/0.23.3/jars/hadoop-yarn-common.jar
[ivy:resolve] 	==== apache-snapshot: tried
[ivy:resolve] 	  https://repository.apache.org/content/repositories/snapshots/org/apache/hadoop/hadoop-yarn-common/0.23.3/hadoop-yarn-common-0.23.3.jar
[ivy:resolve] 	==== maven2: tried
[ivy:resolve] 	  http://repo1.maven.org/maven2/org/apache/hadoop/hadoop-yarn-common/0.23.3/hadoop-yarn-common-0.23.3.jar
[ivy:resolve] 	==== datanucleus-repo: tried
[ivy:resolve] 	  http://www.datanucleus.org/downloads/maven2/org/apache/hadoop/hadoop-yarn-common/0.23.3/hadoop-yarn-common-0.23.3.jar
[ivy:resolve] 	==== hadoop-source: tried
[ivy:resolve] 	  http://mirror.facebook.net/facebook/hive-deps/hadoop/core/hadoop-yarn-common-0.23.3/hadoop-yarn-common-0.23.3.jar
[ivy:resolve] 	==== hadoop-source2: tried
[ivy:resolve] 	  http://archive.cloudera.com/hive-deps/hadoop/core/hadoop-yarn-common-0.23.3/hadoop-yarn-common-0.23.3.jar
[ivy:resolve] 		[FAILED     ] com.google.inject.extensions#guice-servlet;3.0!guice-servlet.jar:
/home/jenkins/.ivy2/cache/com.google.inject.extensions/guice-servlet/jars/guice-servlet-3.0.jar.part
(No such file or directory) (305ms)
[ivy:resolve] 		[FAILED     ] org.apache.hadoop#hadoop-yarn-api;0.23.3!hadoop-yarn-api.jar:
Downloaded file size doesn't match expected Content Length for http://repo1.maven.org/maven2/org/apache/hadoop/hadoop-yarn-api/0.23.3/hadoop-yarn-api-0.23.3.jar.
Please retry. (635ms)
[ivy:resolve] 		[FAILED     ] com.google.inject#guice;3.0!guice.jar: Downloaded file size
doesn't match expected Content Length for http://repo1.maven.org/maven2/com/google/inject/guice/3.0/guice-3.0.jar.
Please retry. (179ms)
[ivy:resolve] 		[FAILED     ] com.google.inject#guice;3.0!guice.jar:  (0ms)
[ivy:resolve] 	==== local: tried
[ivy:resolve] 	  /home/jenkins/.ivy2/local/com.google.inject/guice/3.0/jars/guice.jar
[ivy:resolve] 	==== apache-snapshot: tried
[ivy:resolve] 	  https://repository.apache.org/content/repositories/snapshots/com/google/inject/guice/3.0/guice-3.0.jar
[ivy:resolve] 	==== maven2: tried
[ivy:resolve] 	  http://repo1.maven.org/maven2/com/google/inject/guice/3.0/guice-3.0.jar
[ivy:resolve] 	==== datanucleus-repo: tried
[ivy:resolve] 	  http://www.datanucleus.org/downloads/maven2/com/google/inject/guice/3.0/guice-3.0.jar
[ivy:resolve] 	==== hadoop-source: tried
[ivy:resolve] 	  http://mirror.facebook.net/facebook/hive-deps/hadoop/core/guice-3.0/guice-3.0.jar
[ivy:resolve] 	==== hadoop-source2: tried
[ivy:resolve] 	  http://archive.cloudera.com/hive-deps/hadoop/core/guice-3.0/guice-3.0.jar
[ivy:resolve] 		[FAILED     ] com.sun.jersey.jersey-test-framework#jersey-test-framework-grizzly2;1.8!jersey-test-framework-grizzly2.jar:
Downloaded file size doesn't match expected Content Length for http://repo1.maven.org/maven2/com/sun/jersey/jersey-test-framework/jersey-test-framework-grizzly2/1.8/jersey-test-framework-grizzly2-1.8.jar.
Please retry. (26ms)
[ivy:resolve] 		[FAILED     ] com.sun.jersey.jersey-test-framework#jersey-test-framework-grizzly2;1.8!jersey-test-framework-grizzly2.jar:
 (0ms)
[ivy:resolve] 	==== local: tried
[ivy:resolve] 	  /home/jenkins/.ivy2/local/com.sun.jersey.jersey-test-framework/jersey-test-framework-grizzly2/1.8/jars/jersey-test-framework-grizzly2.jar
[ivy:resolve] 	==== apache-snapshot: tried
[ivy:resolve] 	  https://repository.apache.org/content/repositories/snapshots/com/sun/jersey/jersey-test-framework/jersey-test-framework-grizzly2/1.8/jersey-test-framework-grizzly2-1.8.jar
[ivy:resolve] 	==== maven2: tried
[ivy:resolve] 	  http://repo1.maven.org/maven2/com/sun/jersey/jersey-test-framework/jersey-test-framework-grizzly2/1.8/jersey-test-framework-grizzly2-1.8.jar
[ivy:resolve] 	==== datanucleus-repo: tried
[ivy:resolve] 	  http://www.datanucleus.org/downloads/maven2/com/sun/jersey/jersey-test-framework/jersey-test-framework-grizzly2/1.8/jersey-test-framework-grizzly2-1.8.jar
[ivy:resolve] 	==== hadoop-source: tried
[ivy:resolve] 	  http://mirror.facebook.net/facebook/hive-deps/hadoop/core/jersey-test-framework-grizzly2-1.8/jersey-test-framework-grizzly2-1.8.jar
[ivy:resolve] 	==== hadoop-source2: tried
[ivy:resolve] 	  http://archive.cloudera.com/hive-deps/hadoop/core/jersey-test-framework-grizzly2-1.8/jersey-test-framework-grizzly2-1.8.jar
[ivy:resolve] 		[FAILED     ] com.sun.jersey.contribs#jersey-guice;1.8!jersey-guice.jar: /home/jenkins/.ivy2/cache/com.sun.jersey.contribs/jersey-guice/jars/jersey-guice-1.8.jar.part
(No such file or directory) (280ms)
[ivy:resolve] 		[FAILED     ] aopalliance#aopalliance;1.0!aopalliance.jar: /home/jenkins/.ivy2/cache/aopalliance/aopalliance/jars/aopalliance-1.0.jar.part
(No such file or directory) (105ms)
[ivy:resolve] 		[FAILED     ] org.sonatype.sisu.inject#cglib;2.2.1-v20090111!cglib.jar: Downloaded
file size doesn't match expected Content Length for http://repo1.maven.org/maven2/org/sonatype/sisu/inject/cglib/2.2.1-v20090111/cglib-2.2.1-v20090111.jar.
Please retry. (175ms)
[ivy:resolve] 		::::::::::::::::::::::::::::::::::::::::::::::
[ivy:resolve] 		::          UNRESOLVED DEPENDENCIES         ::
[ivy:resolve] 		::::::::::::::::::::::::::::::::::::::::::::::
[ivy:resolve] 		:: org.apache.zookeeper#zookeeper;3.4.2: not found
[ivy:resolve] 		::::::::::::::::::::::::::::::::::::::::::::::
[ivy:resolve] 		::::::::::::::::::::::::::::::::::::::::::::::
[ivy:resolve] 		::              FAILED DOWNLOADS            ::
[ivy:resolve] 		:: ^ see resolution messages for details  ^ ::
[ivy:resolve] 		::::::::::::::::::::::::::::::::::::::::::::::
[ivy:resolve] 		:: com.sun.jersey#jersey-core;1.8!jersey-core.jar(bundle)
[ivy:resolve] 		:: com.sun.xml.bind#jaxb-impl;2.2.3-1!jaxb-impl.jar
[ivy:resolve] 		:: tomcat#jasper-compiler;5.5.23!jasper-compiler.jar
[ivy:resolve] 		:: log4j#log4j;1.2.15!log4j.jar
[ivy:resolve] 		:: org.apache.avro#avro;1.5.3!avro.jar
[ivy:resolve] 		:: org.apache.avro#avro-ipc;1.5.3!avro-ipc.jar
[ivy:resolve] 		:: org.jboss.netty#netty;3.2.4.Final!netty.jar(bundle)
[ivy:resolve] 		:: org.apache.hadoop#hadoop-yarn-common;0.23.3!hadoop-yarn-common.jar
[ivy:resolve] 		:: com.google.inject#guice;3.0!guice.jar
[ivy:resolve] 		:: com.sun.jersey.jersey-test-framework#jersey-test-framework-grizzly2;1.8!jersey-test-framework-grizzly2.jar
[ivy:resolve] 		::::::::::::::::::::::::::::::::::::::::::::::
[ivy:resolve] 
[ivy:resolve] :: USE VERBOSE OR DEBUG MESSAGE LEVEL FOR MORE DETAILS

BUILD FAILED
/x1/jenkins/jenkins-slave/workspace/Hive-0.9.1-SNAPSHOT-h0.21-keepgoing=false/hive/build.xml:302:
The following error occurred while executing this line:
/x1/jenkins/jenkins-slave/workspace/Hive-0.9.1-SNAPSHOT-h0.21-keepgoing=false/hive/build.xml:152:
The following error occurred while executing this line:
/x1/jenkins/jenkins-slave/workspace/Hive-0.9.1-SNAPSHOT-h0.21-keepgoing=false/hive/shims/build.xml:90:
The following error occurred while executing this line:
/x1/jenkins/jenkins-slave/workspace/Hive-0.9.1-SNAPSHOT-h0.21-keepgoing=false/hive/shims/build.xml:93:
The following error occurred while executing this line:
/x1/jenkins/jenkins-slave/workspace/Hive-0.9.1-SNAPSHOT-h0.21-keepgoing=false/hive/shims/build.xml:65:
The following error occurred while executing this line:
/x1/jenkins/jenkins-slave/workspace/Hive-0.9.1-SNAPSHOT-h0.21-keepgoing=false/hive/build-common.xml:171:
impossible to resolve dependencies:
	resolve failed - see output for details

Total time: 2 minutes 38 seconds
Build step 'Invoke Ant' marked build as failure
Archiving artifacts
Recording test results

Mime
View raw message