hive-dev mailing list archives

Site index · List index
Message view « Date » · « Thread »
Top « Date » · « Thread »
From Apache Jenkins Server <jenk...@builds.apache.org>
Subject Build failed in Jenkins: Hive-0.9.1-SNAPSHOT-h0.21 #186
Date Fri, 02 Nov 2012 16:02:46 GMT
See <https://builds.apache.org/job/Hive-0.9.1-SNAPSHOT-h0.21/186/>

------------------------------------------
[...truncated 5462 lines...]
create-dirs:
     [echo] Project: pdk
    [mkdir] Created dir: <https://builds.apache.org/job/Hive-0.9.1-SNAPSHOT-h0.21/186/artifact/hive/build/pdk>
    [mkdir] Created dir: <https://builds.apache.org/job/Hive-0.9.1-SNAPSHOT-h0.21/186/artifact/hive/build/pdk/classes>
    [mkdir] Created dir: <https://builds.apache.org/job/Hive-0.9.1-SNAPSHOT-h0.21/186/artifact/hive/build/pdk/test>
    [mkdir] Created dir: <https://builds.apache.org/job/Hive-0.9.1-SNAPSHOT-h0.21/186/artifact/hive/build/pdk/test/src>
    [mkdir] Created dir: <https://builds.apache.org/job/Hive-0.9.1-SNAPSHOT-h0.21/186/artifact/hive/build/pdk/test/classes>
    [mkdir] Created dir: <https://builds.apache.org/job/Hive-0.9.1-SNAPSHOT-h0.21/186/artifact/hive/build/pdk/test/resources>
     [copy] Warning: <https://builds.apache.org/job/Hive-0.9.1-SNAPSHOT-h0.21/ws/hive/pdk/src/test/resources>
does not exist.

init:
     [echo] Project: pdk

create-dirs:
     [echo] Project: builtins
    [mkdir] Created dir: <https://builds.apache.org/job/Hive-0.9.1-SNAPSHOT-h0.21/186/artifact/hive/build/builtins>
    [mkdir] Created dir: <https://builds.apache.org/job/Hive-0.9.1-SNAPSHOT-h0.21/186/artifact/hive/build/builtins/classes>
    [mkdir] Created dir: <https://builds.apache.org/job/Hive-0.9.1-SNAPSHOT-h0.21/186/artifact/hive/build/builtins/test>
    [mkdir] Created dir: <https://builds.apache.org/job/Hive-0.9.1-SNAPSHOT-h0.21/186/artifact/hive/build/builtins/test/src>
    [mkdir] Created dir: <https://builds.apache.org/job/Hive-0.9.1-SNAPSHOT-h0.21/186/artifact/hive/build/builtins/test/classes>
    [mkdir] Created dir: <https://builds.apache.org/job/Hive-0.9.1-SNAPSHOT-h0.21/186/artifact/hive/build/builtins/test/resources>
     [copy] Warning: <https://builds.apache.org/job/Hive-0.9.1-SNAPSHOT-h0.21/ws/hive/builtins/src/test/resources>
does not exist.

init:
     [echo] Project: builtins

jar:
     [echo] Project: hive

create-dirs:
     [echo] Project: shims
     [copy] Warning: <https://builds.apache.org/job/Hive-0.9.1-SNAPSHOT-h0.21/ws/hive/shims/src/test/resources>
does not exist.

init:
     [echo] Project: shims

ivy-init-settings:
     [echo] Project: shims

ivy-resolve:
     [echo] Project: shims
[ivy:resolve] :: loading settings :: file = <https://builds.apache.org/job/Hive-0.9.1-SNAPSHOT-h0.21/ws/hive/ivy/ivysettings.xml>
[ivy:resolve] downloading http://repo1.maven.org/maven2/org/apache/zookeeper/zookeeper/3.4.3/zookeeper-3.4.3.jar
...
[ivy:resolve] .........................................................................................................................................
(749kB)
[ivy:resolve] .. (0kB)
[ivy:resolve] 	[SUCCESSFUL ] org.apache.zookeeper#zookeeper;3.4.3!zookeeper.jar (33ms)
[ivy:resolve] downloading http://repo1.maven.org/maven2/org/apache/thrift/libthrift/0.7.0/libthrift-0.7.0.jar
...
[ivy:resolve] ................................................... (294kB)
[ivy:resolve] .. (0kB)
[ivy:resolve] 	[SUCCESSFUL ] org.apache.thrift#libthrift;0.7.0!libthrift.jar (24ms)
[ivy:resolve] downloading http://repo1.maven.org/maven2/commons-logging/commons-logging/1.0.4/commons-logging-1.0.4.jar
...
[ivy:resolve] ..... (37kB)
[ivy:resolve] .. (0kB)
[ivy:resolve] 	[SUCCESSFUL ] commons-logging#commons-logging;1.0.4!commons-logging.jar (14ms)
[ivy:resolve] downloading http://repo1.maven.org/maven2/commons-logging/commons-logging-api/1.0.4/commons-logging-api-1.0.4.jar
...
[ivy:resolve] ..... (25kB)
[ivy:resolve] .. (0kB)
[ivy:resolve] 	[SUCCESSFUL ] commons-logging#commons-logging-api;1.0.4!commons-logging-api.jar
(11ms)
[ivy:resolve] downloading http://repo1.maven.org/maven2/com/google/guava/guava/r09/guava-r09.jar
...
[ivy:resolve] ...............................................................................................................................................................
(1117kB)
[ivy:resolve] .. (0kB)
[ivy:resolve] 	[SUCCESSFUL ] com.google.guava#guava;r09!guava.jar (36ms)
[ivy:resolve] downloading http://repo1.maven.org/maven2/org/codehaus/jackson/jackson-core-asl/1.8.8/jackson-core-asl-1.8.8.jar
...
[ivy:resolve] ............................................ (222kB)
[ivy:resolve] .. (0kB)
[ivy:resolve] 	[SUCCESSFUL ] org.codehaus.jackson#jackson-core-asl;1.8.8!jackson-core-asl.jar
(17ms)
[ivy:resolve] downloading http://repo1.maven.org/maven2/org/codehaus/jackson/jackson-mapper-asl/1.8.8/jackson-mapper-asl-1.8.8.jar
...
[ivy:resolve] ...........................................................................................................
(652kB)
[ivy:resolve] .. (0kB)
[ivy:resolve] 	[SUCCESSFUL ] org.codehaus.jackson#jackson-mapper-asl;1.8.8!jackson-mapper-asl.jar
(32ms)
[ivy:resolve] 
[ivy:resolve] :: problems summary ::
[ivy:resolve] :::: WARNINGS
[ivy:resolve] 	impossible to put metadata file in cache: http://repo1.maven.org/maven2/commons-logging/commons-logging-api/1.0.4/commons-logging-api-1.0.4.pom
(1.0.4). java.io.FileNotFoundException: /home/jenkins/.ivy2/cache/commons-logging/commons-logging-api/ivy-1.0.4.xml.original
(No such file or directory)
[ivy:resolve] 
[ivy:resolve] :: USE VERBOSE OR DEBUG MESSAGE LEVEL FOR MORE DETAILS
[ivy:report] Processing <https://builds.apache.org/job/Hive-0.9.1-SNAPSHOT-h0.21/186/artifact/hive/build/ivy/resolution-cache/org.apache.hive-hive-shims-default.xml>
to <https://builds.apache.org/job/Hive-0.9.1-SNAPSHOT-h0.21/186/artifact/hive/build/ivy/report/org.apache.hive-hive-shims-default.html>

ivy-retrieve:
     [echo] Project: shims

compile:
     [echo] Project: shims
     [echo] Building shims 0.20

build_shims:
     [echo] Project: shims
     [echo] Compiling <https://builds.apache.org/job/Hive-0.9.1-SNAPSHOT-h0.21/ws/hive/shims/src/common/java;/home/jenkins/jenkins-slave/workspace/Hive-0.9.1-SNAPSHOT-h0.21/hive/shims/src/0.20/java>
against hadoop 0.20.2 (<https://builds.apache.org/job/Hive-0.9.1-SNAPSHOT-h0.21/186/artifact/hive/build/hadoopcore/hadoop-0.20.2)>

ivy-init-settings:
     [echo] Project: shims

ivy-resolve-hadoop-shim:
     [echo] Project: shims
[ivy:resolve] :: loading settings :: file = <https://builds.apache.org/job/Hive-0.9.1-SNAPSHOT-h0.21/ws/hive/ivy/ivysettings.xml>
[ivy:resolve] downloading http://repo1.maven.org/maven2/org/apache/hadoop/hadoop-core/0.20.2/hadoop-core-0.20.2.jar
...
[ivy:resolve] .............................................................................................................................................................................................................................................................................................................................................................................................................................................................................................................................................................................................
(2624kB)
[ivy:resolve] .. (0kB)
[ivy:resolve] 	[SUCCESSFUL ] org.apache.hadoop#hadoop-core;0.20.2!hadoop-core.jar (269ms)
[ivy:resolve] downloading http://repo1.maven.org/maven2/org/apache/hadoop/hadoop-tools/0.20.2/hadoop-tools-0.20.2.jar
...
[ivy:resolve] ............... (68kB)
[ivy:resolve] .. (0kB)
[ivy:resolve] downloading http://repo1.maven.org/maven2/org/apache/hadoop/hadoop-test/0.20.2/hadoop-test-0.20.2.jar
...
[ivy:resolve] ......................................................................................................................................................................................................................................................................................................................................................................................................................
(1527kB)
[ivy:resolve] .. (0kB)
[ivy:resolve] 	[SUCCESSFUL ] org.apache.hadoop#hadoop-test;0.20.2!hadoop-test.jar (188ms)
[ivy:resolve] downloading http://repo1.maven.org/maven2/commons-cli/commons-cli/1.2/commons-cli-1.2.jar
...
[ivy:resolve] ........ (40kB)
[ivy:resolve] .. (0kB)
[ivy:resolve] 	[SUCCESSFUL ] commons-cli#commons-cli;1.2!commons-cli.jar (11ms)
[ivy:resolve] downloading http://repo1.maven.org/maven2/xmlenc/xmlenc/0.52/xmlenc-0.52.jar
...
[ivy:resolve] .. (14kB)
[ivy:resolve] .. (0kB)
[ivy:resolve] 	[SUCCESSFUL ] xmlenc#xmlenc;0.52!xmlenc.jar (22ms)
[ivy:resolve] downloading http://repo1.maven.org/maven2/commons-httpclient/commons-httpclient/3.0.1/commons-httpclient-3.0.1.jar
...
[ivy:resolve] ................................................ (273kB)
[ivy:resolve] .. (0kB)
[ivy:resolve] 	[SUCCESSFUL ] commons-httpclient#commons-httpclient;3.0.1!commons-httpclient.jar
(30ms)
[ivy:resolve] downloading http://repo1.maven.org/maven2/commons-codec/commons-codec/1.3/commons-codec-1.3.jar
...
[ivy:resolve] ......... (45kB)
[ivy:resolve] .. (0kB)
[ivy:resolve] 	[SUCCESSFUL ] commons-codec#commons-codec;1.3!commons-codec.jar (16ms)
[ivy:resolve] downloading http://repo1.maven.org/maven2/commons-net/commons-net/1.4.1/commons-net-1.4.1.jar
...
[ivy:resolve] ............................ (176kB)
[ivy:resolve] .. (0kB)
[ivy:resolve] 	[SUCCESSFUL ] commons-net#commons-net;1.4.1!commons-net.jar (17ms)
[ivy:resolve] downloading http://repo1.maven.org/maven2/org/mortbay/jetty/jetty/6.1.14/jetty-6.1.14.jar
...
[ivy:resolve] .............................................................................
(504kB)
[ivy:resolve] .. (0kB)
[ivy:resolve] 	[SUCCESSFUL ] org.mortbay.jetty#jetty;6.1.14!jetty.jar (43ms)
[ivy:resolve] downloading http://repo1.maven.org/maven2/org/mortbay/jetty/jetty-util/6.1.14/jetty-util-6.1.14.jar
...
[ivy:resolve] ......................................... (159kB)
[ivy:resolve] .. (0kB)
[ivy:resolve] 	[SUCCESSFUL ] org.mortbay.jetty#jetty-util;6.1.14!jetty-util.jar (27ms)
[ivy:resolve] downloading http://repo1.maven.org/maven2/tomcat/jasper-runtime/5.5.12/jasper-runtime-5.5.12.jar
...
[ivy:resolve] ............ (74kB)
[ivy:resolve] .. (0kB)
[ivy:resolve] 	[SUCCESSFUL ] tomcat#jasper-runtime;5.5.12!jasper-runtime.jar (12ms)
[ivy:resolve] downloading http://repo1.maven.org/maven2/tomcat/jasper-compiler/5.5.12/jasper-compiler-5.5.12.jar
...
[ivy:resolve] ................................................................. (395kB)
[ivy:resolve] .. (0kB)
[ivy:resolve] downloading http://repo1.maven.org/maven2/org/mortbay/jetty/jsp-api-2.1/6.1.14/jsp-api-2.1-6.1.14.jar
...
[ivy:resolve] ............................ (131kB)
[ivy:resolve] .. (0kB)
[ivy:resolve] 	[SUCCESSFUL ] org.mortbay.jetty#jsp-api-2.1;6.1.14!jsp-api-2.1.jar (22ms)
[ivy:resolve] downloading http://repo1.maven.org/maven2/org/mortbay/jetty/jsp-2.1/6.1.14/jsp-2.1-6.1.14.jar
...
[ivy:resolve] ..................................................................................................................................................................................................................
(1000kB)
[ivy:resolve] .. (0kB)
[ivy:resolve] 	[SUCCESSFUL ] org.mortbay.jetty#jsp-2.1;6.1.14!jsp-2.1.jar (36ms)
[ivy:resolve] downloading http://repo1.maven.org/maven2/commons-el/commons-el/1.0/commons-el-1.0.jar
...
[ivy:resolve] ...................... (109kB)
[ivy:resolve] .. (0kB)
[ivy:resolve] 	[SUCCESSFUL ] commons-el#commons-el;1.0!commons-el.jar (13ms)
[ivy:resolve] downloading http://repo1.maven.org/maven2/net/java/dev/jets3t/jets3t/0.7.1/jets3t-0.7.1.jar
...
[ivy:resolve] .................................................................. (368kB)
[ivy:resolve] .. (0kB)
[ivy:resolve] 	[SUCCESSFUL ] net.java.dev.jets3t#jets3t;0.7.1!jets3t.jar (156ms)
[ivy:resolve] downloading http://repo1.maven.org/maven2/org/mortbay/jetty/servlet-api-2.5/6.1.14/servlet-api-2.5-6.1.14.jar
...
[ivy:resolve] ................... (129kB)
[ivy:resolve] .. (0kB)
[ivy:resolve] 	[SUCCESSFUL ] org.mortbay.jetty#servlet-api-2.5;6.1.14!servlet-api-2.5.jar
(15ms)
[ivy:resolve] downloading http://repo1.maven.org/maven2/net/sf/kosmosfs/kfs/0.3/kfs-0.3.jar
...
[ivy:resolve] .. (11kB)
[ivy:resolve] .. (0kB)
[ivy:resolve] 	[SUCCESSFUL ] net.sf.kosmosfs#kfs;0.3!kfs.jar (41ms)
[ivy:resolve] downloading http://repo1.maven.org/maven2/junit/junit/4.5/junit-4.5.jar ...
[ivy:resolve] ..................................................... (194kB)
[ivy:resolve] .. (0kB)
[ivy:resolve] 	[SUCCESSFUL ] junit#junit;4.5!junit.jar (31ms)
[ivy:resolve] downloading http://repo1.maven.org/maven2/hsqldb/hsqldb/1.8.0.10/hsqldb-1.8.0.10.jar
...
[ivy:resolve] ..................................................................................................................................................................................
(690kB)
[ivy:resolve] .. (0kB)
[ivy:resolve] downloading http://repo1.maven.org/maven2/oro/oro/2.0.8/oro-2.0.8.jar ...
[ivy:resolve] .................. (63kB)
[ivy:resolve] .. (0kB)
[ivy:resolve] 	[SUCCESSFUL ] oro#oro;2.0.8!oro.jar (13ms)
[ivy:resolve] downloading http://repo1.maven.org/maven2/org/eclipse/jdt/core/3.1.1/core-3.1.1.jar
...
[ivy:resolve] .............................................................................................................................................................................................................................................................................................................................................................................................................................................................................................................................................................................................................................................................................................................................................................
(3483kB)
[ivy:resolve] .. (0kB)
[ivy:resolve] downloading http://repo1.maven.org/maven2/ant/ant/1.6.5/ant-1.6.5.jar ...
[ivy:resolve] ..........................................................................................................................................................................................................................................................
(1009kB)
[ivy:resolve] .. (0kB)
[ivy:resolve] downloading http://repo1.maven.org/maven2/org/apache/ftpserver/ftplet-api/1.0.0/ftplet-api-1.0.0.jar
...
[ivy:resolve] ... (22kB)
[ivy:resolve] .. (0kB)
[ivy:resolve] 	[SUCCESSFUL ] org.apache.ftpserver#ftplet-api;1.0.0!ftplet-api.jar(bundle)
(11ms)
[ivy:resolve] downloading http://repo1.maven.org/maven2/org/apache/mina/mina-core/2.0.0-M5/mina-core-2.0.0-M5.jar
...
[ivy:resolve] .............................................................................................................................................................................
(622kB)
[ivy:resolve] .. (0kB)
[ivy:resolve] 	[SUCCESSFUL ] org.apache.mina#mina-core;2.0.0-M5!mina-core.jar(bundle) (40ms)
[ivy:resolve] downloading http://repo1.maven.org/maven2/org/apache/ftpserver/ftpserver-core/1.0.0/ftpserver-core-1.0.0.jar
...
[ivy:resolve] ...................................................... (264kB)
[ivy:resolve] .. (0kB)
[ivy:resolve] 	[SUCCESSFUL ] org.apache.ftpserver#ftpserver-core;1.0.0!ftpserver-core.jar(bundle)
(100ms)
[ivy:resolve] downloading http://repo1.maven.org/maven2/org/slf4j/slf4j-api/1.5.2/slf4j-api-1.5.2.jar
...
[ivy:resolve] ..... (16kB)
[ivy:resolve] .. (0kB)
[ivy:resolve] 
[ivy:resolve] :: problems summary ::
[ivy:resolve] :::: WARNINGS
[ivy:resolve] 	problem while downloading module descriptor: http://repo1.maven.org/maven2/commons-logging/commons-logging/1.1.1/commons-logging-1.1.1.pom:
/home/jenkins/.ivy2/cache/commons-logging/commons-logging/ivy-1.1.1.xml.original.part (No
such file or directory) (11ms)
[ivy:resolve] 		module not found: commons-logging#commons-logging;1.1.1
[ivy:resolve] 	==== local: tried
[ivy:resolve] 	  /home/jenkins/.ivy2/local/commons-logging/commons-logging/1.1.1/ivys/ivy.xml
[ivy:resolve] 	  -- artifact commons-logging#commons-logging;1.1.1!commons-logging.jar:
[ivy:resolve] 	  /home/jenkins/.ivy2/local/commons-logging/commons-logging/1.1.1/jars/commons-logging.jar
[ivy:resolve] 	==== apache-snapshot: tried
[ivy:resolve] 	  https://repository.apache.org/content/repositories/snapshots/commons-logging/commons-logging/1.1.1/commons-logging-1.1.1.pom
[ivy:resolve] 	  -- artifact commons-logging#commons-logging;1.1.1!commons-logging.jar:
[ivy:resolve] 	  https://repository.apache.org/content/repositories/snapshots/commons-logging/commons-logging/1.1.1/commons-logging-1.1.1.jar
[ivy:resolve] 	==== maven2: tried
[ivy:resolve] 	  http://repo1.maven.org/maven2/commons-logging/commons-logging/1.1.1/commons-logging-1.1.1.pom
[ivy:resolve] 	==== datanucleus-repo: tried
[ivy:resolve] 	  -- artifact commons-logging#commons-logging;1.1.1!commons-logging.jar:
[ivy:resolve] 	  http://www.datanucleus.org/downloads/maven2/commons-logging/commons-logging/1.1.1/commons-logging-1.1.1.jar
[ivy:resolve] 	==== hadoop-source: tried
[ivy:resolve] 	  -- artifact commons-logging#commons-logging;1.1.1!commons-logging.jar:
[ivy:resolve] 	  http://mirror.facebook.net/facebook/hive-deps/hadoop/core/commons-logging-1.1.1/commons-logging-1.1.1.jar
[ivy:resolve] 	==== hadoop-source2: tried
[ivy:resolve] 	  -- artifact commons-logging#commons-logging;1.1.1!commons-logging.jar:
[ivy:resolve] 	  http://archive.cloudera.com/hive-deps/hadoop/core/commons-logging-1.1.1/commons-logging-1.1.1.jar
[ivy:resolve] 	impossible to put metadata file in cache: http://repo1.maven.org/maven2/org/apache/ftpserver/ftpserver-deprecated/1.0.0-M2/ftpserver-deprecated-1.0.0-M2.pom
(1.0.0-M2). java.io.FileNotFoundException: /home/jenkins/.ivy2/cache/org.apache.ftpserver/ftpserver-deprecated/ivy-1.0.0-M2.xml.original
(No such file or directory)
[ivy:resolve] 		[FAILED     ] org.apache.hadoop#hadoop-tools;0.20.2!hadoop-tools.jar: impossible
to move part file to definitive one: /home/jenkins/.ivy2/cache/org.apache.hadoop/hadoop-tools/jars/hadoop-tools-0.20.2.jar.part
-> /home/jenkins/.ivy2/cache/org.apache.hadoop/hadoop-tools/jars/hadoop-tools-0.20.2.jar
(4129ms)
[ivy:resolve] 		[FAILED     ] tomcat#jasper-compiler;5.5.12!jasper-compiler.jar: impossible
to move part file to definitive one: /home/jenkins/.ivy2/cache/tomcat/jasper-compiler/jars/jasper-compiler-5.5.12.jar.part
-> /home/jenkins/.ivy2/cache/tomcat/jasper-compiler/jars/jasper-compiler-5.5.12.jar (51ms)
[ivy:resolve] 		[FAILED     ] hsqldb#hsqldb;1.8.0.10!hsqldb.jar: impossible to move part file
to definitive one: /home/jenkins/.ivy2/cache/hsqldb/hsqldb/jars/hsqldb-1.8.0.10.jar.part ->
/home/jenkins/.ivy2/cache/hsqldb/hsqldb/jars/hsqldb-1.8.0.10.jar (34ms)
[ivy:resolve] 		[FAILED     ] org.eclipse.jdt#core;3.1.1!core.jar: /home/jenkins/.ivy2/cache/org.eclipse.jdt/core/jars/core-3.1.1.jar.part
(No such file or directory) (133ms)
[ivy:resolve] 		[FAILED     ] ant#ant;1.6.5!ant.jar: impossible to move part file to definitive
one: /home/jenkins/.ivy2/cache/ant/ant/jars/ant-1.6.5.jar.part -> /home/jenkins/.ivy2/cache/ant/ant/jars/ant-1.6.5.jar
(43ms)
[ivy:resolve] 		[FAILED     ] org.slf4j#slf4j-api;1.5.2!slf4j-api.jar: /home/jenkins/.ivy2/cache/org.slf4j/slf4j-api/jars/slf4j-api-1.5.2.jar.part
(No such file or directory) (25ms)
[ivy:resolve] 		::::::::::::::::::::::::::::::::::::::::::::::
[ivy:resolve] 		::          UNRESOLVED DEPENDENCIES         ::
[ivy:resolve] 		::::::::::::::::::::::::::::::::::::::::::::::
[ivy:resolve] 		:: commons-logging#commons-logging;1.1.1: not found
[ivy:resolve] 		::::::::::::::::::::::::::::::::::::::::::::::
[ivy:resolve] 
[ivy:resolve] :: USE VERBOSE OR DEBUG MESSAGE LEVEL FOR MORE DETAILS

BUILD FAILED
<https://builds.apache.org/job/Hive-0.9.1-SNAPSHOT-h0.21/ws/hive/build.xml>:302: The
following error occurred while executing this line:
<https://builds.apache.org/job/Hive-0.9.1-SNAPSHOT-h0.21/ws/hive/build.xml>:152: The
following error occurred while executing this line:
<https://builds.apache.org/job/Hive-0.9.1-SNAPSHOT-h0.21/ws/hive/shims/build.xml>:85:
The following error occurred while executing this line:
<https://builds.apache.org/job/Hive-0.9.1-SNAPSHOT-h0.21/ws/hive/shims/build.xml>:88:
The following error occurred while executing this line:
<https://builds.apache.org/job/Hive-0.9.1-SNAPSHOT-h0.21/ws/hive/shims/build.xml>:60:
The following error occurred while executing this line:
<https://builds.apache.org/job/Hive-0.9.1-SNAPSHOT-h0.21/ws/hive/build-common.xml>:164:
impossible to resolve dependencies:
	resolve failed - see output for details

Total time: 59 seconds
Build step 'Invoke Ant' marked build as failure
Archiving artifacts
Recording test results

Mime
View raw message