hive-dev mailing list archives

Site index · List index
Message view « Date » · « Thread »
Top « Date » · « Thread »
From Apache Jenkins Server <jenk...@builds.apache.org>
Subject Build failed in Jenkins: Hive-0.9.1-SNAPSHOT-h0.21-keepgoing=false #190
Date Tue, 06 Nov 2012 16:01:25 GMT
See <https://builds.apache.org/job/Hive-0.9.1-SNAPSHOT-h0.21-keepgoing=false/190/>

------------------------------------------
[...truncated 5074 lines...]
A         ql/src/gen/thrift/gen-javabean/org/apache/hadoop/hive/ql/plan/api/QueryPlan.java
A         ql/src/gen/thrift/gen-javabean/org/apache/hadoop/hive/ql/plan/api/Adjacency.java
A         ql/src/gen/thrift/gen-javabean/org/apache/hadoop/hive/ql/plan/api/Graph.java
A         ql/src/gen/thrift/gen-javabean/org/apache/hadoop/hive/ql/plan/api/Task.java
A         ql/src/gen/thrift/gen-javabean/org/apache/hadoop/hive/ql/plan/api/AdjacencyType.java
A         ql/src/gen/thrift/gen-javabean/org/apache/hadoop/hive/ql/plan/api/Stage.java
A         ql/src/gen/thrift/gen-javabean/org/apache/hadoop/hive/ql/plan/api/TaskType.java
A         ql/src/gen/thrift/gen-javabean/org/apache/hadoop/hive/ql/plan/api/Query.java
A         ql/src/gen/thrift/gen-javabean/org/apache/hadoop/hive/ql/plan/api/StageType.java
A         ql/src/gen/thrift/gen-javabean/org/apache/hadoop/hive/ql/plan/api/NodeType.java
A         ql/src/gen/thrift/gen-javabean/org/apache/hadoop/hive/ql/plan/api/Operator.java
A         ql/src/gen/thrift/gen-javabean/org/apache/hadoop/hive/ql/plan/api/OperatorType.java
A         ql/src/gen/thrift/gen-php
A         ql/src/gen/thrift/gen-php/queryplan
A         ql/src/gen/thrift/gen-php/queryplan/queryplan_types.php
A         ql/src/gen-javabean
A         ql/src/gen-javabean/org
A         ql/src/gen-javabean/org/apache
A         ql/src/gen-javabean/org/apache/hadoop
A         ql/src/gen-javabean/org/apache/hadoop/hive
A         ql/src/gen-javabean/org/apache/hadoop/hive/ql
A         ql/src/gen-javabean/org/apache/hadoop/hive/ql/plan
A         ql/src/gen-javabean/org/apache/hadoop/hive/ql/plan/api
A         ql/src/gen-php
A         ql/build.xml
A         ql/if
A         ql/if/queryplan.thrift
A         pdk
A         pdk/ivy.xml
A         pdk/scripts
A         pdk/scripts/class-registration.xsl
A         pdk/scripts/build-plugin.xml
A         pdk/scripts/README
A         pdk/src
A         pdk/src/java
A         pdk/src/java/org
A         pdk/src/java/org/apache
A         pdk/src/java/org/apache/hive
A         pdk/src/java/org/apache/hive/pdk
A         pdk/src/java/org/apache/hive/pdk/FunctionExtractor.java
A         pdk/src/java/org/apache/hive/pdk/HivePdkUnitTest.java
A         pdk/src/java/org/apache/hive/pdk/HivePdkUnitTests.java
A         pdk/src/java/org/apache/hive/pdk/PluginTest.java
A         pdk/test-plugin
A         pdk/test-plugin/test
A         pdk/test-plugin/test/cleanup.sql
A         pdk/test-plugin/test/onerow.txt
A         pdk/test-plugin/test/setup.sql
A         pdk/test-plugin/src
A         pdk/test-plugin/src/org
A         pdk/test-plugin/src/org/apache
A         pdk/test-plugin/src/org/apache/hive
A         pdk/test-plugin/src/org/apache/hive/pdktest
A         pdk/test-plugin/src/org/apache/hive/pdktest/Rot13.java
A         pdk/test-plugin/build.xml
A         pdk/build.xml
A         build-offline.xml
 U        .
At revision 1406198
no change for http://svn.apache.org/repos/asf/hive/branches/branch-0.9 since the previous
build
[hive] $ /home/hudson/tools/ant/apache-ant-1.8.1/bin/ant -Dversion=0.9.1-SNAPSHOT very-clean
tar binary
Buildfile: /x1/jenkins/jenkins-slave/workspace/Hive-0.9.1-SNAPSHOT-h0.21-keepgoing=false/hive/build.xml

ivy-init-dirs:
     [echo] Project: hive
    [mkdir] Created dir: /x1/jenkins/jenkins-slave/workspace/Hive-0.9.1-SNAPSHOT-h0.21-keepgoing=false/hive/build/ivy
    [mkdir] Created dir: /x1/jenkins/jenkins-slave/workspace/Hive-0.9.1-SNAPSHOT-h0.21-keepgoing=false/hive/build/ivy/lib
    [mkdir] Created dir: /x1/jenkins/jenkins-slave/workspace/Hive-0.9.1-SNAPSHOT-h0.21-keepgoing=false/hive/build/ivy/report
    [mkdir] Created dir: /x1/jenkins/jenkins-slave/workspace/Hive-0.9.1-SNAPSHOT-h0.21-keepgoing=false/hive/build/ivy/maven

ivy-download:
     [echo] Project: hive
      [get] Getting: http://repo2.maven.org/maven2/org/apache/ivy/ivy/2.1.0/ivy-2.1.0.jar
      [get] To: /x1/jenkins/jenkins-slave/workspace/Hive-0.9.1-SNAPSHOT-h0.21-keepgoing=false/hive/build/ivy/lib/ivy-2.1.0.jar

ivy-probe-antlib:
     [echo] Project: hive

ivy-init-antlib:
     [echo] Project: hive

ivy-clean-cache:
[ivy:cleancache] :: Ivy 2.1.0 - 20090925235825 :: http://ant.apache.org/ivy/ ::
[ivy:cleancache] :: loading settings :: url = jar:file:/x1/jenkins/jenkins-slave/workspace/Hive-0.9.1-SNAPSHOT-h0.21-keepgoing=false/hive/build/ivy/lib/ivy-2.1.0.jar!/org/apache/ivy/core/settings/ivysettings.xml

clean:
     [echo] Project: hive

clean:
     [echo] Project: anttasks

clean:
     [echo] Project: shims

clean:
     [echo] Project: common

clean:
     [echo] Project: serde

clean:
     [echo] Project: metastore

clean:
     [echo] Project: ql

clean:
     [echo] Project: contrib

clean:
     [echo] Project: service

clean:
     [echo] Project: cli

clean:
     [echo] Project: jdbc

clean:
     [echo] Project: hwi

clean:
     [echo] Project: hbase-handler

clean:
     [echo] Project: pdk

clean:
     [echo] Project: builtins

clean:

clean:
     [echo] Project: odbc
     [exec] rm -rf /x1/jenkins/jenkins-slave/workspace/Hive-0.9.1-SNAPSHOT-h0.21-keepgoing=false/hive/build/odbc
/x1/jenkins/jenkins-slave/workspace/Hive-0.9.1-SNAPSHOT-h0.21-keepgoing=false/hive/build/service/objs
/x1/jenkins/jenkins-slave/workspace/Hive-0.9.1-SNAPSHOT-h0.21-keepgoing=false/hive/build/ql/objs
/x1/jenkins/jenkins-slave/workspace/Hive-0.9.1-SNAPSHOT-h0.21-keepgoing=false/hive/build/metastore/objs

clean-online:
     [echo] Project: hive
   [delete] Deleting directory /x1/jenkins/jenkins-slave/workspace/Hive-0.9.1-SNAPSHOT-h0.21-keepgoing=false/hive/build

clean-offline:

very-clean:

ivy-init-dirs:
     [echo] Project: hive
    [mkdir] Created dir: /x1/jenkins/jenkins-slave/workspace/Hive-0.9.1-SNAPSHOT-h0.21-keepgoing=false/hive/build/ivy
    [mkdir] Created dir: /x1/jenkins/jenkins-slave/workspace/Hive-0.9.1-SNAPSHOT-h0.21-keepgoing=false/hive/build/ivy/lib
    [mkdir] Created dir: /x1/jenkins/jenkins-slave/workspace/Hive-0.9.1-SNAPSHOT-h0.21-keepgoing=false/hive/build/ivy/report
    [mkdir] Created dir: /x1/jenkins/jenkins-slave/workspace/Hive-0.9.1-SNAPSHOT-h0.21-keepgoing=false/hive/build/ivy/maven

ivy-download:
     [echo] Project: hive
      [get] Getting: http://repo2.maven.org/maven2/org/apache/ivy/ivy/2.1.0/ivy-2.1.0.jar
      [get] To: /x1/jenkins/jenkins-slave/workspace/Hive-0.9.1-SNAPSHOT-h0.21-keepgoing=false/hive/build/ivy/lib/ivy-2.1.0.jar

ivy-probe-antlib:
     [echo] Project: hive

ivy-init-antlib:

compile-ant-tasks:
     [echo] Project: hive

create-dirs:
     [echo] Project: anttasks
    [mkdir] Created dir: /x1/jenkins/jenkins-slave/workspace/Hive-0.9.1-SNAPSHOT-h0.21-keepgoing=false/hive/build/anttasks
    [mkdir] Created dir: /x1/jenkins/jenkins-slave/workspace/Hive-0.9.1-SNAPSHOT-h0.21-keepgoing=false/hive/build/anttasks/classes
    [mkdir] Created dir: /x1/jenkins/jenkins-slave/workspace/Hive-0.9.1-SNAPSHOT-h0.21-keepgoing=false/hive/build/jexl/classes
    [mkdir] Created dir: /x1/jenkins/jenkins-slave/workspace/Hive-0.9.1-SNAPSHOT-h0.21-keepgoing=false/hive/build/hadoopcore
    [mkdir] Created dir: /x1/jenkins/jenkins-slave/workspace/Hive-0.9.1-SNAPSHOT-h0.21-keepgoing=false/hive/build/anttasks/test
    [mkdir] Created dir: /x1/jenkins/jenkins-slave/workspace/Hive-0.9.1-SNAPSHOT-h0.21-keepgoing=false/hive/build/anttasks/test/src
    [mkdir] Created dir: /x1/jenkins/jenkins-slave/workspace/Hive-0.9.1-SNAPSHOT-h0.21-keepgoing=false/hive/build/anttasks/test/classes
    [mkdir] Created dir: /x1/jenkins/jenkins-slave/workspace/Hive-0.9.1-SNAPSHOT-h0.21-keepgoing=false/hive/build/anttasks/test/resources
     [copy] Warning: /x1/jenkins/jenkins-slave/workspace/Hive-0.9.1-SNAPSHOT-h0.21-keepgoing=false/hive/ant/src/test/resources
does not exist.

init:
     [echo] Project: anttasks

ivy-init-settings:
     [echo] Project: anttasks

ivy-resolve:
     [echo] Project: anttasks
[ivy:resolve] :: loading settings :: file = /x1/jenkins/jenkins-slave/workspace/Hive-0.9.1-SNAPSHOT-h0.21-keepgoing=false/hive/ivy/ivysettings.xml
[ivy:resolve] downloading http://repo1.maven.org/maven2/commons-lang/commons-lang/2.4/commons-lang-2.4.jar
...
[ivy:resolve] ..................... (255kB)
[ivy:resolve] .. (0kB)
[ivy:resolve] 
[ivy:resolve] :: problems summary ::
[ivy:resolve] :::: WARNINGS
[ivy:resolve] 	problem while downloading module descriptor: http://repo1.maven.org/maven2/velocity/velocity/1.5/velocity-1.5.pom:
/home/jenkins/.ivy2/cache/velocity/velocity/ivy-1.5.xml.original.part (No such file or directory)
(104ms)
[ivy:resolve] 		module not found: velocity#velocity;1.5
[ivy:resolve] 	==== local: tried
[ivy:resolve] 	  /home/jenkins/.ivy2/local/velocity/velocity/1.5/ivys/ivy.xml
[ivy:resolve] 	  -- artifact velocity#velocity;1.5!velocity.jar:
[ivy:resolve] 	  /home/jenkins/.ivy2/local/velocity/velocity/1.5/jars/velocity.jar
[ivy:resolve] 	==== apache-snapshot: tried
[ivy:resolve] 	  https://repository.apache.org/content/repositories/snapshots/velocity/velocity/1.5/velocity-1.5.pom
[ivy:resolve] 	  -- artifact velocity#velocity;1.5!velocity.jar:
[ivy:resolve] 	  https://repository.apache.org/content/repositories/snapshots/velocity/velocity/1.5/velocity-1.5.jar
[ivy:resolve] 	==== maven2: tried
[ivy:resolve] 	  http://repo1.maven.org/maven2/velocity/velocity/1.5/velocity-1.5.pom
[ivy:resolve] 	==== datanucleus-repo: tried
[ivy:resolve] 	  -- artifact velocity#velocity;1.5!velocity.jar:
[ivy:resolve] 	  http://www.datanucleus.org/downloads/maven2/velocity/velocity/1.5/velocity-1.5.jar
[ivy:resolve] 	==== hadoop-source: tried
[ivy:resolve] 	  -- artifact velocity#velocity;1.5!velocity.jar:
[ivy:resolve] 	  http://mirror.facebook.net/facebook/hive-deps/hadoop/core/velocity-1.5/velocity-1.5.jar
[ivy:resolve] 	==== hadoop-source2: tried
[ivy:resolve] 	  -- artifact velocity#velocity;1.5!velocity.jar:
[ivy:resolve] 	  http://archive.cloudera.com/hive-deps/hadoop/core/velocity-1.5/velocity-1.5.jar
[ivy:resolve] 		[FAILED     ] commons-lang#commons-lang;2.4!commons-lang.jar: invalid sha1:
expected=16313e02a793435009f1e458fa4af5d879f6fb11 computed=8e4973d2dd93303db1db6f5da5d2a69fdc4ad151
(331ms)
[ivy:resolve] 		[FAILED     ] commons-lang#commons-lang;2.4!commons-lang.jar:  (0ms)
[ivy:resolve] 	==== local: tried
[ivy:resolve] 	  /home/jenkins/.ivy2/local/commons-lang/commons-lang/2.4/jars/commons-lang.jar
[ivy:resolve] 	==== apache-snapshot: tried
[ivy:resolve] 	  https://repository.apache.org/content/repositories/snapshots/commons-lang/commons-lang/2.4/commons-lang-2.4.jar
[ivy:resolve] 	==== maven2: tried
[ivy:resolve] 	  http://repo1.maven.org/maven2/commons-lang/commons-lang/2.4/commons-lang-2.4.jar
[ivy:resolve] 	==== datanucleus-repo: tried
[ivy:resolve] 	  http://www.datanucleus.org/downloads/maven2/commons-lang/commons-lang/2.4/commons-lang-2.4.jar
[ivy:resolve] 	==== hadoop-source: tried
[ivy:resolve] 	  http://mirror.facebook.net/facebook/hive-deps/hadoop/core/commons-lang-2.4/commons-lang-2.4.jar
[ivy:resolve] 	==== hadoop-source2: tried
[ivy:resolve] 	  http://archive.cloudera.com/hive-deps/hadoop/core/commons-lang-2.4/commons-lang-2.4.jar
[ivy:resolve] 		::::::::::::::::::::::::::::::::::::::::::::::
[ivy:resolve] 		::          UNRESOLVED DEPENDENCIES         ::
[ivy:resolve] 		::::::::::::::::::::::::::::::::::::::::::::::
[ivy:resolve] 		:: velocity#velocity;1.5: not found
[ivy:resolve] 		::::::::::::::::::::::::::::::::::::::::::::::
[ivy:resolve] 		::::::::::::::::::::::::::::::::::::::::::::::
[ivy:resolve] 		::              FAILED DOWNLOADS            ::
[ivy:resolve] 		:: ^ see resolution messages for details  ^ ::
[ivy:resolve] 		::::::::::::::::::::::::::::::::::::::::::::::
[ivy:resolve] 		:: commons-lang#commons-lang;2.4!commons-lang.jar
[ivy:resolve] 		::::::::::::::::::::::::::::::::::::::::::::::
[ivy:resolve] 
[ivy:resolve] :: USE VERBOSE OR DEBUG MESSAGE LEVEL FOR MORE DETAILS

BUILD FAILED
/x1/jenkins/jenkins-slave/workspace/Hive-0.9.1-SNAPSHOT-h0.21-keepgoing=false/hive/build.xml:256:
The following error occurred while executing this line:
/x1/jenkins/jenkins-slave/workspace/Hive-0.9.1-SNAPSHOT-h0.21-keepgoing=false/hive/build-common.xml:125:
impossible to resolve dependencies:
	resolve failed - see output for details

Total time: 7 seconds
Build step 'Invoke Ant' marked build as failure
Archiving artifacts
Recording test results

Mime
View raw message